FailedOk

th/SRPMS[OK]
th/x32[OK]
th/i686[OK]
th/x86_64[OK]

ac/SRPMS[OK]
ac/i386[OK]
ac/i586[OK]
ac/i686[OK]
ac/alpha[OK]
ac/amd64[OK]
ac/athlon[OK]
ac/ppc[OK]
ac/sparc[OK]
ac/sparc64[OK]

Advanced Search
main()
Powered by PLD Linux
(c) 2002-2018 PLD Team
$Revision: 1.37 $
Powered by The Right Thing.
Your IP: 52.91.185.49

smalltalk bc87345e-f52a-45c7-97a3-6f77c30116f0

Status:Failed
Source URL:ftp://buildlogs.pld-linux.org/th/x32/FAIL/smalltalk,bc87345e-f52a-45c7-97a3-6f77c30116f0.bz2
text/plain URL:View!
full text:View!
rpm -qa of builder:View!
Date:2018/07/07 11:54:20
Runtime:0:00:59.954978

Toc:

  • error 1
  • interp.inl:142: Error: incorrect register `%eax' used with `q' suffix
  • error 2
  • interp.inl:120: Error: incorrect register `%eax' used with `q' suffix
  • error 3
  • interp.inl:142: Error: incorrect register `%eax' used with `q' suffix
  • error 4
  • interp.inl:120: Error: incorrect register `%eax' used with `q' suffix
  • error 5
  • interp.inl:120: Error: incorrect register `%eax' used with `q' suffix
  • error 6
  • interp.inl:142: Error: incorrect register `%eax' used with `q' suffix
  • error 7
  • interp.inl:120: Error: incorrect register `%eax' used with `q' suffix
  • error 8
  • interp.inl:120: Error: incorrect register `%eax' used with `q' suffix
  • error 9
  • interp.inl:142: Error: incorrect register `%eax' used with `q' suffix
  • error 10
  • interp.inl:120: Error: incorrect register `%eax' used with `q' suffix
  • error 11
  • interp.inl:142: Error: incorrect register `%eax' used with `q' suffix
  • error 12
  • interp.inl:120: Error: incorrect register `%eax' used with `q' suffix
  • error 13
  • make[3]: *** [Makefile:623: interp.lo] Error 1
  • error 14
  • make[2]: *** [Makefile:487: all] Error 2
  • error 15
  • make[1]: *** [Makefile:968: all-recursive] Error 1
  • error 16
  • error: Bad exit status from /tmp/B.H5moJ5/BUILD/tmp/rpm-tmp.93742 (%build)
  • error 17
  • RPM build errors:
  • error 18
  • error: No files produced.

Content:

       ^~~~
In file included from interp.c:677:0:
prims.def: In function 'VMpr_Character_create':
prims.def:3438:7: warning: variable 'oop1' set but not used [-Wunused-but-set-variable]
   OOP oop1;
       ^~~~
In file included from interp.c:677:0:
prims.def: In function 'VMpr_UnicodeCharacter_create':
prims.def:3462:7: warning: variable 'oop1' set but not used [-Wunused-but-set-variable]
   OOP oop1;
       ^~~~
In file included from interp.c:677:0:
prims.def: In function 'VMpr_Memory_addressOfOOP':
prims.def:3535:7: warning: variable 'oop1' set but not used [-Wunused-but-set-variable]
   OOP oop1;
       ^~~~
In file included from interp.c:677:0:
prims.def: In function 'VMpr_Memory_addressOf':
prims.def:3553:7: warning: variable 'oop1' set but not used [-Wunused-but-set-variable]
   OOP oop1;
       ^~~~
In file included from interp.c:677:0:
prims.def: In function 'VMpr_Memory_at':
prims.def:3637:7: warning: variable 'oop1' set but not used [-Wunused-but-set-variable]
   OOP oop1;
       ^~~~
In file included from interp.c:677:0:
prims.def: In function 'VMpr_ByteArray_fromCData_size':
prims.def:5031:7: warning: variable 'oop1' set but not used [-Wunused-but-set-variable]
   OOP oop1;
       ^~~~
In file included from interp.c:677:0:
prims.def: In function 'VMpr_String_fromCData_size':
prims.def:5054:7: warning: variable 'oop1' set but not used [-Wunused-but-set-variable]
   OOP oop1;
       ^~~~
In file included from interp.c:677:0:
prims.def: In function 'VMpr_String_fromCData':
prims.def:5077:7: warning: variable 'oop1' set but not used [-Wunused-but-set-variable]
   OOP oop1;
       ^~~~
In file included from interp.c:677:0:
prims.def: In function 'VMpr_FileDescriptor_socketOp':
prims.def:5871:6: warning: unused variable 'result' [-Wunused-variable]
  int result;
      ^~~~~~
In file included from interp-bc.inl:503:0,
                 from interp.c:682:
vm.inl: In function '_gst_interpret':
vm.inl:1488:9: warning: variable '_stack0' set but not used [-Wunused-but-set-variable]
     OOP _stack0, _stack1;
         ^~~~~~~
In file included from interp-bc.inl:503:0,
                 from interp.c:682:
vm.inl:2355:9: warning: variable '_stack0' set but not used [-Wunused-but-set-variable]
     OOP _stack0;
         ^~~~~~~
In file included from interp-bc.inl:503:0,
                 from interp.c:682:
vm.inl:2936:9: warning: variable '_stack0' set but not used [-Wunused-but-set-variable]
     OOP _stack0;
         ^~~~~~~
In file included from interp-bc.inl:503:0,
                 from interp.c:682:
vm.inl:4523:9: warning: variable '_stack0' set but not used [-Wunused-but-set-variable]
     OOP _stack0;
         ^~~~~~~
In file included from interp-bc.inl:503:0,
                 from interp.c:682:
vm.inl:4761:9: warning: variable '_stack0' set but not used [-Wunused-but-set-variable]
     OOP _stack0;
         ^~~~~~~
In file included from interp-bc.inl:503:0,
                 from interp.c:682:
vm.inl:6156:9: warning: variable '_stack0' set but not used [-Wunused-but-set-variable]
     OOP _stack0;
         ^~~~~~~
In file included from interp-bc.inl:503:0,
                 from interp.c:682:
vm.inl:10338:9: warning: variable '_stack0' set but not used [-Wunused-but-set-variable]
     OOP _stack0;
         ^~~~~~~
interp.c: In function 'resume_process':
interp.c:1730:15: warning: variable 'ints_enabled' set but not used [-Wunused-but-set-variable]
   mst_Boolean ints_enabled;
               ^~~~~~~~~~~~
At top level:
interp.c:1016:1: warning: always_inline function might not be inlinable [-Wattributes]
 unwind_context (void)
 ^~~~~~~~~~~~~~
In file included from interp.c:677:0:
prims.def: In function 'VMpr_FileDescriptor_fileOp':
prims.def:5757:2: warning: ignoring return value of 'ftruncate', declared with attribute warn_unused_result [-Wunused-result]
  ftruncate (fd, pos);
  ^~~~~~~~~~~~~~~~~~~
prims.def:5819:4: warning: ignoring return value of 'write', declared with attribute warn_unused_result [-Wunused-result]
    write (fd, buf, 0);
    ^~~~~~~~~~~~~~~~~~
interp.inl: Assembler messages:
interp.inl:142: Error: incorrect register `%eax' used with `q' suffix
interp.inl:120: Error: incorrect register `%eax' used with `q' suffix
interp.c: In function '_gst_empty_context_pool':
interp.c:698:22: warning: array subscript is below array bounds [-Warray-bounds]
       chunk = chunks - 1;
               ~~~~~~~^~~
interp.inl:142: Error: incorrect register `%eax' used with `q' suffix
interp.inl:120: Error: incorrect register `%eax' used with `q' suffix
interp.inl:120: Error: incorrect register `%eax' used with `q' suffix
interp.inl:142: Error: incorrect register `%eax' used with `q' suffix
interp.inl:120: Error: incorrect register `%eax' used with `q' suffix
interp.inl:120: Error: incorrect register `%eax' used with `q' suffix
interp.inl:142: Error: incorrect register `%eax' used with `q' suffix
interp.inl:120: Error: incorrect register `%eax' used with `q' suffix
interp.inl:142: Error: incorrect register `%eax' used with `q' suffix
interp.inl:120: Error: incorrect register `%eax' used with `q' suffix
make[3]: *** [Makefile:623: interp.lo] Error 1
make[3]: Leaving directory '/tmp/B.H5moJ5/BUILD/smalltalk-3.2.5/libgst'
make[2]: *** [Makefile:487: all] Error 2
make[1]: *** [Makefile:968: all-recursive] Error 1
make: *** [Makefile:584: all] Error 2
error: Bad exit status from /tmp/B.H5moJ5/BUILD/tmp/rpm-tmp.93742 (%build)


RPM build errors:
    Bad exit status from /tmp/B.H5moJ5/BUILD/tmp/rpm-tmp.93742 (%build)
ended at: Sat Jul  7 11:54:19 2018, done in 0:00:59.954978
error: No files produced.
+ chmod -R u+rwX /tmp/B.H5moJ5/BUILD
+ rm -rf /tmp/B.H5moJ5/tmp /tmp/B.H5moJ5/BUILD
+ rm -rf /tmp/B.H5moJ5
Begin-PLD-Builder-Info
Build-Time: user:137.29s sys:27.81s real:73.64s (faults io:0 non-io:2927560)

End-PLD-Builder-Info
[Back to list of logs] [View rpm -qa of builder]