FailedOk

th/SRPMS[OK]
th/x32[OK]
th/i686[OK]
th/x86_64[OK]

ac/SRPMS[OK]
ac/i386[OK]
ac/i586[OK]
ac/i686[OK]
ac/alpha[OK]
ac/amd64[OK]
ac/athlon[OK]
ac/ppc[OK]
ac/sparc[OK]
ac/sparc64[OK]

Advanced Search
main()
Powered by PLD Linux
(c) 2002-2019 PLD Team
$Revision: 1.37 $
Powered by PDP-11.
Your IP: 52.55.186.225

systemd 34bf17a5-ccfb-406a-a73e-0496fde5f0c9

Status:Failed
Source URL:ftp://buildlogs.pld-linux.org/th/x32/FAIL/systemd,34bf17a5-ccfb-406a-a73e-0496fde5f0c9.bz2
text/plain URL:View!
full text:View!
rpm -qa of builder:View!
Date:2019/02/08 22:28:21
Runtime:0:00:29.099657

Toc:

  • error 1
  • collect2: error: ld returned 1 exit status
  • error 2
  • error: Bad exit status from /tmp/B.esxPMU/BUILD/tmp/rpm-tmp.46174 (%build)
  • error 3
  • RPM build errors:
  • error 4
  • error: No files produced.

Content:

[260/1560] x86_64-pld-linux-gnux32-gcc -Ijournal-core@sta -I. -I.. -Isrc/basic -I../src/basic -Isrc/shared -I../src/shared -Isrc/systemd -I../src/systemd -Isrc/journal -I../src/journal -Isrc/journal-remote -I../src/journal-remote -Isrc/nspawn -I../src/nspawn -Isrc/resolve -I../src/resolve -Isrc/timesync -I../src/timesync -I../src/time-wait-sync -Isrc/login -I../src/login -Isrc/udev -I../src/udev -Isrc/libudev -I../src/libudev -Isrc/core -I../src/core -I../src/libsystemd/sd-bus -I../src/libsystemd/sd-device -I../src/libsystemd/sd-hwdb -I../src/libsystemd/sd-id128 -I../src/libsystemd/sd-netlink -I../src/libsystemd/sd-network -Isrc/libsystemd-network -I../src/libsystemd-network -I../ -fdiagnostics-color=always -pipe -D_FILE_OFFSET_BITS=64 -std=gnu99 -Wextra -Werror=undef -Wlogical-op -Wmissing-include-dirs -Wold-style-definition -Wpointer-arith -Winit-self -Wfloat-equal -Wsuggest-attribute=noreturn -Werror=missing-prototypes -Werror=implicit-function-declaration -Werror=missing-declarations -Werror=return-type -Werror=incompatible-pointer-types -Werror=format=2 -Wstrict-prototypes -Wredundant-decls -Wmissing-noreturn -Wimplicit-fallthrough=5 -Wshadow -Wendif-labels -Wstrict-aliasing=2 -Wwrite-strings -Werror=overflow -Werror=shift-count-overflow -Werror=shift-overflow=2 -Wdate-time -Wnested-externs -ffast-math -fno-common -fdiagnostics-show-option -fno-strict-aliasing -fvisibility=hidden -fstack-protector -fstack-protector-strong --param=ssp-buffer-size=4 -fPIE -ffunction-sections -fdata-sections -Wno-unused-parameter -Wno-missing-field-initializers -Wno-unused-result -Wno-format-signedness -Wno-error=nonnull -Werror=shadow -include config.h -O2 -fwrapv -Wformat -Werror=format-security -gdwarf-4 -fno-debug-types-section -fvar-tracking-assignments -g2 -Wp,-D_FORTIFY_SOURCE=2 -fstack-protector-strong --param=ssp-buffer-size=4 -fPIC -mtune=generic -march=x86-64 -gdwarf-4 -fno-debug-types-section -fvar-tracking-assignments -g2 -fPIC  -MD -MQ 'journal-core@sta/src_journal_journald-server.c.o' -MF 'journal-core@sta/src_journal_journald-server.c.o.d' -o 'journal-core@sta/src_journal_journald-server.c.o' -c ../src/journal/journald-server.c
../src/journal/journald-server.c: In function ‘cache_space_refresh’:
../src/journal/journald-server.c:124:28: warning: ‘vfs_avail’ may be used uninitialized in this function [-Wmaybe-uninitialized]
         uint64_t vfs_used, vfs_avail, avail;
                            ^~~~~~~~~
In file included from ../src/shared/acl-util.h:10,
                 from ../src/journal/journald-server.c:17:
../src/basic/macro.h:222:75: warning: ‘vfs_used’ may be used uninitialized in this function [-Wmaybe-uninitialized]
                 UNIQ_T(A,aq) > UNIQ_T(B,bq) ? UNIQ_T(A,aq) - UNIQ_T(B,bq) : 0; \
                                                                           ^
../src/journal/journald-server.c:124:18: note: ‘vfs_used’ was declared here
         uint64_t vfs_used, vfs_avail, avail;
                  ^~~~~~~~
[261/1560] x86_64-pld-linux-gnux32-gcc -Isrc/shared/src@shared@@systemd-shared-239@sta -Isrc/shared -I../src/shared -Isrc/basic -I../src/basic -Isrc/systemd -I../src/systemd -Isrc/journal -I../src/journal -Isrc/journal-remote -I../src/journal-remote -Isrc/nspawn -I../src/nspawn -Isrc/resolve -I../src/resolve -Isrc/timesync -I../src/timesync -I../src/time-wait-sync -Isrc/login -I../src/login -Isrc/udev -I../src/udev -Isrc/libudev -I../src/libudev -Isrc/core -I../src/core -I../src/libsystemd/sd-bus -I../src/libsystemd/sd-device -I../src/libsystemd/sd-hwdb -I../src/libsystemd/sd-id128 -I../src/libsystemd/sd-netlink -I../src/libsystemd/sd-network -Isrc/libsystemd-network -I../src/libsystemd-network -I. -I../ -I/usr/include/blkid -I/usr/include/uuid -fdiagnostics-color=always -pipe -D_FILE_OFFSET_BITS=64 -std=gnu99 -Wextra -Werror=undef -Wlogical-op -Wmissing-include-dirs -Wold-style-definition -Wpointer-arith -Winit-self -Wfloat-equal -Wsuggest-attribute=noreturn -Werror=missing-prototypes -Werror=implicit-function-declaration -Werror=missing-declarations -Werror=return-type -Werror=incompatible-pointer-types -Werror=format=2 -Wstrict-prototypes -Wredundant-decls -Wmissing-noreturn -Wimplicit-fallthrough=5 -Wshadow -Wendif-labels -Wstrict-aliasing=2 -Wwrite-strings -Werror=overflow -Werror=shift-count-overflow -Werror=shift-overflow=2 -Wdate-time -Wnested-externs -ffast-math -fno-common -fdiagnostics-show-option -fno-strict-aliasing -fvisibility=hidden -fstack-protector -fstack-protector-strong --param=ssp-buffer-size=4 -fPIE -ffunction-sections -fdata-sections -Wno-unused-parameter -Wno-missing-field-initializers -Wno-unused-result -Wno-format-signedness -Wno-error=nonnull -Werror=shadow -include config.h -O2 -fwrapv -Wformat -Werror=format-security -gdwarf-4 -fno-debug-types-section -fvar-tracking-assignments -g2 -Wp,-D_FORTIFY_SOURCE=2 -fstack-protector-strong --param=ssp-buffer-size=4 -fPIC -mtune=generic -march=x86-64 -gdwarf-4 -fno-debug-types-section -fvar-tracking-assignments -g2 -fPIC -pthread -fvisibility=default  -MD -MQ 'src/shared/src@shared@@systemd-shared-239@sta/fdset.c.o' -MF 'src/shared/src@shared@@systemd-shared-239@sta/fdset.c.o.d' -o 'src/shared/src@shared@@systemd-shared-239@sta/fdset.c.o' -c ../src/shared/fdset.c
[262/1560] x86_64-pld-linux-gnux32-gcc -Isrc/shared/src@shared@@systemd-shared-239@sta -Isrc/shared -I../src/shared -Isrc/basic -I../src/basic -Isrc/systemd -I../src/systemd -Isrc/journal -I../src/journal -Isrc/journal-remote -I../src/journal-remote -Isrc/nspawn -I../src/nspawn -Isrc/resolve -I../src/resolve -Isrc/timesync -I../src/timesync -I../src/time-wait-sync -Isrc/login -I../src/login -Isrc/udev -I../src/udev -Isrc/libudev -I../src/libudev -Isrc/core -I../src/core -I../src/libsystemd/sd-bus -I../src/libsystemd/sd-device -I../src/libsystemd/sd-hwdb -I../src/libsystemd/sd-id128 -I../src/libsystemd/sd-netlink -I../src/libsystemd/sd-network -Isrc/libsystemd-network -I../src/libsystemd-network -I. -I../ -I/usr/include/blkid -I/usr/include/uuid -fdiagnostics-color=always -pipe -D_FILE_OFFSET_BITS=64 -std=gnu99 -Wextra -Werror=undef -Wlogical-op -Wmissing-include-dirs -Wold-style-definition -Wpointer-arith -Winit-self -Wfloat-equal -Wsuggest-attribute=noreturn -Werror=missing-prototypes -Werror=implicit-function-declaration -Werror=missing-declarations -Werror=return-type -Werror=incompatible-pointer-types -Werror=format=2 -Wstrict-prototypes -Wredundant-decls -Wmissing-noreturn -Wimplicit-fallthrough=5 -Wshadow -Wendif-labels -Wstrict-aliasing=2 -Wwrite-strings -Werror=overflow -Werror=shift-count-overflow -Werror=shift-overflow=2 -Wdate-time -Wnested-externs -ffast-math -fno-common -fdiagnostics-show-option -fno-strict-aliasing -fvisibility=hidden -fstack-protector -fstack-protector-strong --param=ssp-buffer-size=4 -fPIE -ffunction-sections -fdata-sections -Wno-unused-parameter -Wno-missing-field-initializers -Wno-unused-result -Wno-format-signedness -Wno-error=nonnull -Werror=shadow -include config.h -O2 -fwrapv -Wformat -Werror=format-security -gdwarf-4 -fno-debug-types-section -fvar-tracking-assignments -g2 -Wp,-D_FORTIFY_SOURCE=2 -fstack-protector-strong --param=ssp-buffer-size=4 -fPIC -mtune=generic -march=x86-64 -gdwarf-4 -fno-debug-types-section -fvar-tracking-assignments -g2 -fPIC -pthread -fvisibility=default  -MD -MQ 'src/shared/src@shared@@systemd-shared-239@sta/fstab-util.c.o' -MF 'src/shared/src@shared@@systemd-shared-239@sta/fstab-util.c.o.d' -o 'src/shared/src@shared@@systemd-shared-239@sta/fstab-util.c.o' -c ../src/shared/fstab-util.c
[263/1560] rm -f libjournal-core.a && gcc-ar csrD libjournal-core.a 'journal-core@sta/meson-generated_.._src_journal_journald-gperf.c.o' 'journal-core@sta/src_journal_journald-audit.c.o' 'journal-core@sta/src_journal_journald-console.c.o' 'journal-core@sta/src_journal_journald-context.c.o' 'journal-core@sta/src_journal_journald-kmsg.c.o' 'journal-core@sta/src_journal_journald-native.c.o' 'journal-core@sta/src_journal_journald-rate-limit.c.o' 'journal-core@sta/src_journal_journald-server.c.o' 'journal-core@sta/src_journal_journald-stream.c.o' 'journal-core@sta/src_journal_journald-syslog.c.o' 'journal-core@sta/src_journal_journald-wall.c.o'
[264/1560] x86_64-pld-linux-gnux32-gcc -Isrc/journal/src@journal@@journal-client@sta -Isrc/journal -I../src/journal -Isrc/basic -I../src/basic -Isrc/shared -I../src/shared -Isrc/systemd -I../src/systemd -Isrc/journal-remote -I../src/journal-remote -Isrc/nspawn -I../src/nspawn -Isrc/resolve -I../src/resolve -Isrc/timesync -I../src/timesync -I../src/time-wait-sync -Isrc/login -I../src/login -Isrc/udev -I../src/udev -Isrc/libudev -I../src/libudev -Isrc/core -I../src/core -I../src/libsystemd/sd-bus -I../src/libsystemd/sd-device -I../src/libsystemd/sd-hwdb -I../src/libsystemd/sd-id128 -I../src/libsystemd/sd-netlink -I../src/libsystemd/sd-network -Isrc/libsystemd-network -I../src/libsystemd-network -I. -I../ -fdiagnostics-color=always -pipe -D_FILE_OFFSET_BITS=64 -std=gnu99 -Wextra -Werror=undef -Wlogical-op -Wmissing-include-dirs -Wold-style-definition -Wpointer-arith -Winit-self -Wfloat-equal -Wsuggest-attribute=noreturn -Werror=missing-prototypes -Werror=implicit-function-declaration -Werror=missing-declarations -Werror=return-type -Werror=incompatible-pointer-types -Werror=format=2 -Wstrict-prototypes -Wredundant-decls -Wmissing-noreturn -Wimplicit-fallthrough=5 -Wshadow -Wendif-labels -Wstrict-aliasing=2 -Wwrite-strings -Werror=overflow -Werror=shift-count-overflow -Werror=shift-overflow=2 -Wdate-time -Wnested-externs -ffast-math -fno-common -fdiagnostics-show-option -fno-strict-aliasing -fvisibility=hidden -fstack-protector -fstack-protector-strong --param=ssp-buffer-size=4 -fPIE -ffunction-sections -fdata-sections -Wno-unused-parameter -Wno-missing-field-initializers -Wno-unused-result -Wno-format-signedness -Wno-error=nonnull -Werror=shadow -include config.h -O2 -fwrapv -Wformat -Werror=format-security -gdwarf-4 -fno-debug-types-section -fvar-tracking-assignments -g2 -Wp,-D_FORTIFY_SOURCE=2 -fstack-protector-strong --param=ssp-buffer-size=4 -fPIC -mtune=generic -march=x86-64 -gdwarf-4 -fno-debug-types-section -fvar-tracking-assignments -g2 -fPIC -fvisibility=default  -MD -MQ 'src/journal/src@journal@@journal-client@sta/sd-journal.c.o' -MF 'src/journal/src@journal@@journal-client@sta/sd-journal.c.o.d' -o 'src/journal/src@journal@@journal-client@sta/sd-journal.c.o' -c ../src/journal/sd-journal.c
[265/1560] rm -f src/journal/libjournal-client.a && gcc-ar csrD src/journal/libjournal-client.a 'src/journal/src@journal@@journal-client@sta/audit-type.c.o' 'src/journal/src@journal@@journal-client@sta/catalog.c.o' 'src/journal/src@journal@@journal-client@sta/compress.c.o' 'src/journal/src@journal@@journal-client@sta/journal-file.c.o' 'src/journal/src@journal@@journal-client@sta/journal-send.c.o' 'src/journal/src@journal@@journal-client@sta/journal-vacuum.c.o' 'src/journal/src@journal@@journal-client@sta/journal-verify.c.o' 'src/journal/src@journal@@journal-client@sta/lookup3.c.o' 'src/journal/src@journal@@journal-client@sta/mmap-cache.c.o' 'src/journal/src@journal@@journal-client@sta/sd-journal.c.o' 'src/journal/src@journal@@journal-client@sta/journal-authenticate.c.o' 'src/journal/src@journal@@journal-client@sta/fsprg.c.o'
[266/1560] x86_64-pld-linux-gnux32-gcc -Isrc/shared/src@shared@@systemd-shared-239@sta -Isrc/shared -I../src/shared -Isrc/basic -I../src/basic -Isrc/systemd -I../src/systemd -Isrc/journal -I../src/journal -Isrc/journal-remote -I../src/journal-remote -Isrc/nspawn -I../src/nspawn -Isrc/resolve -I../src/resolve -Isrc/timesync -I../src/timesync -I../src/time-wait-sync -Isrc/login -I../src/login -Isrc/udev -I../src/udev -Isrc/libudev -I../src/libudev -Isrc/core -I../src/core -I../src/libsystemd/sd-bus -I../src/libsystemd/sd-device -I../src/libsystemd/sd-hwdb -I../src/libsystemd/sd-id128 -I../src/libsystemd/sd-netlink -I../src/libsystemd/sd-network -Isrc/libsystemd-network -I../src/libsystemd-network -I. -I../ -I/usr/include/blkid -I/usr/include/uuid -fdiagnostics-color=always -pipe -D_FILE_OFFSET_BITS=64 -std=gnu99 -Wextra -Werror=undef -Wlogical-op -Wmissing-include-dirs -Wold-style-definition -Wpointer-arith -Winit-self -Wfloat-equal -Wsuggest-attribute=noreturn -Werror=missing-prototypes -Werror=implicit-function-declaration -Werror=missing-declarations -Werror=return-type -Werror=incompatible-pointer-types -Werror=format=2 -Wstrict-prototypes -Wredundant-decls -Wmissing-noreturn -Wimplicit-fallthrough=5 -Wshadow -Wendif-labels -Wstrict-aliasing=2 -Wwrite-strings -Werror=overflow -Werror=shift-count-overflow -Werror=shift-overflow=2 -Wdate-time -Wnested-externs -ffast-math -fno-common -fdiagnostics-show-option -fno-strict-aliasing -fvisibility=hidden -fstack-protector -fstack-protector-strong --param=ssp-buffer-size=4 -fPIE -ffunction-sections -fdata-sections -Wno-unused-parameter -Wno-missing-field-initializers -Wno-unused-result -Wno-format-signedness -Wno-error=nonnull -Werror=shadow -include config.h -O2 -fwrapv -Wformat -Werror=format-security -gdwarf-4 -fno-debug-types-section -fvar-tracking-assignments -g2 -Wp,-D_FORTIFY_SOURCE=2 -fstack-protector-strong --param=ssp-buffer-size=4 -fPIC -mtune=generic -march=x86-64 -gdwarf-4 -fno-debug-types-section -fvar-tracking-assignments -g2 -fPIC -pthread -fvisibility=default  -MD -MQ 'src/shared/src@shared@@systemd-shared-239@sta/cgroup-show.c.o' -MF 'src/shared/src@shared@@systemd-shared-239@sta/cgroup-show.c.o.d' -o 'src/shared/src@shared@@systemd-shared-239@sta/cgroup-show.c.o' -c ../src/shared/cgroup-show.c
[267/1560] x86_64-pld-linux-gnux32-gcc -Isrc/shared/src@shared@@systemd-shared-239@sta -Isrc/shared -I../src/shared -Isrc/basic -I../src/basic -Isrc/systemd -I../src/systemd -Isrc/journal -I../src/journal -Isrc/journal-remote -I../src/journal-remote -Isrc/nspawn -I../src/nspawn -Isrc/resolve -I../src/resolve -Isrc/timesync -I../src/timesync -I../src/time-wait-sync -Isrc/login -I../src/login -Isrc/udev -I../src/udev -Isrc/libudev -I../src/libudev -Isrc/core -I../src/core -I../src/libsystemd/sd-bus -I../src/libsystemd/sd-device -I../src/libsystemd/sd-hwdb -I../src/libsystemd/sd-id128 -I../src/libsystemd/sd-netlink -I../src/libsystemd/sd-network -Isrc/libsystemd-network -I../src/libsystemd-network -I. -I../ -I/usr/include/blkid -I/usr/include/uuid -fdiagnostics-color=always -pipe -D_FILE_OFFSET_BITS=64 -std=gnu99 -Wextra -Werror=undef -Wlogical-op -Wmissing-include-dirs -Wold-style-definition -Wpointer-arith -Winit-self -Wfloat-equal -Wsuggest-attribute=noreturn -Werror=missing-prototypes -Werror=implicit-function-declaration -Werror=missing-declarations -Werror=return-type -Werror=incompatible-pointer-types -Werror=format=2 -Wstrict-prototypes -Wredundant-decls -Wmissing-noreturn -Wimplicit-fallthrough=5 -Wshadow -Wendif-labels -Wstrict-aliasing=2 -Wwrite-strings -Werror=overflow -Werror=shift-count-overflow -Werror=shift-overflow=2 -Wdate-time -Wnested-externs -ffast-math -fno-common -fdiagnostics-show-option -fno-strict-aliasing -fvisibility=hidden -fstack-protector -fstack-protector-strong --param=ssp-buffer-size=4 -fPIE -ffunction-sections -fdata-sections -Wno-unused-parameter -Wno-missing-field-initializers -Wno-unused-result -Wno-format-signedness -Wno-error=nonnull -Werror=shadow -include config.h -O2 -fwrapv -Wformat -Werror=format-security -gdwarf-4 -fno-debug-types-section -fvar-tracking-assignments -g2 -Wp,-D_FORTIFY_SOURCE=2 -fstack-protector-strong --param=ssp-buffer-size=4 -fPIC -mtune=generic -march=x86-64 -gdwarf-4 -fno-debug-types-section -fvar-tracking-assignments -g2 -fPIC -pthread -fvisibility=default  -MD -MQ 'src/shared/src@shared@@systemd-shared-239@sta/clean-ipc.c.o' -MF 'src/shared/src@shared@@systemd-shared-239@sta/clean-ipc.c.o.d' -o 'src/shared/src@shared@@systemd-shared-239@sta/clean-ipc.c.o' -c ../src/shared/clean-ipc.c
[268/1560] x86_64-pld-linux-gnux32-gcc -Isrc/shared/src@shared@@systemd-shared-239@sta -Isrc/shared -I../src/shared -Isrc/basic -I../src/basic -Isrc/systemd -I../src/systemd -Isrc/journal -I../src/journal -Isrc/journal-remote -I../src/journal-remote -Isrc/nspawn -I../src/nspawn -Isrc/resolve -I../src/resolve -Isrc/timesync -I../src/timesync -I../src/time-wait-sync -Isrc/login -I../src/login -Isrc/udev -I../src/udev -Isrc/libudev -I../src/libudev -Isrc/core -I../src/core -I../src/libsystemd/sd-bus -I../src/libsystemd/sd-device -I../src/libsystemd/sd-hwdb -I../src/libsystemd/sd-id128 -I../src/libsystemd/sd-netlink -I../src/libsystemd/sd-network -Isrc/libsystemd-network -I../src/libsystemd-network -I. -I../ -I/usr/include/blkid -I/usr/include/uuid -fdiagnostics-color=always -pipe -D_FILE_OFFSET_BITS=64 -std=gnu99 -Wextra -Werror=undef -Wlogical-op -Wmissing-include-dirs -Wold-style-definition -Wpointer-arith -Winit-self -Wfloat-equal -Wsuggest-attribute=noreturn -Werror=missing-prototypes -Werror=implicit-function-declaration -Werror=missing-declarations -Werror=return-type -Werror=incompatible-pointer-types -Werror=format=2 -Wstrict-prototypes -Wredundant-decls -Wmissing-noreturn -Wimplicit-fallthrough=5 -Wshadow -Wendif-labels -Wstrict-aliasing=2 -Wwrite-strings -Werror=overflow -Werror=shift-count-overflow -Werror=shift-overflow=2 -Wdate-time -Wnested-externs -ffast-math -fno-common -fdiagnostics-show-option -fno-strict-aliasing -fvisibility=hidden -fstack-protector -fstack-protector-strong --param=ssp-buffer-size=4 -fPIE -ffunction-sections -fdata-sections -Wno-unused-parameter -Wno-missing-field-initializers -Wno-unused-result -Wno-format-signedness -Wno-error=nonnull -Werror=shadow -include config.h -O2 -fwrapv -Wformat -Werror=format-security -gdwarf-4 -fno-debug-types-section -fvar-tracking-assignments -g2 -Wp,-D_FORTIFY_SOURCE=2 -fstack-protector-strong --param=ssp-buffer-size=4 -fPIC -mtune=generic -march=x86-64 -gdwarf-4 -fno-debug-types-section -fvar-tracking-assignments -g2 -fPIC -pthread -fvisibility=default  -MD -MQ 'src/shared/src@shared@@systemd-shared-239@sta/ask-password-api.c.o' -MF 'src/shared/src@shared@@systemd-shared-239@sta/ask-password-api.c.o.d' -o 'src/shared/src@shared@@systemd-shared-239@sta/ask-password-api.c.o' -c ../src/shared/ask-password-api.c
[269/1560] x86_64-pld-linux-gnux32-gcc -Isrc/shared/src@shared@@systemd-shared-239@sta -Isrc/shared -I../src/shared -Isrc/basic -I../src/basic -Isrc/systemd -I../src/systemd -Isrc/journal -I../src/journal -Isrc/journal-remote -I../src/journal-remote -Isrc/nspawn -I../src/nspawn -Isrc/resolve -I../src/resolve -Isrc/timesync -I../src/timesync -I../src/time-wait-sync -Isrc/login -I../src/login -Isrc/udev -I../src/udev -Isrc/libudev -I../src/libudev -Isrc/core -I../src/core -I../src/libsystemd/sd-bus -I../src/libsystemd/sd-device -I../src/libsystemd/sd-hwdb -I../src/libsystemd/sd-id128 -I../src/libsystemd/sd-netlink -I../src/libsystemd/sd-network -Isrc/libsystemd-network -I../src/libsystemd-network -I. -I../ -I/usr/include/blkid -I/usr/include/uuid -fdiagnostics-color=always -pipe -D_FILE_OFFSET_BITS=64 -std=gnu99 -Wextra -Werror=undef -Wlogical-op -Wmissing-include-dirs -Wold-style-definition -Wpointer-arith -Winit-self -Wfloat-equal -Wsuggest-attribute=noreturn -Werror=missing-prototypes -Werror=implicit-function-declaration -Werror=missing-declarations -Werror=return-type -Werror=incompatible-pointer-types -Werror=format=2 -Wstrict-prototypes -Wredundant-decls -Wmissing-noreturn -Wimplicit-fallthrough=5 -Wshadow -Wendif-labels -Wstrict-aliasing=2 -Wwrite-strings -Werror=overflow -Werror=shift-count-overflow -Werror=shift-overflow=2 -Wdate-time -Wnested-externs -ffast-math -fno-common -fdiagnostics-show-option -fno-strict-aliasing -fvisibility=hidden -fstack-protector -fstack-protector-strong --param=ssp-buffer-size=4 -fPIE -ffunction-sections -fdata-sections -Wno-unused-parameter -Wno-missing-field-initializers -Wno-unused-result -Wno-format-signedness -Wno-error=nonnull -Werror=shadow -include config.h -O2 -fwrapv -Wformat -Werror=format-security -gdwarf-4 -fno-debug-types-section -fvar-tracking-assignments -g2 -Wp,-D_FORTIFY_SOURCE=2 -fstack-protector-strong --param=ssp-buffer-size=4 -fPIC -mtune=generic -march=x86-64 -gdwarf-4 -fno-debug-types-section -fvar-tracking-assignments -g2 -fPIC -pthread -fvisibility=default  -MD -MQ 'src/shared/src@shared@@systemd-shared-239@sta/dev-setup.c.o' -MF 'src/shared/src@shared@@systemd-shared-239@sta/dev-setup.c.o.d' -o 'src/shared/src@shared@@systemd-shared-239@sta/dev-setup.c.o' -c ../src/shared/dev-setup.c
[270/1560] x86_64-pld-linux-gnux32-gcc -Isrc/shared/src@shared@@systemd-shared-239@sta -Isrc/shared -I../src/shared -Isrc/basic -I../src/basic -Isrc/systemd -I../src/systemd -Isrc/journal -I../src/journal -Isrc/journal-remote -I../src/journal-remote -Isrc/nspawn -I../src/nspawn -Isrc/resolve -I../src/resolve -Isrc/timesync -I../src/timesync -I../src/time-wait-sync -Isrc/login -I../src/login -Isrc/udev -I../src/udev -Isrc/libudev -I../src/libudev -Isrc/core -I../src/core -I../src/libsystemd/sd-bus -I../src/libsystemd/sd-device -I../src/libsystemd/sd-hwdb -I../src/libsystemd/sd-id128 -I../src/libsystemd/sd-netlink -I../src/libsystemd/sd-network -Isrc/libsystemd-network -I../src/libsystemd-network -I. -I../ -I/usr/include/blkid -I/usr/include/uuid -fdiagnostics-color=always -pipe -D_FILE_OFFSET_BITS=64 -std=gnu99 -Wextra -Werror=undef -Wlogical-op -Wmissing-include-dirs -Wold-style-definition -Wpointer-arith -Winit-self -Wfloat-equal -Wsuggest-attribute=noreturn -Werror=missing-prototypes -Werror=implicit-function-declaration -Werror=missing-declarations -Werror=return-type -Werror=incompatible-pointer-types -Werror=format=2 -Wstrict-prototypes -Wredundant-decls -Wmissing-noreturn -Wimplicit-fallthrough=5 -Wshadow -Wendif-labels -Wstrict-aliasing=2 -Wwrite-strings -Werror=overflow -Werror=shift-count-overflow -Werror=shift-overflow=2 -Wdate-time -Wnested-externs -ffast-math -fno-common -fdiagnostics-show-option -fno-strict-aliasing -fvisibility=hidden -fstack-protector -fstack-protector-strong --param=ssp-buffer-size=4 -fPIE -ffunction-sections -fdata-sections -Wno-unused-parameter -Wno-missing-field-initializers -Wno-unused-result -Wno-format-signedness -Wno-error=nonnull -Werror=shadow -include config.h -O2 -fwrapv -Wformat -Werror=format-security -gdwarf-4 -fno-debug-types-section -fvar-tracking-assignments -g2 -Wp,-D_FORTIFY_SOURCE=2 -fstack-protector-strong --param=ssp-buffer-size=4 -fPIC -mtune=generic -march=x86-64 -gdwarf-4 -fno-debug-types-section -fvar-tracking-assignments -g2 -fPIC -pthread -fvisibility=default  -MD -MQ 'src/shared/src@shared@@systemd-shared-239@sta/condition.c.o' -MF 'src/shared/src@shared@@systemd-shared-239@sta/condition.c.o.d' -o 'src/shared/src@shared@@systemd-shared-239@sta/condition.c.o' -c ../src/shared/condition.c
[271/1560] x86_64-pld-linux-gnux32-gcc -Isrc/shared/src@shared@@systemd-shared-239@sta -Isrc/shared -I../src/shared -Isrc/basic -I../src/basic -Isrc/systemd -I../src/systemd -Isrc/journal -I../src/journal -Isrc/journal-remote -I../src/journal-remote -Isrc/nspawn -I../src/nspawn -Isrc/resolve -I../src/resolve -Isrc/timesync -I../src/timesync -I../src/time-wait-sync -Isrc/login -I../src/login -Isrc/udev -I../src/udev -Isrc/libudev -I../src/libudev -Isrc/core -I../src/core -I../src/libsystemd/sd-bus -I../src/libsystemd/sd-device -I../src/libsystemd/sd-hwdb -I../src/libsystemd/sd-id128 -I../src/libsystemd/sd-netlink -I../src/libsystemd/sd-network -Isrc/libsystemd-network -I../src/libsystemd-network -I. -I../ -I/usr/include/blkid -I/usr/include/uuid -fdiagnostics-color=always -pipe -D_FILE_OFFSET_BITS=64 -std=gnu99 -Wextra -Werror=undef -Wlogical-op -Wmissing-include-dirs -Wold-style-definition -Wpointer-arith -Winit-self -Wfloat-equal -Wsuggest-attribute=noreturn -Werror=missing-prototypes -Werror=implicit-function-declaration -Werror=missing-declarations -Werror=return-type -Werror=incompatible-pointer-types -Werror=format=2 -Wstrict-prototypes -Wredundant-decls -Wmissing-noreturn -Wimplicit-fallthrough=5 -Wshadow -Wendif-labels -Wstrict-aliasing=2 -Wwrite-strings -Werror=overflow -Werror=shift-count-overflow -Werror=shift-overflow=2 -Wdate-time -Wnested-externs -ffast-math -fno-common -fdiagnostics-show-option -fno-strict-aliasing -fvisibility=hidden -fstack-protector -fstack-protector-strong --param=ssp-buffer-size=4 -fPIE -ffunction-sections -fdata-sections -Wno-unused-parameter -Wno-missing-field-initializers -Wno-unused-result -Wno-format-signedness -Wno-error=nonnull -Werror=shadow -include config.h -O2 -fwrapv -Wformat -Werror=format-security -gdwarf-4 -fno-debug-types-section -fvar-tracking-assignments -g2 -Wp,-D_FORTIFY_SOURCE=2 -fstack-protector-strong --param=ssp-buffer-size=4 -fPIC -mtune=generic -march=x86-64 -gdwarf-4 -fno-debug-types-section -fvar-tracking-assignments -g2 -fPIC -pthread -fvisibility=default  -MD -MQ 'src/shared/src@shared@@systemd-shared-239@sta/bus-util.c.o' -MF 'src/shared/src@shared@@systemd-shared-239@sta/bus-util.c.o.d' -o 'src/shared/src@shared@@systemd-shared-239@sta/bus-util.c.o' -c ../src/shared/bus-util.c
[272/1560] x86_64-pld-linux-gnux32-gcc -Isrc/shared/src@shared@@systemd-shared-239@sta -Isrc/shared -I../src/shared -Isrc/basic -I../src/basic -Isrc/systemd -I../src/systemd -Isrc/journal -I../src/journal -Isrc/journal-remote -I../src/journal-remote -Isrc/nspawn -I../src/nspawn -Isrc/resolve -I../src/resolve -Isrc/timesync -I../src/timesync -I../src/time-wait-sync -Isrc/login -I../src/login -Isrc/udev -I../src/udev -Isrc/libudev -I../src/libudev -Isrc/core -I../src/core -I../src/libsystemd/sd-bus -I../src/libsystemd/sd-device -I../src/libsystemd/sd-hwdb -I../src/libsystemd/sd-id128 -I../src/libsystemd/sd-netlink -I../src/libsystemd/sd-network -Isrc/libsystemd-network -I../src/libsystemd-network -I. -I../ -I/usr/include/blkid -I/usr/include/uuid -fdiagnostics-color=always -pipe -D_FILE_OFFSET_BITS=64 -std=gnu99 -Wextra -Werror=undef -Wlogical-op -Wmissing-include-dirs -Wold-style-definition -Wpointer-arith -Winit-self -Wfloat-equal -Wsuggest-attribute=noreturn -Werror=missing-prototypes -Werror=implicit-function-declaration -Werror=missing-declarations -Werror=return-type -Werror=incompatible-pointer-types -Werror=format=2 -Wstrict-prototypes -Wredundant-decls -Wmissing-noreturn -Wimplicit-fallthrough=5 -Wshadow -Wendif-labels -Wstrict-aliasing=2 -Wwrite-strings -Werror=overflow -Werror=shift-count-overflow -Werror=shift-overflow=2 -Wdate-time -Wnested-externs -ffast-math -fno-common -fdiagnostics-show-option -fno-strict-aliasing -fvisibility=hidden -fstack-protector -fstack-protector-strong --param=ssp-buffer-size=4 -fPIE -ffunction-sections -fdata-sections -Wno-unused-parameter -Wno-missing-field-initializers -Wno-unused-result -Wno-format-signedness -Wno-error=nonnull -Werror=shadow -include config.h -O2 -fwrapv -Wformat -Werror=format-security -gdwarf-4 -fno-debug-types-section -fvar-tracking-assignments -g2 -Wp,-D_FORTIFY_SOURCE=2 -fstack-protector-strong --param=ssp-buffer-size=4 -fPIC -mtune=generic -march=x86-64 -gdwarf-4 -fno-debug-types-section -fvar-tracking-assignments -g2 -fPIC -pthread -fvisibility=default  -MD -MQ 'src/shared/src@shared@@systemd-shared-239@sta/bus-unit-util.c.o' -MF 'src/shared/src@shared@@systemd-shared-239@sta/bus-unit-util.c.o.d' -o 'src/shared/src@shared@@systemd-shared-239@sta/bus-unit-util.c.o' -c ../src/shared/bus-unit-util.c
[273/1560] x86_64-pld-linux-gnux32-gcc -Isrc/shared/src@shared@@systemd-shared-239@sta -Isrc/shared -I../src/shared -Isrc/basic -I../src/basic -Isrc/systemd -I../src/systemd -Isrc/journal -I../src/journal -Isrc/journal-remote -I../src/journal-remote -Isrc/nspawn -I../src/nspawn -Isrc/resolve -I../src/resolve -Isrc/timesync -I../src/timesync -I../src/time-wait-sync -Isrc/login -I../src/login -Isrc/udev -I../src/udev -Isrc/libudev -I../src/libudev -Isrc/core -I../src/core -I../src/libsystemd/sd-bus -I../src/libsystemd/sd-device -I../src/libsystemd/sd-hwdb -I../src/libsystemd/sd-id128 -I../src/libsystemd/sd-netlink -I../src/libsystemd/sd-network -Isrc/libsystemd-network -I../src/libsystemd-network -I. -I../ -I/usr/include/blkid -I/usr/include/uuid -fdiagnostics-color=always -pipe -D_FILE_OFFSET_BITS=64 -std=gnu99 -Wextra -Werror=undef -Wlogical-op -Wmissing-include-dirs -Wold-style-definition -Wpointer-arith -Winit-self -Wfloat-equal -Wsuggest-attribute=noreturn -Werror=missing-prototypes -Werror=implicit-function-declaration -Werror=missing-declarations -Werror=return-type -Werror=incompatible-pointer-types -Werror=format=2 -Wstrict-prototypes -Wredundant-decls -Wmissing-noreturn -Wimplicit-fallthrough=5 -Wshadow -Wendif-labels -Wstrict-aliasing=2 -Wwrite-strings -Werror=overflow -Werror=shift-count-overflow -Werror=shift-overflow=2 -Wdate-time -Wnested-externs -ffast-math -fno-common -fdiagnostics-show-option -fno-strict-aliasing -fvisibility=hidden -fstack-protector -fstack-protector-strong --param=ssp-buffer-size=4 -fPIE -ffunction-sections -fdata-sections -Wno-unused-parameter -Wno-missing-field-initializers -Wno-unused-result -Wno-format-signedness -Wno-error=nonnull -Werror=shadow -include config.h -O2 -fwrapv -Wformat -Werror=format-security -gdwarf-4 -fno-debug-types-section -fvar-tracking-assignments -g2 -Wp,-D_FORTIFY_SOURCE=2 -fstack-protector-strong --param=ssp-buffer-size=4 -fPIC -mtune=generic -march=x86-64 -gdwarf-4 -fno-debug-types-section -fvar-tracking-assignments -g2 -fPIC -pthread -fvisibility=default  -MD -MQ 'src/shared/src@shared@@systemd-shared-239@sta/efivars.c.o' -MF 'src/shared/src@shared@@systemd-shared-239@sta/efivars.c.o.d' -o 'src/shared/src@shared@@systemd-shared-239@sta/efivars.c.o' -c ../src/shared/efivars.c
[274/1560] x86_64-pld-linux-gnux32-gcc -Isrc/shared/src@shared@@systemd-shared-239@sta -Isrc/shared -I../src/shared -Isrc/basic -I../src/basic -Isrc/systemd -I../src/systemd -Isrc/journal -I../src/journal -Isrc/journal-remote -I../src/journal-remote -Isrc/nspawn -I../src/nspawn -Isrc/resolve -I../src/resolve -Isrc/timesync -I../src/timesync -I../src/time-wait-sync -Isrc/login -I../src/login -Isrc/udev -I../src/udev -Isrc/libudev -I../src/libudev -Isrc/core -I../src/core -I../src/libsystemd/sd-bus -I../src/libsystemd/sd-device -I../src/libsystemd/sd-hwdb -I../src/libsystemd/sd-id128 -I../src/libsystemd/sd-netlink -I../src/libsystemd/sd-network -Isrc/libsystemd-network -I../src/libsystemd-network -I. -I../ -I/usr/include/blkid -I/usr/include/uuid -fdiagnostics-color=always -pipe -D_FILE_OFFSET_BITS=64 -std=gnu99 -Wextra -Werror=undef -Wlogical-op -Wmissing-include-dirs -Wold-style-definition -Wpointer-arith -Winit-self -Wfloat-equal -Wsuggest-attribute=noreturn -Werror=missing-prototypes -Werror=implicit-function-declaration -Werror=missing-declarations -Werror=return-type -Werror=incompatible-pointer-types -Werror=format=2 -Wstrict-prototypes -Wredundant-decls -Wmissing-noreturn -Wimplicit-fallthrough=5 -Wshadow -Wendif-labels -Wstrict-aliasing=2 -Wwrite-strings -Werror=overflow -Werror=shift-count-overflow -Werror=shift-overflow=2 -Wdate-time -Wnested-externs -ffast-math -fno-common -fdiagnostics-show-option -fno-strict-aliasing -fvisibility=hidden -fstack-protector -fstack-protector-strong --param=ssp-buffer-size=4 -fPIE -ffunction-sections -fdata-sections -Wno-unused-parameter -Wno-missing-field-initializers -Wno-unused-result -Wno-format-signedness -Wno-error=nonnull -Werror=shadow -include config.h -O2 -fwrapv -Wformat -Werror=format-security -gdwarf-4 -fno-debug-types-section -fvar-tracking-assignments -g2 -Wp,-D_FORTIFY_SOURCE=2 -fstack-protector-strong --param=ssp-buffer-size=4 -fPIC -mtune=generic -march=x86-64 -gdwarf-4 -fno-debug-types-section -fvar-tracking-assignments -g2 -fPIC -pthread -fvisibility=default  -MD -MQ 'src/shared/src@shared@@systemd-shared-239@sta/ima-util.c.o' -MF 'src/shared/src@shared@@systemd-shared-239@sta/ima-util.c.o.d' -o 'src/shared/src@shared@@systemd-shared-239@sta/ima-util.c.o' -c ../src/shared/ima-util.c
[275/1560] x86_64-pld-linux-gnux32-gcc  -o libsystemd.so.0.23.0  -Wl,--no-undefined -Wl,--as-needed -shared -fPIC -Wl,--start-group -Wl,-soname,libsystemd.so.0 -Wl,--whole-archive src/libsystemd/libsystemd_static.a src/journal/libjournal-client.a -Wl,--no-whole-archive -Wl,-z,relro -Wl,-z,now -pie -Wl,--gc-sections -O2 -fwrapv -pipe -Wformat -Werror=format-security -gdwarf-4 -fno-debug-types-section -fvar-tracking-assignments -g2 -Wp,-D_FORTIFY_SOURCE=2 -fstack-protector-strong --param=ssp-buffer-size=4 -fPIC -mtune=generic -march=x86-64 -gdwarf-4 -fno-debug-types-section -fvar-tracking-assignments -g2 -Wl,--as-needed -Wl,--no-copy-dt-needed-entries -Wl,-z,relro -Wl,-z,combreloc src/basic/libbasic.a src/basic/libbasic-gcrypt.a -shared -Wl,--version-script=/tmp/B.esxPMU/BUILD/systemd-239/src/libsystemd/libsystemd.sym -lrt /usr/libx32/liblzma.so /usr/libx32/liblz4.so /usr/libx32/libcap.so /usr/libx32/libblkid.so /usr/libx32/libmount.so /usr/libx32/libselinux.so -lgcrypt -lrt -Wl,--end-group -pthread '-Wl,-rpath,$ORIGIN/src/basic' -Wl,-rpath-link,/tmp/B.esxPMU/BUILD/systemd-239/build/src/basic  
[276/1560] x86_64-pld-linux-gnux32-gcc -Isrc/shared/src@shared@@systemd-shared-239@sta -Isrc/shared -I../src/shared -Isrc/basic -I../src/basic -Isrc/systemd -I../src/systemd -Isrc/journal -I../src/journal -Isrc/journal-remote -I../src/journal-remote -Isrc/nspawn -I../src/nspawn -Isrc/resolve -I../src/resolve -Isrc/timesync -I../src/timesync -I../src/time-wait-sync -Isrc/login -I../src/login -Isrc/udev -I../src/udev -Isrc/libudev -I../src/libudev -Isrc/core -I../src/core -I../src/libsystemd/sd-bus -I../src/libsystemd/sd-device -I../src/libsystemd/sd-hwdb -I../src/libsystemd/sd-id128 -I../src/libsystemd/sd-netlink -I../src/libsystemd/sd-network -Isrc/libsystemd-network -I../src/libsystemd-network -I. -I../ -I/usr/include/blkid -I/usr/include/uuid -fdiagnostics-color=always -pipe -D_FILE_OFFSET_BITS=64 -std=gnu99 -Wextra -Werror=undef -Wlogical-op -Wmissing-include-dirs -Wold-style-definition -Wpointer-arith -Winit-self -Wfloat-equal -Wsuggest-attribute=noreturn -Werror=missing-prototypes -Werror=implicit-function-declaration -Werror=missing-declarations -Werror=return-type -Werror=incompatible-pointer-types -Werror=format=2 -Wstrict-prototypes -Wredundant-decls -Wmissing-noreturn -Wimplicit-fallthrough=5 -Wshadow -Wendif-labels -Wstrict-aliasing=2 -Wwrite-strings -Werror=overflow -Werror=shift-count-overflow -Werror=shift-overflow=2 -Wdate-time -Wnested-externs -ffast-math -fno-common -fdiagnostics-show-option -fno-strict-aliasing -fvisibility=hidden -fstack-protector -fstack-protector-strong --param=ssp-buffer-size=4 -fPIE -ffunction-sections -fdata-sections -Wno-unused-parameter -Wno-missing-field-initializers -Wno-unused-result -Wno-format-signedness -Wno-error=nonnull -Werror=shadow -include config.h -O2 -fwrapv -Wformat -Werror=format-security -gdwarf-4 -fno-debug-types-section -fvar-tracking-assignments -g2 -Wp,-D_FORTIFY_SOURCE=2 -fstack-protector-strong --param=ssp-buffer-size=4 -fPIC -mtune=generic -march=x86-64 -gdwarf-4 -fno-debug-types-section -fvar-tracking-assignments -g2 -fPIC -pthread -fvisibility=default  -MD -MQ 'src/shared/src@shared@@systemd-shared-239@sta/dropin.c.o' -MF 'src/shared/src@shared@@systemd-shared-239@sta/dropin.c.o.d' -o 'src/shared/src@shared@@systemd-shared-239@sta/dropin.c.o' -c ../src/shared/dropin.c
[277/1560] x86_64-pld-linux-gnux32-gcc -Isrc/shared/src@shared@@systemd-shared-239@sta -Isrc/shared -I../src/shared -Isrc/basic -I../src/basic -Isrc/systemd -I../src/systemd -Isrc/journal -I../src/journal -Isrc/journal-remote -I../src/journal-remote -Isrc/nspawn -I../src/nspawn -Isrc/resolve -I../src/resolve -Isrc/timesync -I../src/timesync -I../src/time-wait-sync -Isrc/login -I../src/login -Isrc/udev -I../src/udev -Isrc/libudev -I../src/libudev -Isrc/core -I../src/core -I../src/libsystemd/sd-bus -I../src/libsystemd/sd-device -I../src/libsystemd/sd-hwdb -I../src/libsystemd/sd-id128 -I../src/libsystemd/sd-netlink -I../src/libsystemd/sd-network -Isrc/libsystemd-network -I../src/libsystemd-network -I. -I../ -I/usr/include/blkid -I/usr/include/uuid -fdiagnostics-color=always -pipe -D_FILE_OFFSET_BITS=64 -std=gnu99 -Wextra -Werror=undef -Wlogical-op -Wmissing-include-dirs -Wold-style-definition -Wpointer-arith -Winit-self -Wfloat-equal -Wsuggest-attribute=noreturn -Werror=missing-prototypes -Werror=implicit-function-declaration -Werror=missing-declarations -Werror=return-type -Werror=incompatible-pointer-types -Werror=format=2 -Wstrict-prototypes -Wredundant-decls -Wmissing-noreturn -Wimplicit-fallthrough=5 -Wshadow -Wendif-labels -Wstrict-aliasing=2 -Wwrite-strings -Werror=overflow -Werror=shift-count-overflow -Werror=shift-overflow=2 -Wdate-time -Wnested-externs -ffast-math -fno-common -fdiagnostics-show-option -fno-strict-aliasing -fvisibility=hidden -fstack-protector -fstack-protector-strong --param=ssp-buffer-size=4 -fPIE -ffunction-sections -fdata-sections -Wno-unused-parameter -Wno-missing-field-initializers -Wno-unused-result -Wno-format-signedness -Wno-error=nonnull -Werror=shadow -include config.h -O2 -fwrapv -Wformat -Werror=format-security -gdwarf-4 -fno-debug-types-section -fvar-tracking-assignments -g2 -Wp,-D_FORTIFY_SOURCE=2 -fstack-protector-strong --param=ssp-buffer-size=4 -fPIC -mtune=generic -march=x86-64 -gdwarf-4 -fno-debug-types-section -fvar-tracking-assignments -g2 -fPIC -pthread -fvisibility=default  -MD -MQ 'src/shared/src@shared@@systemd-shared-239@sta/conf-parser.c.o' -MF 'src/shared/src@shared@@systemd-shared-239@sta/conf-parser.c.o.d' -o 'src/shared/src@shared@@systemd-shared-239@sta/conf-parser.c.o' -c ../src/shared/conf-parser.c
[278/1560] x86_64-pld-linux-gnux32-gcc -Isrc/shared/src@shared@@systemd-shared-239@sta -Isrc/shared -I../src/shared -Isrc/basic -I../src/basic -Isrc/systemd -I../src/systemd -Isrc/journal -I../src/journal -Isrc/journal-remote -I../src/journal-remote -Isrc/nspawn -I../src/nspawn -Isrc/resolve -I../src/resolve -Isrc/timesync -I../src/timesync -I../src/time-wait-sync -Isrc/login -I../src/login -Isrc/udev -I../src/udev -Isrc/libudev -I../src/libudev -Isrc/core -I../src/core -I../src/libsystemd/sd-bus -I../src/libsystemd/sd-device -I../src/libsystemd/sd-hwdb -I../src/libsystemd/sd-id128 -I../src/libsystemd/sd-netlink -I../src/libsystemd/sd-network -Isrc/libsystemd-network -I../src/libsystemd-network -I. -I../ -I/usr/include/blkid -I/usr/include/uuid -fdiagnostics-color=always -pipe -D_FILE_OFFSET_BITS=64 -std=gnu99 -Wextra -Werror=undef -Wlogical-op -Wmissing-include-dirs -Wold-style-definition -Wpointer-arith -Winit-self -Wfloat-equal -Wsuggest-attribute=noreturn -Werror=missing-prototypes -Werror=implicit-function-declaration -Werror=missing-declarations -Werror=return-type -Werror=incompatible-pointer-types -Werror=format=2 -Wstrict-prototypes -Wredundant-decls -Wmissing-noreturn -Wimplicit-fallthrough=5 -Wshadow -Wendif-labels -Wstrict-aliasing=2 -Wwrite-strings -Werror=overflow -Werror=shift-count-overflow -Werror=shift-overflow=2 -Wdate-time -Wnested-externs -ffast-math -fno-common -fdiagnostics-show-option -fno-strict-aliasing -fvisibility=hidden -fstack-protector -fstack-protector-strong --param=ssp-buffer-size=4 -fPIE -ffunction-sections -fdata-sections -Wno-unused-parameter -Wno-missing-field-initializers -Wno-unused-result -Wno-format-signedness -Wno-error=nonnull -Werror=shadow -include config.h -O2 -fwrapv -Wformat -Werror=format-security -gdwarf-4 -fno-debug-types-section -fvar-tracking-assignments -g2 -Wp,-D_FORTIFY_SOURCE=2 -fstack-protector-strong --param=ssp-buffer-size=4 -fPIC -mtune=generic -march=x86-64 -gdwarf-4 -fno-debug-types-section -fvar-tracking-assignments -g2 -fPIC -pthread -fvisibility=default  -MD -MQ 'src/shared/src@shared@@systemd-shared-239@sta/import-util.c.o' -MF 'src/shared/src@shared@@systemd-shared-239@sta/import-util.c.o.d' -o 'src/shared/src@shared@@systemd-shared-239@sta/import-util.c.o' -c ../src/shared/import-util.c
[279/1560] x86_64-pld-linux-gnux32-gcc -Isrc/shared/src@shared@@systemd-shared-239@sta -Isrc/shared -I../src/shared -Isrc/basic -I../src/basic -Isrc/systemd -I../src/systemd -Isrc/journal -I../src/journal -Isrc/journal-remote -I../src/journal-remote -Isrc/nspawn -I../src/nspawn -Isrc/resolve -I../src/resolve -Isrc/timesync -I../src/timesync -I../src/time-wait-sync -Isrc/login -I../src/login -Isrc/udev -I../src/udev -Isrc/libudev -I../src/libudev -Isrc/core -I../src/core -I../src/libsystemd/sd-bus -I../src/libsystemd/sd-device -I../src/libsystemd/sd-hwdb -I../src/libsystemd/sd-id128 -I../src/libsystemd/sd-netlink -I../src/libsystemd/sd-network -Isrc/libsystemd-network -I../src/libsystemd-network -I. -I../ -I/usr/include/blkid -I/usr/include/uuid -fdiagnostics-color=always -pipe -D_FILE_OFFSET_BITS=64 -std=gnu99 -Wextra -Werror=undef -Wlogical-op -Wmissing-include-dirs -Wold-style-definition -Wpointer-arith -Winit-self -Wfloat-equal -Wsuggest-attribute=noreturn -Werror=missing-prototypes -Werror=implicit-function-declaration -Werror=missing-declarations -Werror=return-type -Werror=incompatible-pointer-types -Werror=format=2 -Wstrict-prototypes -Wredundant-decls -Wmissing-noreturn -Wimplicit-fallthrough=5 -Wshadow -Wendif-labels -Wstrict-aliasing=2 -Wwrite-strings -Werror=overflow -Werror=shift-count-overflow -Werror=shift-overflow=2 -Wdate-time -Wnested-externs -ffast-math -fno-common -fdiagnostics-show-option -fno-strict-aliasing -fvisibility=hidden -fstack-protector -fstack-protector-strong --param=ssp-buffer-size=4 -fPIE -ffunction-sections -fdata-sections -Wno-unused-parameter -Wno-missing-field-initializers -Wno-unused-result -Wno-format-signedness -Wno-error=nonnull -Werror=shadow -include config.h -O2 -fwrapv -Wformat -Werror=format-security -gdwarf-4 -fno-debug-types-section -fvar-tracking-assignments -g2 -Wp,-D_FORTIFY_SOURCE=2 -fstack-protector-strong --param=ssp-buffer-size=4 -fPIC -mtune=generic -march=x86-64 -gdwarf-4 -fno-debug-types-section -fvar-tracking-assignments -g2 -fPIC -pthread -fvisibility=default  -MD -MQ 'src/shared/src@shared@@systemd-shared-239@sta/install-printf.c.o' -MF 'src/shared/src@shared@@systemd-shared-239@sta/install-printf.c.o.d' -o 'src/shared/src@shared@@systemd-shared-239@sta/install-printf.c.o' -c ../src/shared/install-printf.c
[280/1560] x86_64-pld-linux-gnux32-gcc -Isrc/shared/src@shared@@systemd-shared-239@sta -Isrc/shared -I../src/shared -Isrc/basic -I../src/basic -Isrc/systemd -I../src/systemd -Isrc/journal -I../src/journal -Isrc/journal-remote -I../src/journal-remote -Isrc/nspawn -I../src/nspawn -Isrc/resolve -I../src/resolve -Isrc/timesync -I../src/timesync -I../src/time-wait-sync -Isrc/login -I../src/login -Isrc/udev -I../src/udev -Isrc/libudev -I../src/libudev -Isrc/core -I../src/core -I../src/libsystemd/sd-bus -I../src/libsystemd/sd-device -I../src/libsystemd/sd-hwdb -I../src/libsystemd/sd-id128 -I../src/libsystemd/sd-netlink -I../src/libsystemd/sd-network -Isrc/libsystemd-network -I../src/libsystemd-network -I. -I../ -I/usr/include/blkid -I/usr/include/uuid -fdiagnostics-color=always -pipe -D_FILE_OFFSET_BITS=64 -std=gnu99 -Wextra -Werror=undef -Wlogical-op -Wmissing-include-dirs -Wold-style-definition -Wpointer-arith -Winit-self -Wfloat-equal -Wsuggest-attribute=noreturn -Werror=missing-prototypes -Werror=implicit-function-declaration -Werror=missing-declarations -Werror=return-type -Werror=incompatible-pointer-types -Werror=format=2 -Wstrict-prototypes -Wredundant-decls -Wmissing-noreturn -Wimplicit-fallthrough=5 -Wshadow -Wendif-labels -Wstrict-aliasing=2 -Wwrite-strings -Werror=overflow -Werror=shift-count-overflow -Werror=shift-overflow=2 -Wdate-time -Wnested-externs -ffast-math -fno-common -fdiagnostics-show-option -fno-strict-aliasing -fvisibility=hidden -fstack-protector -fstack-protector-strong --param=ssp-buffer-size=4 -fPIE -ffunction-sections -fdata-sections -Wno-unused-parameter -Wno-missing-field-initializers -Wno-unused-result -Wno-format-signedness -Wno-error=nonnull -Werror=shadow -include config.h -O2 -fwrapv -Wformat -Werror=format-security -gdwarf-4 -fno-debug-types-section -fvar-tracking-assignments -g2 -Wp,-D_FORTIFY_SOURCE=2 -fstack-protector-strong --param=ssp-buffer-size=4 -fPIC -mtune=generic -march=x86-64 -gdwarf-4 -fno-debug-types-section -fvar-tracking-assignments -g2 -fPIC -pthread -fvisibility=default  -MD -MQ 'src/shared/src@shared@@systemd-shared-239@sta/dns-domain.c.o' -MF 'src/shared/src@shared@@systemd-shared-239@sta/dns-domain.c.o.d' -o 'src/shared/src@shared@@systemd-shared-239@sta/dns-domain.c.o' -c ../src/shared/dns-domain.c
[281/1560] x86_64-pld-linux-gnux32-gcc -Isrc/shared/src@shared@@systemd-shared-239@sta -Isrc/shared -I../src/shared -Isrc/basic -I../src/basic -Isrc/systemd -I../src/systemd -Isrc/journal -I../src/journal -Isrc/journal-remote -I../src/journal-remote -Isrc/nspawn -I../src/nspawn -Isrc/resolve -I../src/resolve -Isrc/timesync -I../src/timesync -I../src/time-wait-sync -Isrc/login -I../src/login -Isrc/udev -I../src/udev -Isrc/libudev -I../src/libudev -Isrc/core -I../src/core -I../src/libsystemd/sd-bus -I../src/libsystemd/sd-device -I../src/libsystemd/sd-hwdb -I../src/libsystemd/sd-id128 -I../src/libsystemd/sd-netlink -I../src/libsystemd/sd-network -Isrc/libsystemd-network -I../src/libsystemd-network -I. -I../ -I/usr/include/blkid -I/usr/include/uuid -fdiagnostics-color=always -pipe -D_FILE_OFFSET_BITS=64 -std=gnu99 -Wextra -Werror=undef -Wlogical-op -Wmissing-include-dirs -Wold-style-definition -Wpointer-arith -Winit-self -Wfloat-equal -Wsuggest-attribute=noreturn -Werror=missing-prototypes -Werror=implicit-function-declaration -Werror=missing-declarations -Werror=return-type -Werror=incompatible-pointer-types -Werror=format=2 -Wstrict-prototypes -Wredundant-decls -Wmissing-noreturn -Wimplicit-fallthrough=5 -Wshadow -Wendif-labels -Wstrict-aliasing=2 -Wwrite-strings -Werror=overflow -Werror=shift-count-overflow -Werror=shift-overflow=2 -Wdate-time -Wnested-externs -ffast-math -fno-common -fdiagnostics-show-option -fno-strict-aliasing -fvisibility=hidden -fstack-protector -fstack-protector-strong --param=ssp-buffer-size=4 -fPIE -ffunction-sections -fdata-sections -Wno-unused-parameter -Wno-missing-field-initializers -Wno-unused-result -Wno-format-signedness -Wno-error=nonnull -Werror=shadow -include config.h -O2 -fwrapv -Wformat -Werror=format-security -gdwarf-4 -fno-debug-types-section -fvar-tracking-assignments -g2 -Wp,-D_FORTIFY_SOURCE=2 -fstack-protector-strong --param=ssp-buffer-size=4 -fPIC -mtune=generic -march=x86-64 -gdwarf-4 -fno-debug-types-section -fvar-tracking-assignments -g2 -fPIC -pthread -fvisibility=default  -MD -MQ 'src/shared/src@shared@@systemd-shared-239@sta/loop-util.c.o' -MF 'src/shared/src@shared@@systemd-shared-239@sta/loop-util.c.o.d' -o 'src/shared/src@shared@@systemd-shared-239@sta/loop-util.c.o' -c ../src/shared/loop-util.c
[282/1560] x86_64-pld-linux-gnux32-gcc -Isrc/shared/src@shared@@systemd-shared-239@sta -Isrc/shared -I../src/shared -Isrc/basic -I../src/basic -Isrc/systemd -I../src/systemd -Isrc/journal -I../src/journal -Isrc/journal-remote -I../src/journal-remote -Isrc/nspawn -I../src/nspawn -Isrc/resolve -I../src/resolve -Isrc/timesync -I../src/timesync -I../src/time-wait-sync -Isrc/login -I../src/login -Isrc/udev -I../src/udev -Isrc/libudev -I../src/libudev -Isrc/core -I../src/core -I../src/libsystemd/sd-bus -I../src/libsystemd/sd-device -I../src/libsystemd/sd-hwdb -I../src/libsystemd/sd-id128 -I../src/libsystemd/sd-netlink -I../src/libsystemd/sd-network -Isrc/libsystemd-network -I../src/libsystemd-network -I. -I../ -I/usr/include/blkid -I/usr/include/uuid -fdiagnostics-color=always -pipe -D_FILE_OFFSET_BITS=64 -std=gnu99 -Wextra -Werror=undef -Wlogical-op -Wmissing-include-dirs -Wold-style-definition -Wpointer-arith -Winit-self -Wfloat-equal -Wsuggest-attribute=noreturn -Werror=missing-prototypes -Werror=implicit-function-declaration -Werror=missing-declarations -Werror=return-type -Werror=incompatible-pointer-types -Werror=format=2 -Wstrict-prototypes -Wredundant-decls -Wmissing-noreturn -Wimplicit-fallthrough=5 -Wshadow -Wendif-labels -Wstrict-aliasing=2 -Wwrite-strings -Werror=overflow -Werror=shift-count-overflow -Werror=shift-overflow=2 -Wdate-time -Wnested-externs -ffast-math -fno-common -fdiagnostics-show-option -fno-strict-aliasing -fvisibility=hidden -fstack-protector -fstack-protector-strong --param=ssp-buffer-size=4 -fPIE -ffunction-sections -fdata-sections -Wno-unused-parameter -Wno-missing-field-initializers -Wno-unused-result -Wno-format-signedness -Wno-error=nonnull -Werror=shadow -include config.h -O2 -fwrapv -Wformat -Werror=format-security -gdwarf-4 -fno-debug-types-section -fvar-tracking-assignments -g2 -Wp,-D_FORTIFY_SOURCE=2 -fstack-protector-strong --param=ssp-buffer-size=4 -fPIC -mtune=generic -march=x86-64 -gdwarf-4 -fno-debug-types-section -fvar-tracking-assignments -g2 -fPIC -pthread -fvisibility=default  -MD -MQ 'src/shared/src@shared@@systemd-shared-239@sta/journal-util.c.o' -MF 'src/shared/src@shared@@systemd-shared-239@sta/journal-util.c.o.d' -o 'src/shared/src@shared@@systemd-shared-239@sta/journal-util.c.o' -c ../src/shared/journal-util.c
[283/1560] x86_64-pld-linux-gnux32-gcc -Isrc/shared/src@shared@@systemd-shared-239@sta -Isrc/shared -I../src/shared -Isrc/basic -I../src/basic -Isrc/systemd -I../src/systemd -Isrc/journal -I../src/journal -Isrc/journal-remote -I../src/journal-remote -Isrc/nspawn -I../src/nspawn -Isrc/resolve -I../src/resolve -Isrc/timesync -I../src/timesync -I../src/time-wait-sync -Isrc/login -I../src/login -Isrc/udev -I../src/udev -Isrc/libudev -I../src/libudev -Isrc/core -I../src/core -I../src/libsystemd/sd-bus -I../src/libsystemd/sd-device -I../src/libsystemd/sd-hwdb -I../src/libsystemd/sd-id128 -I../src/libsystemd/sd-netlink -I../src/libsystemd/sd-network -Isrc/libsystemd-network -I../src/libsystemd-network -I. -I../ -I/usr/include/blkid -I/usr/include/uuid -fdiagnostics-color=always -pipe -D_FILE_OFFSET_BITS=64 -std=gnu99 -Wextra -Werror=undef -Wlogical-op -Wmissing-include-dirs -Wold-style-definition -Wpointer-arith -Winit-self -Wfloat-equal -Wsuggest-attribute=noreturn -Werror=missing-prototypes -Werror=implicit-function-declaration -Werror=missing-declarations -Werror=return-type -Werror=incompatible-pointer-types -Werror=format=2 -Wstrict-prototypes -Wredundant-decls -Wmissing-noreturn -Wimplicit-fallthrough=5 -Wshadow -Wendif-labels -Wstrict-aliasing=2 -Wwrite-strings -Werror=overflow -Werror=shift-count-overflow -Werror=shift-overflow=2 -Wdate-time -Wnested-externs -ffast-math -fno-common -fdiagnostics-show-option -fno-strict-aliasing -fvisibility=hidden -fstack-protector -fstack-protector-strong --param=ssp-buffer-size=4 -fPIE -ffunction-sections -fdata-sections -Wno-unused-parameter -Wno-missing-field-initializers -Wno-unused-result -Wno-format-signedness -Wno-error=nonnull -Werror=shadow -include config.h -O2 -fwrapv -Wformat -Werror=format-security -gdwarf-4 -fno-debug-types-section -fvar-tracking-assignments -g2 -Wp,-D_FORTIFY_SOURCE=2 -fstack-protector-strong --param=ssp-buffer-size=4 -fPIC -mtune=generic -march=x86-64 -gdwarf-4 -fno-debug-types-section -fvar-tracking-assignments -g2 -fPIC -pthread -fvisibility=default  -MD -MQ 'src/shared/src@shared@@systemd-shared-239@sta/generator.c.o' -MF 'src/shared/src@shared@@systemd-shared-239@sta/generator.c.o.d' -o 'src/shared/src@shared@@systemd-shared-239@sta/generator.c.o' -c ../src/shared/generator.c
[284/1560] x86_64-pld-linux-gnux32-gcc -Isrc/shared/src@shared@@systemd-shared-239@sta -Isrc/shared -I../src/shared -Isrc/basic -I../src/basic -Isrc/systemd -I../src/systemd -Isrc/journal -I../src/journal -Isrc/journal-remote -I../src/journal-remote -Isrc/nspawn -I../src/nspawn -Isrc/resolve -I../src/resolve -Isrc/timesync -I../src/timesync -I../src/time-wait-sync -Isrc/login -I../src/login -Isrc/udev -I../src/udev -Isrc/libudev -I../src/libudev -Isrc/core -I../src/core -I../src/libsystemd/sd-bus -I../src/libsystemd/sd-device -I../src/libsystemd/sd-hwdb -I../src/libsystemd/sd-id128 -I../src/libsystemd/sd-netlink -I../src/libsystemd/sd-network -Isrc/libsystemd-network -I../src/libsystemd-network -I. -I../ -I/usr/include/blkid -I/usr/include/uuid -fdiagnostics-color=always -pipe -D_FILE_OFFSET_BITS=64 -std=gnu99 -Wextra -Werror=undef -Wlogical-op -Wmissing-include-dirs -Wold-style-definition -Wpointer-arith -Winit-self -Wfloat-equal -Wsuggest-attribute=noreturn -Werror=missing-prototypes -Werror=implicit-function-declaration -Werror=missing-declarations -Werror=return-type -Werror=incompatible-pointer-types -Werror=format=2 -Wstrict-prototypes -Wredundant-decls -Wmissing-noreturn -Wimplicit-fallthrough=5 -Wshadow -Wendif-labels -Wstrict-aliasing=2 -Wwrite-strings -Werror=overflow -Werror=shift-count-overflow -Werror=shift-overflow=2 -Wdate-time -Wnested-externs -ffast-math -fno-common -fdiagnostics-show-option -fno-strict-aliasing -fvisibility=hidden -fstack-protector -fstack-protector-strong --param=ssp-buffer-size=4 -fPIE -ffunction-sections -fdata-sections -Wno-unused-parameter -Wno-missing-field-initializers -Wno-unused-result -Wno-format-signedness -Wno-error=nonnull -Werror=shadow -include config.h -O2 -fwrapv -Wformat -Werror=format-security -gdwarf-4 -fno-debug-types-section -fvar-tracking-assignments -g2 -Wp,-D_FORTIFY_SOURCE=2 -fstack-protector-strong --param=ssp-buffer-size=4 -fPIC -mtune=generic -march=x86-64 -gdwarf-4 -fno-debug-types-section -fvar-tracking-assignments -g2 -fPIC -pthread -fvisibility=default  -MD -MQ 'src/shared/src@shared@@systemd-shared-239@sta/dissect-image.c.o' -MF 'src/shared/src@shared@@systemd-shared-239@sta/dissect-image.c.o.d' -o 'src/shared/src@shared@@systemd-shared-239@sta/dissect-image.c.o' -c ../src/shared/dissect-image.c
../src/shared/dissect-image.c: In function ‘dissect_image’:
../src/shared/dissect-image.c:605:55: warning: ‘generic_nr’ may be used uninitialized in this function [-Wmaybe-uninitialized]
                         m->partitions[PARTITION_ROOT] = (DissectedPartition) {
                         ~~~~~~~~~~~~~~~~~~~~~~~~~~~~~~^~~~~~~~~~~~~~~~~~~~~~~~
                                 .found = true,
                                 ~~~~~~~~~~~~~~         
                                 .rw = generic_rw,
                                 ~~~~~~~~~~~~~~~~~      
                                 .partno = generic_nr,
                                 ~~~~~~~~~~~~~~~~~~~~~  
                                 .architecture = _ARCHITECTURE_INVALID,
                                 ~~~~~~~~~~~~~~~~~~~~~~~~~~~~~~~~~~~~~~
                                 .node = TAKE_PTR(generic_node),
                                 ~~~~~~~~~~~~~~~~~~~~~~~~~~~~~~~
                                 .uuid = generic_uuid,
                                 ~~~~~~~~~~~~~~~~~~~~~  
                         };
                         ~                              
../src/shared/dissect-image.c:605:55: warning: ‘generic_rw’ may be used uninitialized in this function [-Wmaybe-uninitialized]
[285/1560] x86_64-pld-linux-gnux32-gcc -Iresolvectl@exe -I. -I.. -Isrc/basic -I../src/basic -Isrc/shared -I../src/shared -Isrc/systemd -I../src/systemd -Isrc/journal -I../src/journal -Isrc/journal-remote -I../src/journal-remote -Isrc/nspawn -I../src/nspawn -Isrc/resolve -I../src/resolve -Isrc/timesync -I../src/timesync -I../src/time-wait-sync -Isrc/login -I../src/login -Isrc/udev -I../src/udev -Isrc/libudev -I../src/libudev -Isrc/core -I../src/core -I../src/libsystemd/sd-bus -I../src/libsystemd/sd-device -I../src/libsystemd/sd-hwdb -I../src/libsystemd/sd-id128 -I../src/libsystemd/sd-netlink -I../src/libsystemd/sd-network -Isrc/libsystemd-network -I../src/libsystemd-network -I../ -fdiagnostics-color=always -pipe -D_FILE_OFFSET_BITS=64 -std=gnu99 -Wextra -Werror=undef -Wlogical-op -Wmissing-include-dirs -Wold-style-definition -Wpointer-arith -Winit-self -Wfloat-equal -Wsuggest-attribute=noreturn -Werror=missing-prototypes -Werror=implicit-function-declaration -Werror=missing-declarations -Werror=return-type -Werror=incompatible-pointer-types -Werror=format=2 -Wstrict-prototypes -Wredundant-decls -Wmissing-noreturn -Wimplicit-fallthrough=5 -Wshadow -Wendif-labels -Wstrict-aliasing=2 -Wwrite-strings -Werror=overflow -Werror=shift-count-overflow -Werror=shift-overflow=2 -Wdate-time -Wnested-externs -ffast-math -fno-common -fdiagnostics-show-option -fno-strict-aliasing -fvisibility=hidden -fstack-protector -fstack-protector-strong --param=ssp-buffer-size=4 -fPIE -ffunction-sections -fdata-sections -Wno-unused-parameter -Wno-missing-field-initializers -Wno-unused-result -Wno-format-signedness -Wno-error=nonnull -Werror=shadow -include config.h -O2 -fwrapv -Wformat -Werror=format-security -gdwarf-4 -fno-debug-types-section -fvar-tracking-assignments -g2 -Wp,-D_FORTIFY_SOURCE=2 -fstack-protector-strong --param=ssp-buffer-size=4 -fPIC -mtune=generic -march=x86-64 -gdwarf-4 -fno-debug-types-section -fvar-tracking-assignments -g2 -pthread  -MD -MQ 'resolvectl@exe/src_resolve_resolvconf-compat.c.o' -MF 'resolvectl@exe/src_resolve_resolvconf-compat.c.o.d' -o 'resolvectl@exe/src_resolve_resolvconf-compat.c.o' -c ../src/resolve/resolvconf-compat.c
[286/1560] /usr/bin/meson --internal symbolextractor libsystemd.so.0.23.0 'systemd@sha/libsystemd.so.0.23.0.symbols' 
[287/1560] x86_64-pld-linux-gnux32-gcc -Isystemd-resolved@exe -I. -I.. -Isrc/basic -I../src/basic -Isrc/shared -I../src/shared -Isrc/systemd -I../src/systemd -Isrc/journal -I../src/journal -Isrc/journal-remote -I../src/journal-remote -Isrc/nspawn -I../src/nspawn -Isrc/resolve -I../src/resolve -Isrc/timesync -I../src/timesync -I../src/time-wait-sync -Isrc/login -I../src/login -Isrc/udev -I../src/udev -Isrc/libudev -I../src/libudev -Isrc/core -I../src/core -I../src/libsystemd/sd-bus -I../src/libsystemd/sd-device -I../src/libsystemd/sd-hwdb -I../src/libsystemd/sd-id128 -I../src/libsystemd/sd-netlink -I../src/libsystemd/sd-network -Isrc/libsystemd-network -I../src/libsystemd-network -I../ -I/usr/include/p11-kit-1 -fdiagnostics-color=always -pipe -D_FILE_OFFSET_BITS=64 -std=gnu99 -Wextra -Werror=undef -Wlogical-op -Wmissing-include-dirs -Wold-style-definition -Wpointer-arith -Winit-self -Wfloat-equal -Wsuggest-attribute=noreturn -Werror=missing-prototypes -Werror=implicit-function-declaration -Werror=missing-declarations -Werror=return-type -Werror=incompatible-pointer-types -Werror=format=2 -Wstrict-prototypes -Wredundant-decls -Wmissing-noreturn -Wimplicit-fallthrough=5 -Wshadow -Wendif-labels -Wstrict-aliasing=2 -Wwrite-strings -Werror=overflow -Werror=shift-count-overflow -Werror=shift-overflow=2 -Wdate-time -Wnested-externs -ffast-math -fno-common -fdiagnostics-show-option -fno-strict-aliasing -fvisibility=hidden -fstack-protector -fstack-protector-strong --param=ssp-buffer-size=4 -fPIE -ffunction-sections -fdata-sections -Wno-unused-parameter -Wno-missing-field-initializers -Wno-unused-result -Wno-format-signedness -Wno-error=nonnull -Werror=shadow -include config.h -O2 -fwrapv -Wformat -Werror=format-security -gdwarf-4 -fno-debug-types-section -fvar-tracking-assignments -g2 -Wp,-D_FORTIFY_SOURCE=2 -fstack-protector-strong --param=ssp-buffer-size=4 -fPIC -mtune=generic -march=x86-64 -gdwarf-4 -fno-debug-types-section -fvar-tracking-assignments -g2 -pthread  -MD -MQ 'systemd-resolved@exe/src_resolve_resolved-etc-hosts.c.o' -MF 'systemd-resolved@exe/src_resolve_resolved-etc-hosts.c.o.d' -o 'systemd-resolved@exe/src_resolve_resolved-etc-hosts.c.o' -c ../src/resolve/resolved-etc-hosts.c
[288/1560] x86_64-pld-linux-gnux32-gcc -Isystemd-resolved@exe -I. -I.. -Isrc/basic -I../src/basic -Isrc/shared -I../src/shared -Isrc/systemd -I../src/systemd -Isrc/journal -I../src/journal -Isrc/journal-remote -I../src/journal-remote -Isrc/nspawn -I../src/nspawn -Isrc/resolve -I../src/resolve -Isrc/timesync -I../src/timesync -I../src/time-wait-sync -Isrc/login -I../src/login -Isrc/udev -I../src/udev -Isrc/libudev -I../src/libudev -Isrc/core -I../src/core -I../src/libsystemd/sd-bus -I../src/libsystemd/sd-device -I../src/libsystemd/sd-hwdb -I../src/libsystemd/sd-id128 -I../src/libsystemd/sd-netlink -I../src/libsystemd/sd-network -Isrc/libsystemd-network -I../src/libsystemd-network -I../ -I/usr/include/p11-kit-1 -fdiagnostics-color=always -pipe -D_FILE_OFFSET_BITS=64 -std=gnu99 -Wextra -Werror=undef -Wlogical-op -Wmissing-include-dirs -Wold-style-definition -Wpointer-arith -Winit-self -Wfloat-equal -Wsuggest-attribute=noreturn -Werror=missing-prototypes -Werror=implicit-function-declaration -Werror=missing-declarations -Werror=return-type -Werror=incompatible-pointer-types -Werror=format=2 -Wstrict-prototypes -Wredundant-decls -Wmissing-noreturn -Wimplicit-fallthrough=5 -Wshadow -Wendif-labels -Wstrict-aliasing=2 -Wwrite-strings -Werror=overflow -Werror=shift-count-overflow -Werror=shift-overflow=2 -Wdate-time -Wnested-externs -ffast-math -fno-common -fdiagnostics-show-option -fno-strict-aliasing -fvisibility=hidden -fstack-protector -fstack-protector-strong --param=ssp-buffer-size=4 -fPIE -ffunction-sections -fdata-sections -Wno-unused-parameter -Wno-missing-field-initializers -Wno-unused-result -Wno-format-signedness -Wno-error=nonnull -Werror=shadow -include config.h -O2 -fwrapv -Wformat -Werror=format-security -gdwarf-4 -fno-debug-types-section -fvar-tracking-assignments -g2 -Wp,-D_FORTIFY_SOURCE=2 -fstack-protector-strong --param=ssp-buffer-size=4 -fPIC -mtune=generic -march=x86-64 -gdwarf-4 -fno-debug-types-section -fvar-tracking-assignments -g2 -pthread  -MD -MQ 'systemd-resolved@exe/src_resolve_resolved-dns-stub.c.o' -MF 'systemd-resolved@exe/src_resolve_resolved-dns-stub.c.o.d' -o 'systemd-resolved@exe/src_resolve_resolved-dns-stub.c.o' -c ../src/resolve/resolved-dns-stub.c
[289/1560] x86_64-pld-linux-gnux32-gcc -Isrc/shared/src@shared@@systemd-shared-239@sta -Isrc/shared -I../src/shared -Isrc/basic -I../src/basic -Isrc/systemd -I../src/systemd -Isrc/journal -I../src/journal -Isrc/journal-remote -I../src/journal-remote -Isrc/nspawn -I../src/nspawn -Isrc/resolve -I../src/resolve -Isrc/timesync -I../src/timesync -I../src/time-wait-sync -Isrc/login -I../src/login -Isrc/udev -I../src/udev -Isrc/libudev -I../src/libudev -Isrc/core -I../src/core -I../src/libsystemd/sd-bus -I../src/libsystemd/sd-device -I../src/libsystemd/sd-hwdb -I../src/libsystemd/sd-id128 -I../src/libsystemd/sd-netlink -I../src/libsystemd/sd-network -Isrc/libsystemd-network -I../src/libsystemd-network -I. -I../ -I/usr/include/blkid -I/usr/include/uuid -fdiagnostics-color=always -pipe -D_FILE_OFFSET_BITS=64 -std=gnu99 -Wextra -Werror=undef -Wlogical-op -Wmissing-include-dirs -Wold-style-definition -Wpointer-arith -Winit-self -Wfloat-equal -Wsuggest-attribute=noreturn -Werror=missing-prototypes -Werror=implicit-function-declaration -Werror=missing-declarations -Werror=return-type -Werror=incompatible-pointer-types -Werror=format=2 -Wstrict-prototypes -Wredundant-decls -Wmissing-noreturn -Wimplicit-fallthrough=5 -Wshadow -Wendif-labels -Wstrict-aliasing=2 -Wwrite-strings -Werror=overflow -Werror=shift-count-overflow -Werror=shift-overflow=2 -Wdate-time -Wnested-externs -ffast-math -fno-common -fdiagnostics-show-option -fno-strict-aliasing -fvisibility=hidden -fstack-protector -fstack-protector-strong --param=ssp-buffer-size=4 -fPIE -ffunction-sections -fdata-sections -Wno-unused-parameter -Wno-missing-field-initializers -Wno-unused-result -Wno-format-signedness -Wno-error=nonnull -Werror=shadow -include config.h -O2 -fwrapv -Wformat -Werror=format-security -gdwarf-4 -fno-debug-types-section -fvar-tracking-assignments -g2 -Wp,-D_FORTIFY_SOURCE=2 -fstack-protector-strong --param=ssp-buffer-size=4 -fPIC -mtune=generic -march=x86-64 -gdwarf-4 -fno-debug-types-section -fvar-tracking-assignments -g2 -fPIC -pthread -fvisibility=default  -MD -MQ 'src/shared/src@shared@@systemd-shared-239@sta/spawn-ask-password-agent.c.o' -MF 'src/shared/src@shared@@systemd-shared-239@sta/spawn-ask-password-agent.c.o.d' -o 'src/shared/src@shared@@systemd-shared-239@sta/spawn-ask-password-agent.c.o' -c ../src/shared/spawn-ask-password-agent.c
[290/1560] x86_64-pld-linux-gnux32-gcc -Isystemd-resolved@exe -I. -I.. -Isrc/basic -I../src/basic -Isrc/shared -I../src/shared -Isrc/systemd -I../src/systemd -Isrc/journal -I../src/journal -Isrc/journal-remote -I../src/journal-remote -Isrc/nspawn -I../src/nspawn -Isrc/resolve -I../src/resolve -Isrc/timesync -I../src/timesync -I../src/time-wait-sync -Isrc/login -I../src/login -Isrc/udev -I../src/udev -Isrc/libudev -I../src/libudev -Isrc/core -I../src/core -I../src/libsystemd/sd-bus -I../src/libsystemd/sd-device -I../src/libsystemd/sd-hwdb -I../src/libsystemd/sd-id128 -I../src/libsystemd/sd-netlink -I../src/libsystemd/sd-network -Isrc/libsystemd-network -I../src/libsystemd-network -I../ -I/usr/include/p11-kit-1 -fdiagnostics-color=always -pipe -D_FILE_OFFSET_BITS=64 -std=gnu99 -Wextra -Werror=undef -Wlogical-op -Wmissing-include-dirs -Wold-style-definition -Wpointer-arith -Winit-self -Wfloat-equal -Wsuggest-attribute=noreturn -Werror=missing-prototypes -Werror=implicit-function-declaration -Werror=missing-declarations -Werror=return-type -Werror=incompatible-pointer-types -Werror=format=2 -Wstrict-prototypes -Wredundant-decls -Wmissing-noreturn -Wimplicit-fallthrough=5 -Wshadow -Wendif-labels -Wstrict-aliasing=2 -Wwrite-strings -Werror=overflow -Werror=shift-count-overflow -Werror=shift-overflow=2 -Wdate-time -Wnested-externs -ffast-math -fno-common -fdiagnostics-show-option -fno-strict-aliasing -fvisibility=hidden -fstack-protector -fstack-protector-strong --param=ssp-buffer-size=4 -fPIE -ffunction-sections -fdata-sections -Wno-unused-parameter -Wno-missing-field-initializers -Wno-unused-result -Wno-format-signedness -Wno-error=nonnull -Werror=shadow -include config.h -O2 -fwrapv -Wformat -Werror=format-security -gdwarf-4 -fno-debug-types-section -fvar-tracking-assignments -g2 -Wp,-D_FORTIFY_SOURCE=2 -fstack-protector-strong --param=ssp-buffer-size=4 -fPIC -mtune=generic -march=x86-64 -gdwarf-4 -fno-debug-types-section -fvar-tracking-assignments -g2 -pthread  -MD -MQ 'systemd-resolved@exe/src_resolve_resolved-dns-zone.c.o' -MF 'systemd-resolved@exe/src_resolve_resolved-dns-zone.c.o.d' -o 'systemd-resolved@exe/src_resolve_resolved-dns-zone.c.o' -c ../src/resolve/resolved-dns-zone.c
[291/1560] x86_64-pld-linux-gnux32-gcc -Isrc/shared/src@shared@@systemd-shared-239@sta -Isrc/shared -I../src/shared -Isrc/basic -I../src/basic -Isrc/systemd -I../src/systemd -Isrc/journal -I../src/journal -Isrc/journal-remote -I../src/journal-remote -Isrc/nspawn -I../src/nspawn -Isrc/resolve -I../src/resolve -Isrc/timesync -I../src/timesync -I../src/time-wait-sync -Isrc/login -I../src/login -Isrc/udev -I../src/udev -Isrc/libudev -I../src/libudev -Isrc/core -I../src/core -I../src/libsystemd/sd-bus -I../src/libsystemd/sd-device -I../src/libsystemd/sd-hwdb -I../src/libsystemd/sd-id128 -I../src/libsystemd/sd-netlink -I../src/libsystemd/sd-network -Isrc/libsystemd-network -I../src/libsystemd-network -I. -I../ -I/usr/include/blkid -I/usr/include/uuid -fdiagnostics-color=always -pipe -D_FILE_OFFSET_BITS=64 -std=gnu99 -Wextra -Werror=undef -Wlogical-op -Wmissing-include-dirs -Wold-style-definition -Wpointer-arith -Winit-self -Wfloat-equal -Wsuggest-attribute=noreturn -Werror=missing-prototypes -Werror=implicit-function-declaration -Werror=missing-declarations -Werror=return-type -Werror=incompatible-pointer-types -Werror=format=2 -Wstrict-prototypes -Wredundant-decls -Wmissing-noreturn -Wimplicit-fallthrough=5 -Wshadow -Wendif-labels -Wstrict-aliasing=2 -Wwrite-strings -Werror=overflow -Werror=shift-count-overflow -Werror=shift-overflow=2 -Wdate-time -Wnested-externs -ffast-math -fno-common -fdiagnostics-show-option -fno-strict-aliasing -fvisibility=hidden -fstack-protector -fstack-protector-strong --param=ssp-buffer-size=4 -fPIE -ffunction-sections -fdata-sections -Wno-unused-parameter -Wno-missing-field-initializers -Wno-unused-result -Wno-format-signedness -Wno-error=nonnull -Werror=shadow -include config.h -O2 -fwrapv -Wformat -Werror=format-security -gdwarf-4 -fno-debug-types-section -fvar-tracking-assignments -g2 -Wp,-D_FORTIFY_SOURCE=2 -fstack-protector-strong --param=ssp-buffer-size=4 -fPIC -mtune=generic -march=x86-64 -gdwarf-4 -fno-debug-types-section -fvar-tracking-assignments -g2 -fPIC -pthread -fvisibility=default  -MD -MQ 'src/shared/src@shared@@systemd-shared-239@sta/spawn-polkit-agent.c.o' -MF 'src/shared/src@shared@@systemd-shared-239@sta/spawn-polkit-agent.c.o.d' -o 'src/shared/src@shared@@systemd-shared-239@sta/spawn-polkit-agent.c.o' -c ../src/shared/spawn-polkit-agent.c
[292/1560] x86_64-pld-linux-gnux32-gcc -Isrc/core/src@core@@core@sta -Isrc/core -I../src/core -Isrc/basic -I../src/basic -Isrc/shared -I../src/shared -Isrc/systemd -I../src/systemd -Isrc/journal -I../src/journal -Isrc/journal-remote -I../src/journal-remote -Isrc/nspawn -I../src/nspawn -Isrc/resolve -I../src/resolve -Isrc/timesync -I../src/timesync -I../src/time-wait-sync -Isrc/login -I../src/login -Isrc/udev -I../src/udev -Isrc/libudev -I../src/libudev -I../src/libsystemd/sd-bus -I../src/libsystemd/sd-device -I../src/libsystemd/sd-hwdb -I../src/libsystemd/sd-id128 -I../src/libsystemd/sd-netlink -I../src/libsystemd/sd-network -Isrc/libsystemd-network -I../src/libsystemd-network -I. -I../ -I/usr/include/libmount -I/usr/include/blkid -I/usr/include/uuid -fdiagnostics-color=always -pipe -D_FILE_OFFSET_BITS=64 -std=gnu99 -Wextra -Werror=undef -Wlogical-op -Wmissing-include-dirs -Wold-style-definition -Wpointer-arith -Winit-self -Wfloat-equal -Wsuggest-attribute=noreturn -Werror=missing-prototypes -Werror=implicit-function-declaration -Werror=missing-declarations -Werror=return-type -Werror=incompatible-pointer-types -Werror=format=2 -Wstrict-prototypes -Wredundant-decls -Wmissing-noreturn -Wimplicit-fallthrough=5 -Wshadow -Wendif-labels -Wstrict-aliasing=2 -Wwrite-strings -Werror=overflow -Werror=shift-count-overflow -Werror=shift-overflow=2 -Wdate-time -Wnested-externs -ffast-math -fno-common -fdiagnostics-show-option -fno-strict-aliasing -fvisibility=hidden -fstack-protector -fstack-protector-strong --param=ssp-buffer-size=4 -fPIE -ffunction-sections -fdata-sections -Wno-unused-parameter -Wno-missing-field-initializers -Wno-unused-result -Wno-format-signedness -Wno-error=nonnull -Werror=shadow -include config.h -O2 -fwrapv -Wformat -Werror=format-security -gdwarf-4 -fno-debug-types-section -fvar-tracking-assignments -g2 -Wp,-D_FORTIFY_SOURCE=2 -fstack-protector-strong --param=ssp-buffer-size=4 -fPIC -mtune=generic -march=x86-64 -gdwarf-4 -fno-debug-types-section -fvar-tracking-assignments -g2 -fPIC -pthread  -MD -MQ 'src/core/src@core@@core@sta/load-fragment.c.o' -MF 'src/core/src@core@@core@sta/load-fragment.c.o.d' -o 'src/core/src@core@@core@sta/load-fragment.c.o' -c ../src/core/load-fragment.c
[293/1560] x86_64-pld-linux-gnux32-gcc -Isrc/shared/src@shared@@systemd-shared-239@sta -Isrc/shared -I../src/shared -Isrc/basic -I../src/basic -Isrc/systemd -I../src/systemd -Isrc/journal -I../src/journal -Isrc/journal-remote -I../src/journal-remote -Isrc/nspawn -I../src/nspawn -Isrc/resolve -I../src/resolve -Isrc/timesync -I../src/timesync -I../src/time-wait-sync -Isrc/login -I../src/login -Isrc/udev -I../src/udev -Isrc/libudev -I../src/libudev -Isrc/core -I../src/core -I../src/libsystemd/sd-bus -I../src/libsystemd/sd-device -I../src/libsystemd/sd-hwdb -I../src/libsystemd/sd-id128 -I../src/libsystemd/sd-netlink -I../src/libsystemd/sd-network -Isrc/libsystemd-network -I../src/libsystemd-network -I. -I../ -I/usr/include/blkid -I/usr/include/uuid -fdiagnostics-color=always -pipe -D_FILE_OFFSET_BITS=64 -std=gnu99 -Wextra -Werror=undef -Wlogical-op -Wmissing-include-dirs -Wold-style-definition -Wpointer-arith -Winit-self -Wfloat-equal -Wsuggest-attribute=noreturn -Werror=missing-prototypes -Werror=implicit-function-declaration -Werror=missing-declarations -Werror=return-type -Werror=incompatible-pointer-types -Werror=format=2 -Wstrict-prototypes -Wredundant-decls -Wmissing-noreturn -Wimplicit-fallthrough=5 -Wshadow -Wendif-labels -Wstrict-aliasing=2 -Wwrite-strings -Werror=overflow -Werror=shift-count-overflow -Werror=shift-overflow=2 -Wdate-time -Wnested-externs -ffast-math -fno-common -fdiagnostics-show-option -fno-strict-aliasing -fvisibility=hidden -fstack-protector -fstack-protector-strong --param=ssp-buffer-size=4 -fPIE -ffunction-sections -fdata-sections -Wno-unused-parameter -Wno-missing-field-initializers -Wno-unused-result -Wno-format-signedness -Wno-error=nonnull -Werror=shadow -include config.h -O2 -fwrapv -Wformat -Werror=format-security -gdwarf-4 -fno-debug-types-section -fvar-tracking-assignments -g2 -Wp,-D_FORTIFY_SOURCE=2 -fstack-protector-strong --param=ssp-buffer-size=4 -fPIC -mtune=generic -march=x86-64 -gdwarf-4 -fno-debug-types-section -fvar-tracking-assignments -g2 -fPIC -pthread -fvisibility=default  -MD -MQ 'src/shared/src@shared@@systemd-shared-239@sta/sleep-config.c.o' -MF 'src/shared/src@shared@@systemd-shared-239@sta/sleep-config.c.o.d' -o 'src/shared/src@shared@@systemd-shared-239@sta/sleep-config.c.o' -c ../src/shared/sleep-config.c
[294/1560] x86_64-pld-linux-gnux32-gcc -Isrc/shared/src@shared@@systemd-shared-239@sta -Isrc/shared -I../src/shared -Isrc/basic -I../src/basic -Isrc/systemd -I../src/systemd -Isrc/journal -I../src/journal -Isrc/journal-remote -I../src/journal-remote -Isrc/nspawn -I../src/nspawn -Isrc/resolve -I../src/resolve -Isrc/timesync -I../src/timesync -I../src/time-wait-sync -Isrc/login -I../src/login -Isrc/udev -I../src/udev -Isrc/libudev -I../src/libudev -Isrc/core -I../src/core -I../src/libsystemd/sd-bus -I../src/libsystemd/sd-device -I../src/libsystemd/sd-hwdb -I../src/libsystemd/sd-id128 -I../src/libsystemd/sd-netlink -I../src/libsystemd/sd-network -Isrc/libsystemd-network -I../src/libsystemd-network -I. -I../ -I/usr/include/blkid -I/usr/include/uuid -fdiagnostics-color=always -pipe -D_FILE_OFFSET_BITS=64 -std=gnu99 -Wextra -Werror=undef -Wlogical-op -Wmissing-include-dirs -Wold-style-definition -Wpointer-arith -Winit-self -Wfloat-equal -Wsuggest-attribute=noreturn -Werror=missing-prototypes -Werror=implicit-function-declaration -Werror=missing-declarations -Werror=return-type -Werror=incompatible-pointer-types -Werror=format=2 -Wstrict-prototypes -Wredundant-decls -Wmissing-noreturn -Wimplicit-fallthrough=5 -Wshadow -Wendif-labels -Wstrict-aliasing=2 -Wwrite-strings -Werror=overflow -Werror=shift-count-overflow -Werror=shift-overflow=2 -Wdate-time -Wnested-externs -ffast-math -fno-common -fdiagnostics-show-option -fno-strict-aliasing -fvisibility=hidden -fstack-protector -fstack-protector-strong --param=ssp-buffer-size=4 -fPIE -ffunction-sections -fdata-sections -Wno-unused-parameter -Wno-missing-field-initializers -Wno-unused-result -Wno-format-signedness -Wno-error=nonnull -Werror=shadow -include config.h -O2 -fwrapv -Wformat -Werror=format-security -gdwarf-4 -fno-debug-types-section -fvar-tracking-assignments -g2 -Wp,-D_FORTIFY_SOURCE=2 -fstack-protector-strong --param=ssp-buffer-size=4 -fPIC -mtune=generic -march=x86-64 -gdwarf-4 -fno-debug-types-section -fvar-tracking-assignments -g2 -fPIC -pthread -fvisibility=default  -MD -MQ 'src/shared/src@shared@@systemd-shared-239@sta/tomoyo-util.c.o' -MF 'src/shared/src@shared@@systemd-shared-239@sta/tomoyo-util.c.o.d' -o 'src/shared/src@shared@@systemd-shared-239@sta/tomoyo-util.c.o' -c ../src/shared/tomoyo-util.c
[295/1560] x86_64-pld-linux-gnux32-gcc -Isrc/shared/src@shared@@systemd-shared-239@sta -Isrc/shared -I../src/shared -Isrc/basic -I../src/basic -Isrc/systemd -I../src/systemd -Isrc/journal -I../src/journal -Isrc/journal-remote -I../src/journal-remote -Isrc/nspawn -I../src/nspawn -Isrc/resolve -I../src/resolve -Isrc/timesync -I../src/timesync -I../src/time-wait-sync -Isrc/login -I../src/login -Isrc/udev -I../src/udev -Isrc/libudev -I../src/libudev -Isrc/core -I../src/core -I../src/libsystemd/sd-bus -I../src/libsystemd/sd-device -I../src/libsystemd/sd-hwdb -I../src/libsystemd/sd-id128 -I../src/libsystemd/sd-netlink -I../src/libsystemd/sd-network -Isrc/libsystemd-network -I../src/libsystemd-network -I. -I../ -I/usr/include/blkid -I/usr/include/uuid -fdiagnostics-color=always -pipe -D_FILE_OFFSET_BITS=64 -std=gnu99 -Wextra -Werror=undef -Wlogical-op -Wmissing-include-dirs -Wold-style-definition -Wpointer-arith -Winit-self -Wfloat-equal -Wsuggest-attribute=noreturn -Werror=missing-prototypes -Werror=implicit-function-declaration -Werror=missing-declarations -Werror=return-type -Werror=incompatible-pointer-types -Werror=format=2 -Wstrict-prototypes -Wredundant-decls -Wmissing-noreturn -Wimplicit-fallthrough=5 -Wshadow -Wendif-labels -Wstrict-aliasing=2 -Wwrite-strings -Werror=overflow -Werror=shift-count-overflow -Werror=shift-overflow=2 -Wdate-time -Wnested-externs -ffast-math -fno-common -fdiagnostics-show-option -fno-strict-aliasing -fvisibility=hidden -fstack-protector -fstack-protector-strong --param=ssp-buffer-size=4 -fPIE -ffunction-sections -fdata-sections -Wno-unused-parameter -Wno-missing-field-initializers -Wno-unused-result -Wno-format-signedness -Wno-error=nonnull -Werror=shadow -include config.h -O2 -fwrapv -Wformat -Werror=format-security -gdwarf-4 -fno-debug-types-section -fvar-tracking-assignments -g2 -Wp,-D_FORTIFY_SOURCE=2 -fstack-protector-strong --param=ssp-buffer-size=4 -fPIC -mtune=generic -march=x86-64 -gdwarf-4 -fno-debug-types-section -fvar-tracking-assignments -g2 -fPIC -pthread -fvisibility=default  -MD -MQ 'src/shared/src@shared@@systemd-shared-239@sta/sysctl-util.c.o' -MF 'src/shared/src@shared@@systemd-shared-239@sta/sysctl-util.c.o.d' -o 'src/shared/src@shared@@systemd-shared-239@sta/sysctl-util.c.o' -c ../src/shared/sysctl-util.c
[296/1560] x86_64-pld-linux-gnux32-gcc -Isrc/shared/src@shared@@systemd-shared-239@sta -Isrc/shared -I../src/shared -Isrc/basic -I../src/basic -Isrc/systemd -I../src/systemd -Isrc/journal -I../src/journal -Isrc/journal-remote -I../src/journal-remote -Isrc/nspawn -I../src/nspawn -Isrc/resolve -I../src/resolve -Isrc/timesync -I../src/timesync -I../src/time-wait-sync -Isrc/login -I../src/login -Isrc/udev -I../src/udev -Isrc/libudev -I../src/libudev -Isrc/core -I../src/core -I../src/libsystemd/sd-bus -I../src/libsystemd/sd-device -I../src/libsystemd/sd-hwdb -I../src/libsystemd/sd-id128 -I../src/libsystemd/sd-netlink -I../src/libsystemd/sd-network -Isrc/libsystemd-network -I../src/libsystemd-network -I. -I../ -I/usr/include/blkid -I/usr/include/uuid -fdiagnostics-color=always -pipe -D_FILE_OFFSET_BITS=64 -std=gnu99 -Wextra -Werror=undef -Wlogical-op -Wmissing-include-dirs -Wold-style-definition -Wpointer-arith -Winit-self -Wfloat-equal -Wsuggest-attribute=noreturn -Werror=missing-prototypes -Werror=implicit-function-declaration -Werror=missing-declarations -Werror=return-type -Werror=incompatible-pointer-types -Werror=format=2 -Wstrict-prototypes -Wredundant-decls -Wmissing-noreturn -Wimplicit-fallthrough=5 -Wshadow -Wendif-labels -Wstrict-aliasing=2 -Wwrite-strings -Werror=overflow -Werror=shift-count-overflow -Werror=shift-overflow=2 -Wdate-time -Wnested-externs -ffast-math -fno-common -fdiagnostics-show-option -fno-strict-aliasing -fvisibility=hidden -fstack-protector -fstack-protector-strong --param=ssp-buffer-size=4 -fPIE -ffunction-sections -fdata-sections -Wno-unused-parameter -Wno-missing-field-initializers -Wno-unused-result -Wno-format-signedness -Wno-error=nonnull -Werror=shadow -include config.h -O2 -fwrapv -Wformat -Werror=format-security -gdwarf-4 -fno-debug-types-section -fvar-tracking-assignments -g2 -Wp,-D_FORTIFY_SOURCE=2 -fstack-protector-strong --param=ssp-buffer-size=4 -fPIC -mtune=generic -march=x86-64 -gdwarf-4 -fno-debug-types-section -fvar-tracking-assignments -g2 -fPIC -pthread -fvisibility=default  -MD -MQ 'src/shared/src@shared@@systemd-shared-239@sta/specifier.c.o' -MF 'src/shared/src@shared@@systemd-shared-239@sta/specifier.c.o.d' -o 'src/shared/src@shared@@systemd-shared-239@sta/specifier.c.o' -c ../src/shared/specifier.c
[297/1560] x86_64-pld-linux-gnux32-gcc -Isrc/shared/src@shared@@systemd-shared-239@sta -Isrc/shared -I../src/shared -Isrc/basic -I../src/basic -Isrc/systemd -I../src/systemd -Isrc/journal -I../src/journal -Isrc/journal-remote -I../src/journal-remote -Isrc/nspawn -I../src/nspawn -Isrc/resolve -I../src/resolve -Isrc/timesync -I../src/timesync -I../src/time-wait-sync -Isrc/login -I../src/login -Isrc/udev -I../src/udev -Isrc/libudev -I../src/libudev -Isrc/core -I../src/core -I../src/libsystemd/sd-bus -I../src/libsystemd/sd-device -I../src/libsystemd/sd-hwdb -I../src/libsystemd/sd-id128 -I../src/libsystemd/sd-netlink -I../src/libsystemd/sd-network -Isrc/libsystemd-network -I../src/libsystemd-network -I. -I../ -I/usr/include/blkid -I/usr/include/uuid -fdiagnostics-color=always -pipe -D_FILE_OFFSET_BITS=64 -std=gnu99 -Wextra -Werror=undef -Wlogical-op -Wmissing-include-dirs -Wold-style-definition -Wpointer-arith -Winit-self -Wfloat-equal -Wsuggest-attribute=noreturn -Werror=missing-prototypes -Werror=implicit-function-declaration -Werror=missing-declarations -Werror=return-type -Werror=incompatible-pointer-types -Werror=format=2 -Wstrict-prototypes -Wredundant-decls -Wmissing-noreturn -Wimplicit-fallthrough=5 -Wshadow -Wendif-labels -Wstrict-aliasing=2 -Wwrite-strings -Werror=overflow -Werror=shift-count-overflow -Werror=shift-overflow=2 -Wdate-time -Wnested-externs -ffast-math -fno-common -fdiagnostics-show-option -fno-strict-aliasing -fvisibility=hidden -fstack-protector -fstack-protector-strong --param=ssp-buffer-size=4 -fPIE -ffunction-sections -fdata-sections -Wno-unused-parameter -Wno-missing-field-initializers -Wno-unused-result -Wno-format-signedness -Wno-error=nonnull -Werror=shadow -include config.h -O2 -fwrapv -Wformat -Werror=format-security -gdwarf-4 -fno-debug-types-section -fvar-tracking-assignments -g2 -Wp,-D_FORTIFY_SOURCE=2 -fstack-protector-strong --param=ssp-buffer-size=4 -fPIC -mtune=generic -march=x86-64 -gdwarf-4 -fno-debug-types-section -fvar-tracking-assignments -g2 -fPIC -pthread -fvisibility=default  -MD -MQ 'src/shared/src@shared@@systemd-shared-239@sta/switch-root.c.o' -MF 'src/shared/src@shared@@systemd-shared-239@sta/switch-root.c.o.d' -o 'src/shared/src@shared@@systemd-shared-239@sta/switch-root.c.o' -c ../src/shared/switch-root.c
[298/1560] x86_64-pld-linux-gnux32-gcc -Isrc/shared/src@shared@@systemd-shared-239@sta -Isrc/shared -I../src/shared -Isrc/basic -I../src/basic -Isrc/systemd -I../src/systemd -Isrc/journal -I../src/journal -Isrc/journal-remote -I../src/journal-remote -Isrc/nspawn -I../src/nspawn -Isrc/resolve -I../src/resolve -Isrc/timesync -I../src/timesync -I../src/time-wait-sync -Isrc/login -I../src/login -Isrc/udev -I../src/udev -Isrc/libudev -I../src/libudev -Isrc/core -I../src/core -I../src/libsystemd/sd-bus -I../src/libsystemd/sd-device -I../src/libsystemd/sd-hwdb -I../src/libsystemd/sd-id128 -I../src/libsystemd/sd-netlink -I../src/libsystemd/sd-network -Isrc/libsystemd-network -I../src/libsystemd-network -I. -I../ -I/usr/include/blkid -I/usr/include/uuid -fdiagnostics-color=always -pipe -D_FILE_OFFSET_BITS=64 -std=gnu99 -Wextra -Werror=undef -Wlogical-op -Wmissing-include-dirs -Wold-style-definition -Wpointer-arith -Winit-self -Wfloat-equal -Wsuggest-attribute=noreturn -Werror=missing-prototypes -Werror=implicit-function-declaration -Werror=missing-declarations -Werror=return-type -Werror=incompatible-pointer-types -Werror=format=2 -Wstrict-prototypes -Wredundant-decls -Wmissing-noreturn -Wimplicit-fallthrough=5 -Wshadow -Wendif-labels -Wstrict-aliasing=2 -Wwrite-strings -Werror=overflow -Werror=shift-count-overflow -Werror=shift-overflow=2 -Wdate-time -Wnested-externs -ffast-math -fno-common -fdiagnostics-show-option -fno-strict-aliasing -fvisibility=hidden -fstack-protector -fstack-protector-strong --param=ssp-buffer-size=4 -fPIE -ffunction-sections -fdata-sections -Wno-unused-parameter -Wno-missing-field-initializers -Wno-unused-result -Wno-format-signedness -Wno-error=nonnull -Werror=shadow -include config.h -O2 -fwrapv -Wformat -Werror=format-security -gdwarf-4 -fno-debug-types-section -fvar-tracking-assignments -g2 -Wp,-D_FORTIFY_SOURCE=2 -fstack-protector-strong --param=ssp-buffer-size=4 -fPIC -mtune=generic -march=x86-64 -gdwarf-4 -fno-debug-types-section -fvar-tracking-assignments -g2 -fPIC -pthread -fvisibility=default  -MD -MQ 'src/shared/src@shared@@systemd-shared-239@sta/tests.c.o' -MF 'src/shared/src@shared@@systemd-shared-239@sta/tests.c.o.d' -o 'src/shared/src@shared@@systemd-shared-239@sta/tests.c.o' -c ../src/shared/tests.c
[299/1560] x86_64-pld-linux-gnux32-gcc -Isrc/shared/src@shared@@systemd-shared-239@sta -Isrc/shared -I../src/shared -Isrc/basic -I../src/basic -Isrc/systemd -I../src/systemd -Isrc/journal -I../src/journal -Isrc/journal-remote -I../src/journal-remote -Isrc/nspawn -I../src/nspawn -Isrc/resolve -I../src/resolve -Isrc/timesync -I../src/timesync -I../src/time-wait-sync -Isrc/login -I../src/login -Isrc/udev -I../src/udev -Isrc/libudev -I../src/libudev -Isrc/core -I../src/core -I../src/libsystemd/sd-bus -I../src/libsystemd/sd-device -I../src/libsystemd/sd-hwdb -I../src/libsystemd/sd-id128 -I../src/libsystemd/sd-netlink -I../src/libsystemd/sd-network -Isrc/libsystemd-network -I../src/libsystemd-network -I. -I../ -I/usr/include/blkid -I/usr/include/uuid -fdiagnostics-color=always -pipe -D_FILE_OFFSET_BITS=64 -std=gnu99 -Wextra -Werror=undef -Wlogical-op -Wmissing-include-dirs -Wold-style-definition -Wpointer-arith -Winit-self -Wfloat-equal -Wsuggest-attribute=noreturn -Werror=missing-prototypes -Werror=implicit-function-declaration -Werror=missing-declarations -Werror=return-type -Werror=incompatible-pointer-types -Werror=format=2 -Wstrict-prototypes -Wredundant-decls -Wmissing-noreturn -Wimplicit-fallthrough=5 -Wshadow -Wendif-labels -Wstrict-aliasing=2 -Wwrite-strings -Werror=overflow -Werror=shift-count-overflow -Werror=shift-overflow=2 -Wdate-time -Wnested-externs -ffast-math -fno-common -fdiagnostics-show-option -fno-strict-aliasing -fvisibility=hidden -fstack-protector -fstack-protector-strong --param=ssp-buffer-size=4 -fPIE -ffunction-sections -fdata-sections -Wno-unused-parameter -Wno-missing-field-initializers -Wno-unused-result -Wno-format-signedness -Wno-error=nonnull -Werror=shadow -include config.h -O2 -fwrapv -Wformat -Werror=format-security -gdwarf-4 -fno-debug-types-section -fvar-tracking-assignments -g2 -Wp,-D_FORTIFY_SOURCE=2 -fstack-protector-strong --param=ssp-buffer-size=4 -fPIC -mtune=generic -march=x86-64 -gdwarf-4 -fno-debug-types-section -fvar-tracking-assignments -g2 -fPIC -pthread -fvisibility=default  -MD -MQ 'src/shared/src@shared@@systemd-shared-239@sta/udev-util.c.o' -MF 'src/shared/src@shared@@systemd-shared-239@sta/udev-util.c.o.d' -o 'src/shared/src@shared@@systemd-shared-239@sta/udev-util.c.o' -c ../src/shared/udev-util.c
[300/1560] x86_64-pld-linux-gnux32-gcc -Isrc/shared/src@shared@@systemd-shared-239@sta -Isrc/shared -I../src/shared -Isrc/basic -I../src/basic -Isrc/systemd -I../src/systemd -Isrc/journal -I../src/journal -Isrc/journal-remote -I../src/journal-remote -Isrc/nspawn -I../src/nspawn -Isrc/resolve -I../src/resolve -Isrc/timesync -I../src/timesync -I../src/time-wait-sync -Isrc/login -I../src/login -Isrc/udev -I../src/udev -Isrc/libudev -I../src/libudev -Isrc/core -I../src/core -I../src/libsystemd/sd-bus -I../src/libsystemd/sd-device -I../src/libsystemd/sd-hwdb -I../src/libsystemd/sd-id128 -I../src/libsystemd/sd-netlink -I../src/libsystemd/sd-network -Isrc/libsystemd-network -I../src/libsystemd-network -I. -I../ -I/usr/include/blkid -I/usr/include/uuid -fdiagnostics-color=always -pipe -D_FILE_OFFSET_BITS=64 -std=gnu99 -Wextra -Werror=undef -Wlogical-op -Wmissing-include-dirs -Wold-style-definition -Wpointer-arith -Winit-self -Wfloat-equal -Wsuggest-attribute=noreturn -Werror=missing-prototypes -Werror=implicit-function-declaration -Werror=missing-declarations -Werror=return-type -Werror=incompatible-pointer-types -Werror=format=2 -Wstrict-prototypes -Wredundant-decls -Wmissing-noreturn -Wimplicit-fallthrough=5 -Wshadow -Wendif-labels -Wstrict-aliasing=2 -Wwrite-strings -Werror=overflow -Werror=shift-count-overflow -Werror=shift-overflow=2 -Wdate-time -Wnested-externs -ffast-math -fno-common -fdiagnostics-show-option -fno-strict-aliasing -fvisibility=hidden -fstack-protector -fstack-protector-strong --param=ssp-buffer-size=4 -fPIE -ffunction-sections -fdata-sections -Wno-unused-parameter -Wno-missing-field-initializers -Wno-unused-result -Wno-format-signedness -Wno-error=nonnull -Werror=shadow -include config.h -O2 -fwrapv -Wformat -Werror=format-security -gdwarf-4 -fno-debug-types-section -fvar-tracking-assignments -g2 -Wp,-D_FORTIFY_SOURCE=2 -fstack-protector-strong --param=ssp-buffer-size=4 -fPIC -mtune=generic -march=x86-64 -gdwarf-4 -fno-debug-types-section -fvar-tracking-assignments -g2 -fPIC -pthread -fvisibility=default  -MD -MQ 'src/shared/src@shared@@systemd-shared-239@sta/logs-show.c.o' -MF 'src/shared/src@shared@@systemd-shared-239@sta/logs-show.c.o.d' -o 'src/shared/src@shared@@systemd-shared-239@sta/logs-show.c.o' -c ../src/shared/logs-show.c
[301/1560] x86_64-pld-linux-gnux32-gcc -Isrc/shared/src@shared@@systemd-shared-239@sta -Isrc/shared -I../src/shared -Isrc/basic -I../src/basic -Isrc/systemd -I../src/systemd -Isrc/journal -I../src/journal -Isrc/journal-remote -I../src/journal-remote -Isrc/nspawn -I../src/nspawn -Isrc/resolve -I../src/resolve -Isrc/timesync -I../src/timesync -I../src/time-wait-sync -Isrc/login -I../src/login -Isrc/udev -I../src/udev -Isrc/libudev -I../src/libudev -Isrc/core -I../src/core -I../src/libsystemd/sd-bus -I../src/libsystemd/sd-device -I../src/libsystemd/sd-hwdb -I../src/libsystemd/sd-id128 -I../src/libsystemd/sd-netlink -I../src/libsystemd/sd-network -Isrc/libsystemd-network -I../src/libsystemd-network -I. -I../ -I/usr/include/blkid -I/usr/include/uuid -fdiagnostics-color=always -pipe -D_FILE_OFFSET_BITS=64 -std=gnu99 -Wextra -Werror=undef -Wlogical-op -Wmissing-include-dirs -Wold-style-definition -Wpointer-arith -Winit-self -Wfloat-equal -Wsuggest-attribute=noreturn -Werror=missing-prototypes -Werror=implicit-function-declaration -Werror=missing-declarations -Werror=return-type -Werror=incompatible-pointer-types -Werror=format=2 -Wstrict-prototypes -Wredundant-decls -Wmissing-noreturn -Wimplicit-fallthrough=5 -Wshadow -Wendif-labels -Wstrict-aliasing=2 -Wwrite-strings -Werror=overflow -Werror=shift-count-overflow -Werror=shift-overflow=2 -Wdate-time -Wnested-externs -ffast-math -fno-common -fdiagnostics-show-option -fno-strict-aliasing -fvisibility=hidden -fstack-protector -fstack-protector-strong --param=ssp-buffer-size=4 -fPIE -ffunction-sections -fdata-sections -Wno-unused-parameter -Wno-missing-field-initializers -Wno-unused-result -Wno-format-signedness -Wno-error=nonnull -Werror=shadow -include config.h -O2 -fwrapv -Wformat -Werror=format-security -gdwarf-4 -fno-debug-types-section -fvar-tracking-assignments -g2 -Wp,-D_FORTIFY_SOURCE=2 -fstack-protector-strong --param=ssp-buffer-size=4 -fPIC -mtune=generic -march=x86-64 -gdwarf-4 -fno-debug-types-section -fvar-tracking-assignments -g2 -fPIC -pthread -fvisibility=default  -MD -MQ 'src/shared/src@shared@@systemd-shared-239@sta/vlan-util.c.o' -MF 'src/shared/src@shared@@systemd-shared-239@sta/vlan-util.c.o.d' -o 'src/shared/src@shared@@systemd-shared-239@sta/vlan-util.c.o' -c ../src/shared/vlan-util.c
[302/1560] x86_64-pld-linux-gnux32-gcc -Isrc/shared/src@shared@@systemd-shared-239@sha -Isrc/shared -I../src/shared -Isrc/basic -I../src/basic -Isrc/systemd -I../src/systemd -Isrc/journal -I../src/journal -Isrc/journal-remote -I../src/journal-remote -Isrc/nspawn -I../src/nspawn -Isrc/resolve -I../src/resolve -Isrc/timesync -I../src/timesync -I../src/time-wait-sync -Isrc/login -I../src/login -Isrc/udev -I../src/udev -Isrc/libudev -I../src/libudev -Isrc/core -I../src/core -I../src/libsystemd/sd-bus -I../src/libsystemd/sd-device -I../src/libsystemd/sd-hwdb -I../src/libsystemd/sd-id128 -I../src/libsystemd/sd-netlink -I../src/libsystemd/sd-network -Isrc/libsystemd-network -I../src/libsystemd-network -I. -I../ -I/usr/include/blkid -I/usr/include/uuid -fdiagnostics-color=always -pipe -D_FILE_OFFSET_BITS=64 -std=gnu99 -Wextra -Werror=undef -Wlogical-op -Wmissing-include-dirs -Wold-style-definition -Wpointer-arith -Winit-self -Wfloat-equal -Wsuggest-attribute=noreturn -Werror=missing-prototypes -Werror=implicit-function-declaration -Werror=missing-declarations -Werror=return-type -Werror=incompatible-pointer-types -Werror=format=2 -Wstrict-prototypes -Wredundant-decls -Wmissing-noreturn -Wimplicit-fallthrough=5 -Wshadow -Wendif-labels -Wstrict-aliasing=2 -Wwrite-strings -Werror=overflow -Werror=shift-count-overflow -Werror=shift-overflow=2 -Wdate-time -Wnested-externs -ffast-math -fno-common -fdiagnostics-show-option -fno-strict-aliasing -fvisibility=hidden -fstack-protector -fstack-protector-strong --param=ssp-buffer-size=4 -fPIE -ffunction-sections -fdata-sections -Wno-unused-parameter -Wno-missing-field-initializers -Wno-unused-result -Wno-format-signedness -Wno-error=nonnull -Werror=shadow -include config.h -O2 -fwrapv -Wformat -Werror=format-security -gdwarf-4 -fno-debug-types-section -fvar-tracking-assignments -g2 -Wp,-D_FORTIFY_SOURCE=2 -fstack-protector-strong --param=ssp-buffer-size=4 -fPIC -mtune=generic -march=x86-64 -gdwarf-4 -fno-debug-types-section -fvar-tracking-assignments -g2 -fPIC -pthread -fvisibility=default  -MD -MQ 'src/shared/src@shared@@systemd-shared-239@sha/.._libudev_libudev.c.o' -MF 'src/shared/src@shared@@systemd-shared-239@sha/.._libudev_libudev.c.o.d' -o 'src/shared/src@shared@@systemd-shared-239@sha/.._libudev_libudev.c.o' -c ../src/libudev/libudev.c
[303/1560] x86_64-pld-linux-gnux32-gcc -Isrc/shared/src@shared@@systemd-shared-239@sta -Isrc/shared -I../src/shared -Isrc/basic -I../src/basic -Isrc/systemd -I../src/systemd -Isrc/journal -I../src/journal -Isrc/journal-remote -I../src/journal-remote -Isrc/nspawn -I../src/nspawn -Isrc/resolve -I../src/resolve -Isrc/timesync -I../src/timesync -I../src/time-wait-sync -Isrc/login -I../src/login -Isrc/udev -I../src/udev -Isrc/libudev -I../src/libudev -Isrc/core -I../src/core -I../src/libsystemd/sd-bus -I../src/libsystemd/sd-device -I../src/libsystemd/sd-hwdb -I../src/libsystemd/sd-id128 -I../src/libsystemd/sd-netlink -I../src/libsystemd/sd-network -Isrc/libsystemd-network -I../src/libsystemd-network -I. -I../ -I/usr/include/blkid -I/usr/include/uuid -fdiagnostics-color=always -pipe -D_FILE_OFFSET_BITS=64 -std=gnu99 -Wextra -Werror=undef -Wlogical-op -Wmissing-include-dirs -Wold-style-definition -Wpointer-arith -Winit-self -Wfloat-equal -Wsuggest-attribute=noreturn -Werror=missing-prototypes -Werror=implicit-function-declaration -Werror=missing-declarations -Werror=return-type -Werror=incompatible-pointer-types -Werror=format=2 -Wstrict-prototypes -Wredundant-decls -Wmissing-noreturn -Wimplicit-fallthrough=5 -Wshadow -Wendif-labels -Wstrict-aliasing=2 -Wwrite-strings -Werror=overflow -Werror=shift-count-overflow -Werror=shift-overflow=2 -Wdate-time -Wnested-externs -ffast-math -fno-common -fdiagnostics-show-option -fno-strict-aliasing -fvisibility=hidden -fstack-protector -fstack-protector-strong --param=ssp-buffer-size=4 -fPIE -ffunction-sections -fdata-sections -Wno-unused-parameter -Wno-missing-field-initializers -Wno-unused-result -Wno-format-signedness -Wno-error=nonnull -Werror=shadow -include config.h -O2 -fwrapv -Wformat -Werror=format-security -gdwarf-4 -fno-debug-types-section -fvar-tracking-assignments -g2 -Wp,-D_FORTIFY_SOURCE=2 -fstack-protector-strong --param=ssp-buffer-size=4 -fPIC -mtune=generic -march=x86-64 -gdwarf-4 -fno-debug-types-section -fvar-tracking-assignments -g2 -fPIC -pthread -fvisibility=default  -MD -MQ 'src/shared/src@shared@@systemd-shared-239@sta/uid-range.c.o' -MF 'src/shared/src@shared@@systemd-shared-239@sta/uid-range.c.o.d' -o 'src/shared/src@shared@@systemd-shared-239@sta/uid-range.c.o' -c ../src/shared/uid-range.c
[304/1560] x86_64-pld-linux-gnux32-gcc -Isrc/shared/src@shared@@systemd-shared-239@sha -Isrc/shared -I../src/shared -Isrc/basic -I../src/basic -Isrc/systemd -I../src/systemd -Isrc/journal -I../src/journal -Isrc/journal-remote -I../src/journal-remote -Isrc/nspawn -I../src/nspawn -Isrc/resolve -I../src/resolve -Isrc/timesync -I../src/timesync -I../src/time-wait-sync -Isrc/login -I../src/login -Isrc/udev -I../src/udev -Isrc/libudev -I../src/libudev -Isrc/core -I../src/core -I../src/libsystemd/sd-bus -I../src/libsystemd/sd-device -I../src/libsystemd/sd-hwdb -I../src/libsystemd/sd-id128 -I../src/libsystemd/sd-netlink -I../src/libsystemd/sd-network -Isrc/libsystemd-network -I../src/libsystemd-network -I. -I../ -I/usr/include/blkid -I/usr/include/uuid -fdiagnostics-color=always -pipe -D_FILE_OFFSET_BITS=64 -std=gnu99 -Wextra -Werror=undef -Wlogical-op -Wmissing-include-dirs -Wold-style-definition -Wpointer-arith -Winit-self -Wfloat-equal -Wsuggest-attribute=noreturn -Werror=missing-prototypes -Werror=implicit-function-declaration -Werror=missing-declarations -Werror=return-type -Werror=incompatible-pointer-types -Werror=format=2 -Wstrict-prototypes -Wredundant-decls -Wmissing-noreturn -Wimplicit-fallthrough=5 -Wshadow -Wendif-labels -Wstrict-aliasing=2 -Wwrite-strings -Werror=overflow -Werror=shift-count-overflow -Werror=shift-overflow=2 -Wdate-time -Wnested-externs -ffast-math -fno-common -fdiagnostics-show-option -fno-strict-aliasing -fvisibility=hidden -fstack-protector -fstack-protector-strong --param=ssp-buffer-size=4 -fPIE -ffunction-sections -fdata-sections -Wno-unused-parameter -Wno-missing-field-initializers -Wno-unused-result -Wno-format-signedness -Wno-error=nonnull -Werror=shadow -include config.h -O2 -fwrapv -Wformat -Werror=format-security -gdwarf-4 -fno-debug-types-section -fvar-tracking-assignments -g2 -Wp,-D_FORTIFY_SOURCE=2 -fstack-protector-strong --param=ssp-buffer-size=4 -fPIC -mtune=generic -march=x86-64 -gdwarf-4 -fno-debug-types-section -fvar-tracking-assignments -g2 -fPIC -pthread -fvisibility=default  -MD -MQ 'src/shared/src@shared@@systemd-shared-239@sha/.._libudev_libudev-list.c.o' -MF 'src/shared/src@shared@@systemd-shared-239@sha/.._libudev_libudev-list.c.o.d' -o 'src/shared/src@shared@@systemd-shared-239@sha/.._libudev_libudev-list.c.o' -c ../src/libudev/libudev-list.c
[305/1560] x86_64-pld-linux-gnux32-gcc -Isrc/shared/src@shared@@systemd-shared-239@sta -Isrc/shared -I../src/shared -Isrc/basic -I../src/basic -Isrc/systemd -I../src/systemd -Isrc/journal -I../src/journal -Isrc/journal-remote -I../src/journal-remote -Isrc/nspawn -I../src/nspawn -Isrc/resolve -I../src/resolve -Isrc/timesync -I../src/timesync -I../src/time-wait-sync -Isrc/login -I../src/login -Isrc/udev -I../src/udev -Isrc/libudev -I../src/libudev -Isrc/core -I../src/core -I../src/libsystemd/sd-bus -I../src/libsystemd/sd-device -I../src/libsystemd/sd-hwdb -I../src/libsystemd/sd-id128 -I../src/libsystemd/sd-netlink -I../src/libsystemd/sd-network -Isrc/libsystemd-network -I../src/libsystemd-network -I. -I../ -I/usr/include/blkid -I/usr/include/uuid -fdiagnostics-color=always -pipe -D_FILE_OFFSET_BITS=64 -std=gnu99 -Wextra -Werror=undef -Wlogical-op -Wmissing-include-dirs -Wold-style-definition -Wpointer-arith -Winit-self -Wfloat-equal -Wsuggest-attribute=noreturn -Werror=missing-prototypes -Werror=implicit-function-declaration -Werror=missing-declarations -Werror=return-type -Werror=incompatible-pointer-types -Werror=format=2 -Wstrict-prototypes -Wredundant-decls -Wmissing-noreturn -Wimplicit-fallthrough=5 -Wshadow -Wendif-labels -Wstrict-aliasing=2 -Wwrite-strings -Werror=overflow -Werror=shift-count-overflow -Werror=shift-overflow=2 -Wdate-time -Wnested-externs -ffast-math -fno-common -fdiagnostics-show-option -fno-strict-aliasing -fvisibility=hidden -fstack-protector -fstack-protector-strong --param=ssp-buffer-size=4 -fPIE -ffunction-sections -fdata-sections -Wno-unused-parameter -Wno-missing-field-initializers -Wno-unused-result -Wno-format-signedness -Wno-error=nonnull -Werror=shadow -include config.h -O2 -fwrapv -Wformat -Werror=format-security -gdwarf-4 -fno-debug-types-section -fvar-tracking-assignments -g2 -Wp,-D_FORTIFY_SOURCE=2 -fstack-protector-strong --param=ssp-buffer-size=4 -fPIC -mtune=generic -march=x86-64 -gdwarf-4 -fno-debug-types-section -fvar-tracking-assignments -g2 -fPIC -pthread -fvisibility=default  -MD -MQ 'src/shared/src@shared@@systemd-shared-239@sta/firewall-util.c.o' -MF 'src/shared/src@shared@@systemd-shared-239@sta/firewall-util.c.o.d' -o 'src/shared/src@shared@@systemd-shared-239@sta/firewall-util.c.o' -c ../src/shared/firewall-util.c
[306/1560] x86_64-pld-linux-gnux32-gcc -Isrc/shared/src@shared@@systemd-shared-239@sta -Isrc/shared -I../src/shared -Isrc/basic -I../src/basic -Isrc/systemd -I../src/systemd -Isrc/journal -I../src/journal -Isrc/journal-remote -I../src/journal-remote -Isrc/nspawn -I../src/nspawn -Isrc/resolve -I../src/resolve -Isrc/timesync -I../src/timesync -I../src/time-wait-sync -Isrc/login -I../src/login -Isrc/udev -I../src/udev -Isrc/libudev -I../src/libudev -Isrc/core -I../src/core -I../src/libsystemd/sd-bus -I../src/libsystemd/sd-device -I../src/libsystemd/sd-hwdb -I../src/libsystemd/sd-id128 -I../src/libsystemd/sd-netlink -I../src/libsystemd/sd-network -Isrc/libsystemd-network -I../src/libsystemd-network -I. -I../ -I/usr/include/blkid -I/usr/include/uuid -fdiagnostics-color=always -pipe -D_FILE_OFFSET_BITS=64 -std=gnu99 -Wextra -Werror=undef -Wlogical-op -Wmissing-include-dirs -Wold-style-definition -Wpointer-arith -Winit-self -Wfloat-equal -Wsuggest-attribute=noreturn -Werror=missing-prototypes -Werror=implicit-function-declaration -Werror=missing-declarations -Werror=return-type -Werror=incompatible-pointer-types -Werror=format=2 -Wstrict-prototypes -Wredundant-decls -Wmissing-noreturn -Wimplicit-fallthrough=5 -Wshadow -Wendif-labels -Wstrict-aliasing=2 -Wwrite-strings -Werror=overflow -Werror=shift-count-overflow -Werror=shift-overflow=2 -Wdate-time -Wnested-externs -ffast-math -fno-common -fdiagnostics-show-option -fno-strict-aliasing -fvisibility=hidden -fstack-protector -fstack-protector-strong --param=ssp-buffer-size=4 -fPIE -ffunction-sections -fdata-sections -Wno-unused-parameter -Wno-missing-field-initializers -Wno-unused-result -Wno-format-signedness -Wno-error=nonnull -Werror=shadow -include config.h -O2 -fwrapv -Wformat -Werror=format-security -gdwarf-4 -fno-debug-types-section -fvar-tracking-assignments -g2 -Wp,-D_FORTIFY_SOURCE=2 -fstack-protector-strong --param=ssp-buffer-size=4 -fPIC -mtune=generic -march=x86-64 -gdwarf-4 -fno-debug-types-section -fvar-tracking-assignments -g2 -fPIC -pthread -fvisibility=default  -MD -MQ 'src/shared/src@shared@@systemd-shared-239@sta/volatile-util.c.o' -MF 'src/shared/src@shared@@systemd-shared-239@sta/volatile-util.c.o.d' -o 'src/shared/src@shared@@systemd-shared-239@sta/volatile-util.c.o' -c ../src/shared/volatile-util.c
[307/1560] x86_64-pld-linux-gnux32-gcc -Isrc/shared/src@shared@@systemd-shared-239@sha -Isrc/shared -I../src/shared -Isrc/basic -I../src/basic -Isrc/systemd -I../src/systemd -Isrc/journal -I../src/journal -Isrc/journal-remote -I../src/journal-remote -Isrc/nspawn -I../src/nspawn -Isrc/resolve -I../src/resolve -Isrc/timesync -I../src/timesync -I../src/time-wait-sync -Isrc/login -I../src/login -Isrc/udev -I../src/udev -Isrc/libudev -I../src/libudev -Isrc/core -I../src/core -I../src/libsystemd/sd-bus -I../src/libsystemd/sd-device -I../src/libsystemd/sd-hwdb -I../src/libsystemd/sd-id128 -I../src/libsystemd/sd-netlink -I../src/libsystemd/sd-network -Isrc/libsystemd-network -I../src/libsystemd-network -I. -I../ -I/usr/include/blkid -I/usr/include/uuid -fdiagnostics-color=always -pipe -D_FILE_OFFSET_BITS=64 -std=gnu99 -Wextra -Werror=undef -Wlogical-op -Wmissing-include-dirs -Wold-style-definition -Wpointer-arith -Winit-self -Wfloat-equal -Wsuggest-attribute=noreturn -Werror=missing-prototypes -Werror=implicit-function-declaration -Werror=missing-declarations -Werror=return-type -Werror=incompatible-pointer-types -Werror=format=2 -Wstrict-prototypes -Wredundant-decls -Wmissing-noreturn -Wimplicit-fallthrough=5 -Wshadow -Wendif-labels -Wstrict-aliasing=2 -Wwrite-strings -Werror=overflow -Werror=shift-count-overflow -Werror=shift-overflow=2 -Wdate-time -Wnested-externs -ffast-math -fno-common -fdiagnostics-show-option -fno-strict-aliasing -fvisibility=hidden -fstack-protector -fstack-protector-strong --param=ssp-buffer-size=4 -fPIE -ffunction-sections -fdata-sections -Wno-unused-parameter -Wno-missing-field-initializers -Wno-unused-result -Wno-format-signedness -Wno-error=nonnull -Werror=shadow -include config.h -O2 -fwrapv -Wformat -Werror=format-security -gdwarf-4 -fno-debug-types-section -fvar-tracking-assignments -g2 -Wp,-D_FORTIFY_SOURCE=2 -fstack-protector-strong --param=ssp-buffer-size=4 -fPIC -mtune=generic -march=x86-64 -gdwarf-4 -fno-debug-types-section -fvar-tracking-assignments -g2 -fPIC -pthread -fvisibility=default  -MD -MQ 'src/shared/src@shared@@systemd-shared-239@sha/.._libudev_libudev-util.c.o' -MF 'src/shared/src@shared@@systemd-shared-239@sha/.._libudev_libudev-util.c.o.d' -o 'src/shared/src@shared@@systemd-shared-239@sha/.._libudev_libudev-util.c.o' -c ../src/libudev/libudev-util.c
[308/1560] x86_64-pld-linux-gnux32-gcc -Isrc/shared/src@shared@@systemd-shared-239@sha -Isrc/shared -I../src/shared -Isrc/basic -I../src/basic -Isrc/systemd -I../src/systemd -Isrc/journal -I../src/journal -Isrc/journal-remote -I../src/journal-remote -Isrc/nspawn -I../src/nspawn -Isrc/resolve -I../src/resolve -Isrc/timesync -I../src/timesync -I../src/time-wait-sync -Isrc/login -I../src/login -Isrc/udev -I../src/udev -Isrc/libudev -I../src/libudev -Isrc/core -I../src/core -I../src/libsystemd/sd-bus -I../src/libsystemd/sd-device -I../src/libsystemd/sd-hwdb -I../src/libsystemd/sd-id128 -I../src/libsystemd/sd-netlink -I../src/libsystemd/sd-network -Isrc/libsystemd-network -I../src/libsystemd-network -I. -I../ -I/usr/include/blkid -I/usr/include/uuid -fdiagnostics-color=always -pipe -D_FILE_OFFSET_BITS=64 -std=gnu99 -Wextra -Werror=undef -Wlogical-op -Wmissing-include-dirs -Wold-style-definition -Wpointer-arith -Winit-self -Wfloat-equal -Wsuggest-attribute=noreturn -Werror=missing-prototypes -Werror=implicit-function-declaration -Werror=missing-declarations -Werror=return-type -Werror=incompatible-pointer-types -Werror=format=2 -Wstrict-prototypes -Wredundant-decls -Wmissing-noreturn -Wimplicit-fallthrough=5 -Wshadow -Wendif-labels -Wstrict-aliasing=2 -Wwrite-strings -Werror=overflow -Werror=shift-count-overflow -Werror=shift-overflow=2 -Wdate-time -Wnested-externs -ffast-math -fno-common -fdiagnostics-show-option -fno-strict-aliasing -fvisibility=hidden -fstack-protector -fstack-protector-strong --param=ssp-buffer-size=4 -fPIE -ffunction-sections -fdata-sections -Wno-unused-parameter -Wno-missing-field-initializers -Wno-unused-result -Wno-format-signedness -Wno-error=nonnull -Werror=shadow -include config.h -O2 -fwrapv -Wformat -Werror=format-security -gdwarf-4 -fno-debug-types-section -fvar-tracking-assignments -g2 -Wp,-D_FORTIFY_SOURCE=2 -fstack-protector-strong --param=ssp-buffer-size=4 -fPIC -mtune=generic -march=x86-64 -gdwarf-4 -fno-debug-types-section -fvar-tracking-assignments -g2 -fPIC -pthread -fvisibility=default  -MD -MQ 'src/shared/src@shared@@systemd-shared-239@sha/.._libudev_libudev-enumerate.c.o' -MF 'src/shared/src@shared@@systemd-shared-239@sha/.._libudev_libudev-enumerate.c.o.d' -o 'src/shared/src@shared@@systemd-shared-239@sha/.._libudev_libudev-enumerate.c.o' -c ../src/libudev/libudev-enumerate.c
[309/1560] x86_64-pld-linux-gnux32-gcc -Isrc/shared/src@shared@@systemd-shared-239@sta -Isrc/shared -I../src/shared -Isrc/basic -I../src/basic -Isrc/systemd -I../src/systemd -Isrc/journal -I../src/journal -Isrc/journal-remote -I../src/journal-remote -Isrc/nspawn -I../src/nspawn -Isrc/resolve -I../src/resolve -Isrc/timesync -I../src/timesync -I../src/time-wait-sync -Isrc/login -I../src/login -Isrc/udev -I../src/udev -Isrc/libudev -I../src/libudev -Isrc/core -I../src/core -I../src/libsystemd/sd-bus -I../src/libsystemd/sd-device -I../src/libsystemd/sd-hwdb -I../src/libsystemd/sd-id128 -I../src/libsystemd/sd-netlink -I../src/libsystemd/sd-network -Isrc/libsystemd-network -I../src/libsystemd-network -I. -I../ -I/usr/include/blkid -I/usr/include/uuid -fdiagnostics-color=always -pipe -D_FILE_OFFSET_BITS=64 -std=gnu99 -Wextra -Werror=undef -Wlogical-op -Wmissing-include-dirs -Wold-style-definition -Wpointer-arith -Winit-self -Wfloat-equal -Wsuggest-attribute=noreturn -Werror=missing-prototypes -Werror=implicit-function-declaration -Werror=missing-declarations -Werror=return-type -Werror=incompatible-pointer-types -Werror=format=2 -Wstrict-prototypes -Wredundant-decls -Wmissing-noreturn -Wimplicit-fallthrough=5 -Wshadow -Wendif-labels -Wstrict-aliasing=2 -Wwrite-strings -Werror=overflow -Werror=shift-count-overflow -Werror=shift-overflow=2 -Wdate-time -Wnested-externs -ffast-math -fno-common -fdiagnostics-show-option -fno-strict-aliasing -fvisibility=hidden -fstack-protector -fstack-protector-strong --param=ssp-buffer-size=4 -fPIE -ffunction-sections -fdata-sections -Wno-unused-parameter -Wno-missing-field-initializers -Wno-unused-result -Wno-format-signedness -Wno-error=nonnull -Werror=shadow -include config.h -O2 -fwrapv -Wformat -Werror=format-security -gdwarf-4 -fno-debug-types-section -fvar-tracking-assignments -g2 -Wp,-D_FORTIFY_SOURCE=2 -fstack-protector-strong --param=ssp-buffer-size=4 -fPIC -mtune=generic -march=x86-64 -gdwarf-4 -fno-debug-types-section -fvar-tracking-assignments -g2 -fPIC -pthread -fvisibility=default  -MD -MQ 'src/shared/src@shared@@systemd-shared-239@sta/watchdog.c.o' -MF 'src/shared/src@shared@@systemd-shared-239@sta/watchdog.c.o.d' -o 'src/shared/src@shared@@systemd-shared-239@sta/watchdog.c.o' -c ../src/shared/watchdog.c
[310/1560] x86_64-pld-linux-gnux32-gcc -Isrc/shared/src@shared@@systemd-shared-239@sha -Isrc/shared -I../src/shared -Isrc/basic -I../src/basic -Isrc/systemd -I../src/systemd -Isrc/journal -I../src/journal -Isrc/journal-remote -I../src/journal-remote -Isrc/nspawn -I../src/nspawn -Isrc/resolve -I../src/resolve -Isrc/timesync -I../src/timesync -I../src/time-wait-sync -Isrc/login -I../src/login -Isrc/udev -I../src/udev -Isrc/libudev -I../src/libudev -Isrc/core -I../src/core -I../src/libsystemd/sd-bus -I../src/libsystemd/sd-device -I../src/libsystemd/sd-hwdb -I../src/libsystemd/sd-id128 -I../src/libsystemd/sd-netlink -I../src/libsystemd/sd-network -Isrc/libsystemd-network -I../src/libsystemd-network -I. -I../ -I/usr/include/blkid -I/usr/include/uuid -fdiagnostics-color=always -pipe -D_FILE_OFFSET_BITS=64 -std=gnu99 -Wextra -Werror=undef -Wlogical-op -Wmissing-include-dirs -Wold-style-definition -Wpointer-arith -Winit-self -Wfloat-equal -Wsuggest-attribute=noreturn -Werror=missing-prototypes -Werror=implicit-function-declaration -Werror=missing-declarations -Werror=return-type -Werror=incompatible-pointer-types -Werror=format=2 -Wstrict-prototypes -Wredundant-decls -Wmissing-noreturn -Wimplicit-fallthrough=5 -Wshadow -Wendif-labels -Wstrict-aliasing=2 -Wwrite-strings -Werror=overflow -Werror=shift-count-overflow -Werror=shift-overflow=2 -Wdate-time -Wnested-externs -ffast-math -fno-common -fdiagnostics-show-option -fno-strict-aliasing -fvisibility=hidden -fstack-protector -fstack-protector-strong --param=ssp-buffer-size=4 -fPIE -ffunction-sections -fdata-sections -Wno-unused-parameter -Wno-missing-field-initializers -Wno-unused-result -Wno-format-signedness -Wno-error=nonnull -Werror=shadow -include config.h -O2 -fwrapv -Wformat -Werror=format-security -gdwarf-4 -fno-debug-types-section -fvar-tracking-assignments -g2 -Wp,-D_FORTIFY_SOURCE=2 -fstack-protector-strong --param=ssp-buffer-size=4 -fPIC -mtune=generic -march=x86-64 -gdwarf-4 -fno-debug-types-section -fvar-tracking-assignments -g2 -fPIC -pthread -fvisibility=default  -MD -MQ 'src/shared/src@shared@@systemd-shared-239@sha/.._libudev_libudev-queue.c.o' -MF 'src/shared/src@shared@@systemd-shared-239@sha/.._libudev_libudev-queue.c.o.d' -o 'src/shared/src@shared@@systemd-shared-239@sha/.._libudev_libudev-queue.c.o' -c ../src/libudev/libudev-queue.c
[311/1560] x86_64-pld-linux-gnux32-gcc -Isrc/shared/src@shared@@systemd-shared-239@sta -Isrc/shared -I../src/shared -Isrc/basic -I../src/basic -Isrc/systemd -I../src/systemd -Isrc/journal -I../src/journal -Isrc/journal-remote -I../src/journal-remote -Isrc/nspawn -I../src/nspawn -Isrc/resolve -I../src/resolve -Isrc/timesync -I../src/timesync -I../src/time-wait-sync -Isrc/login -I../src/login -Isrc/udev -I../src/udev -Isrc/libudev -I../src/libudev -Isrc/core -I../src/core -I../src/libsystemd/sd-bus -I../src/libsystemd/sd-device -I../src/libsystemd/sd-hwdb -I../src/libsystemd/sd-id128 -I../src/libsystemd/sd-netlink -I../src/libsystemd/sd-network -Isrc/libsystemd-network -I../src/libsystemd-network -I. -I../ -I/usr/include/blkid -I/usr/include/uuid -fdiagnostics-color=always -pipe -D_FILE_OFFSET_BITS=64 -std=gnu99 -Wextra -Werror=undef -Wlogical-op -Wmissing-include-dirs -Wold-style-definition -Wpointer-arith -Winit-self -Wfloat-equal -Wsuggest-attribute=noreturn -Werror=missing-prototypes -Werror=implicit-function-declaration -Werror=missing-declarations -Werror=return-type -Werror=incompatible-pointer-types -Werror=format=2 -Wstrict-prototypes -Wredundant-decls -Wmissing-noreturn -Wimplicit-fallthrough=5 -Wshadow -Wendif-labels -Wstrict-aliasing=2 -Wwrite-strings -Werror=overflow -Werror=shift-count-overflow -Werror=shift-overflow=2 -Wdate-time -Wnested-externs -ffast-math -fno-common -fdiagnostics-show-option -fno-strict-aliasing -fvisibility=hidden -fstack-protector -fstack-protector-strong --param=ssp-buffer-size=4 -fPIE -ffunction-sections -fdata-sections -Wno-unused-parameter -Wno-missing-field-initializers -Wno-unused-result -Wno-format-signedness -Wno-error=nonnull -Werror=shadow -include config.h -O2 -fwrapv -Wformat -Werror=format-security -gdwarf-4 -fno-debug-types-section -fvar-tracking-assignments -g2 -Wp,-D_FORTIFY_SOURCE=2 -fstack-protector-strong --param=ssp-buffer-size=4 -fPIC -mtune=generic -march=x86-64 -gdwarf-4 -fno-debug-types-section -fvar-tracking-assignments -g2 -fPIC -pthread -fvisibility=default  -MD -MQ 'src/shared/src@shared@@systemd-shared-239@sta/utmp-wtmp.c.o' -MF 'src/shared/src@shared@@systemd-shared-239@sta/utmp-wtmp.c.o.d' -o 'src/shared/src@shared@@systemd-shared-239@sta/utmp-wtmp.c.o' -c ../src/shared/utmp-wtmp.c
[312/1560] x86_64-pld-linux-gnux32-gcc -Isrc/shared/src@shared@@systemd-shared-239@sha -Isrc/shared -I../src/shared -Isrc/basic -I../src/basic -Isrc/systemd -I../src/systemd -Isrc/journal -I../src/journal -Isrc/journal-remote -I../src/journal-remote -Isrc/nspawn -I../src/nspawn -Isrc/resolve -I../src/resolve -Isrc/timesync -I../src/timesync -I../src/time-wait-sync -Isrc/login -I../src/login -Isrc/udev -I../src/udev -Isrc/libudev -I../src/libudev -Isrc/core -I../src/core -I../src/libsystemd/sd-bus -I../src/libsystemd/sd-device -I../src/libsystemd/sd-hwdb -I../src/libsystemd/sd-id128 -I../src/libsystemd/sd-netlink -I../src/libsystemd/sd-network -Isrc/libsystemd-network -I../src/libsystemd-network -I. -I../ -I/usr/include/blkid -I/usr/include/uuid -fdiagnostics-color=always -pipe -D_FILE_OFFSET_BITS=64 -std=gnu99 -Wextra -Werror=undef -Wlogical-op -Wmissing-include-dirs -Wold-style-definition -Wpointer-arith -Winit-self -Wfloat-equal -Wsuggest-attribute=noreturn -Werror=missing-prototypes -Werror=implicit-function-declaration -Werror=missing-declarations -Werror=return-type -Werror=incompatible-pointer-types -Werror=format=2 -Wstrict-prototypes -Wredundant-decls -Wmissing-noreturn -Wimplicit-fallthrough=5 -Wshadow -Wendif-labels -Wstrict-aliasing=2 -Wwrite-strings -Werror=overflow -Werror=shift-count-overflow -Werror=shift-overflow=2 -Wdate-time -Wnested-externs -ffast-math -fno-common -fdiagnostics-show-option -fno-strict-aliasing -fvisibility=hidden -fstack-protector -fstack-protector-strong --param=ssp-buffer-size=4 -fPIE -ffunction-sections -fdata-sections -Wno-unused-parameter -Wno-missing-field-initializers -Wno-unused-result -Wno-format-signedness -Wno-error=nonnull -Werror=shadow -include config.h -O2 -fwrapv -Wformat -Werror=format-security -gdwarf-4 -fno-debug-types-section -fvar-tracking-assignments -g2 -Wp,-D_FORTIFY_SOURCE=2 -fstack-protector-strong --param=ssp-buffer-size=4 -fPIC -mtune=generic -march=x86-64 -gdwarf-4 -fno-debug-types-section -fvar-tracking-assignments -g2 -fPIC -pthread -fvisibility=default  -MD -MQ 'src/shared/src@shared@@systemd-shared-239@sha/.._libudev_libudev-device-private.c.o' -MF 'src/shared/src@shared@@systemd-shared-239@sha/.._libudev_libudev-device-private.c.o.d' -o 'src/shared/src@shared@@systemd-shared-239@sha/.._libudev_libudev-device-private.c.o' -c ../src/libudev/libudev-device-private.c
[313/1560] x86_64-pld-linux-gnux32-gcc -Isrc/shared/src@shared@@systemd-shared-239@sta -Isrc/shared -I../src/shared -Isrc/basic -I../src/basic -Isrc/systemd -I../src/systemd -Isrc/journal -I../src/journal -Isrc/journal-remote -I../src/journal-remote -Isrc/nspawn -I../src/nspawn -Isrc/resolve -I../src/resolve -Isrc/timesync -I../src/timesync -I../src/time-wait-sync -Isrc/login -I../src/login -Isrc/udev -I../src/udev -Isrc/libudev -I../src/libudev -Isrc/core -I../src/core -I../src/libsystemd/sd-bus -I../src/libsystemd/sd-device -I../src/libsystemd/sd-hwdb -I../src/libsystemd/sd-id128 -I../src/libsystemd/sd-netlink -I../src/libsystemd/sd-network -Isrc/libsystemd-network -I../src/libsystemd-network -I. -I../ -I/usr/include/blkid -I/usr/include/uuid -fdiagnostics-color=always -pipe -D_FILE_OFFSET_BITS=64 -std=gnu99 -Wextra -Werror=undef -Wlogical-op -Wmissing-include-dirs -Wold-style-definition -Wpointer-arith -Winit-self -Wfloat-equal -Wsuggest-attribute=noreturn -Werror=missing-prototypes -Werror=implicit-function-declaration -Werror=missing-declarations -Werror=return-type -Werror=incompatible-pointer-types -Werror=format=2 -Wstrict-prototypes -Wredundant-decls -Wmissing-noreturn -Wimplicit-fallthrough=5 -Wshadow -Wendif-labels -Wstrict-aliasing=2 -Wwrite-strings -Werror=overflow -Werror=shift-count-overflow -Werror=shift-overflow=2 -Wdate-time -Wnested-externs -ffast-math -fno-common -fdiagnostics-show-option -fno-strict-aliasing -fvisibility=hidden -fstack-protector -fstack-protector-strong --param=ssp-buffer-size=4 -fPIE -ffunction-sections -fdata-sections -Wno-unused-parameter -Wno-missing-field-initializers -Wno-unused-result -Wno-format-signedness -Wno-error=nonnull -Werror=shadow -include config.h -O2 -fwrapv -Wformat -Werror=format-security -gdwarf-4 -fno-debug-types-section -fvar-tracking-assignments -g2 -Wp,-D_FORTIFY_SOURCE=2 -fstack-protector-strong --param=ssp-buffer-size=4 -fPIC -mtune=generic -march=x86-64 -gdwarf-4 -fno-debug-types-section -fvar-tracking-assignments -g2 -fPIC -pthread -fvisibility=default  -MD -MQ 'src/shared/src@shared@@systemd-shared-239@sta/acl-util.c.o' -MF 'src/shared/src@shared@@systemd-shared-239@sta/acl-util.c.o.d' -o 'src/shared/src@shared@@systemd-shared-239@sta/acl-util.c.o' -c ../src/shared/acl-util.c
[314/1560] x86_64-pld-linux-gnux32-gcc -Isrc/shared/src@shared@@systemd-shared-239@sha -Isrc/shared -I../src/shared -Isrc/basic -I../src/basic -Isrc/systemd -I../src/systemd -Isrc/journal -I../src/journal -Isrc/journal-remote -I../src/journal-remote -Isrc/nspawn -I../src/nspawn -Isrc/resolve -I../src/resolve -Isrc/timesync -I../src/timesync -I../src/time-wait-sync -Isrc/login -I../src/login -Isrc/udev -I../src/udev -Isrc/libudev -I../src/libudev -Isrc/core -I../src/core -I../src/libsystemd/sd-bus -I../src/libsystemd/sd-device -I../src/libsystemd/sd-hwdb -I../src/libsystemd/sd-id128 -I../src/libsystemd/sd-netlink -I../src/libsystemd/sd-network -Isrc/libsystemd-network -I../src/libsystemd-network -I. -I../ -I/usr/include/blkid -I/usr/include/uuid -fdiagnostics-color=always -pipe -D_FILE_OFFSET_BITS=64 -std=gnu99 -Wextra -Werror=undef -Wlogical-op -Wmissing-include-dirs -Wold-style-definition -Wpointer-arith -Winit-self -Wfloat-equal -Wsuggest-attribute=noreturn -Werror=missing-prototypes -Werror=implicit-function-declaration -Werror=missing-declarations -Werror=return-type -Werror=incompatible-pointer-types -Werror=format=2 -Wstrict-prototypes -Wredundant-decls -Wmissing-noreturn -Wimplicit-fallthrough=5 -Wshadow -Wendif-labels -Wstrict-aliasing=2 -Wwrite-strings -Werror=overflow -Werror=shift-count-overflow -Werror=shift-overflow=2 -Wdate-time -Wnested-externs -ffast-math -fno-common -fdiagnostics-show-option -fno-strict-aliasing -fvisibility=hidden -fstack-protector -fstack-protector-strong --param=ssp-buffer-size=4 -fPIE -ffunction-sections -fdata-sections -Wno-unused-parameter -Wno-missing-field-initializers -Wno-unused-result -Wno-format-signedness -Wno-error=nonnull -Werror=shadow -include config.h -O2 -fwrapv -Wformat -Werror=format-security -gdwarf-4 -fno-debug-types-section -fvar-tracking-assignments -g2 -Wp,-D_FORTIFY_SOURCE=2 -fstack-protector-strong --param=ssp-buffer-size=4 -fPIC -mtune=generic -march=x86-64 -gdwarf-4 -fno-debug-types-section -fvar-tracking-assignments -g2 -fPIC -pthread -fvisibility=default  -MD -MQ 'src/shared/src@shared@@systemd-shared-239@sha/.._libudev_libudev-device.c.o' -MF 'src/shared/src@shared@@systemd-shared-239@sha/.._libudev_libudev-device.c.o.d' -o 'src/shared/src@shared@@systemd-shared-239@sha/.._libudev_libudev-device.c.o' -c ../src/libudev/libudev-device.c
[315/1560] x86_64-pld-linux-gnux32-gcc -Isrc/shared/src@shared@@systemd-shared-239@sha -Isrc/shared -I../src/shared -Isrc/basic -I../src/basic -Isrc/systemd -I../src/systemd -Isrc/journal -I../src/journal -Isrc/journal-remote -I../src/journal-remote -Isrc/nspawn -I../src/nspawn -Isrc/resolve -I../src/resolve -Isrc/timesync -I../src/timesync -I../src/time-wait-sync -Isrc/login -I../src/login -Isrc/udev -I../src/udev -Isrc/libudev -I../src/libudev -Isrc/core -I../src/core -I../src/libsystemd/sd-bus -I../src/libsystemd/sd-device -I../src/libsystemd/sd-hwdb -I../src/libsystemd/sd-id128 -I../src/libsystemd/sd-netlink -I../src/libsystemd/sd-network -Isrc/libsystemd-network -I../src/libsystemd-network -I. -I../ -I/usr/include/blkid -I/usr/include/uuid -fdiagnostics-color=always -pipe -D_FILE_OFFSET_BITS=64 -std=gnu99 -Wextra -Werror=undef -Wlogical-op -Wmissing-include-dirs -Wold-style-definition -Wpointer-arith -Winit-self -Wfloat-equal -Wsuggest-attribute=noreturn -Werror=missing-prototypes -Werror=implicit-function-declaration -Werror=missing-declarations -Werror=return-type -Werror=incompatible-pointer-types -Werror=format=2 -Wstrict-prototypes -Wredundant-decls -Wmissing-noreturn -Wimplicit-fallthrough=5 -Wshadow -Wendif-labels -Wstrict-aliasing=2 -Wwrite-strings -Werror=overflow -Werror=shift-count-overflow -Werror=shift-overflow=2 -Wdate-time -Wnested-externs -ffast-math -fno-common -fdiagnostics-show-option -fno-strict-aliasing -fvisibility=hidden -fstack-protector -fstack-protector-strong --param=ssp-buffer-size=4 -fPIE -ffunction-sections -fdata-sections -Wno-unused-parameter -Wno-missing-field-initializers -Wno-unused-result -Wno-format-signedness -Wno-error=nonnull -Werror=shadow -include config.h -O2 -fwrapv -Wformat -Werror=format-security -gdwarf-4 -fno-debug-types-section -fvar-tracking-assignments -g2 -Wp,-D_FORTIFY_SOURCE=2 -fstack-protector-strong --param=ssp-buffer-size=4 -fPIC -mtune=generic -march=x86-64 -gdwarf-4 -fno-debug-types-section -fvar-tracking-assignments -g2 -fPIC -pthread -fvisibility=default  -MD -MQ 'src/shared/src@shared@@systemd-shared-239@sha/.._libudev_libudev-hwdb.c.o' -MF 'src/shared/src@shared@@systemd-shared-239@sha/.._libudev_libudev-hwdb.c.o.d' -o 'src/shared/src@shared@@systemd-shared-239@sha/.._libudev_libudev-hwdb.c.o' -c ../src/libudev/libudev-hwdb.c
[316/1560] x86_64-pld-linux-gnux32-gcc -Isrc/core/src@core@@core@sta -Isrc/core -I../src/core -Isrc/basic -I../src/basic -Isrc/shared -I../src/shared -Isrc/systemd -I../src/systemd -Isrc/journal -I../src/journal -Isrc/journal-remote -I../src/journal-remote -Isrc/nspawn -I../src/nspawn -Isrc/resolve -I../src/resolve -Isrc/timesync -I../src/timesync -I../src/time-wait-sync -Isrc/login -I../src/login -Isrc/udev -I../src/udev -Isrc/libudev -I../src/libudev -I../src/libsystemd/sd-bus -I../src/libsystemd/sd-device -I../src/libsystemd/sd-hwdb -I../src/libsystemd/sd-id128 -I../src/libsystemd/sd-netlink -I../src/libsystemd/sd-network -Isrc/libsystemd-network -I../src/libsystemd-network -I. -I../ -I/usr/include/libmount -I/usr/include/blkid -I/usr/include/uuid -fdiagnostics-color=always -pipe -D_FILE_OFFSET_BITS=64 -std=gnu99 -Wextra -Werror=undef -Wlogical-op -Wmissing-include-dirs -Wold-style-definition -Wpointer-arith -Winit-self -Wfloat-equal -Wsuggest-attribute=noreturn -Werror=missing-prototypes -Werror=implicit-function-declaration -Werror=missing-declarations -Werror=return-type -Werror=incompatible-pointer-types -Werror=format=2 -Wstrict-prototypes -Wredundant-decls -Wmissing-noreturn -Wimplicit-fallthrough=5 -Wshadow -Wendif-labels -Wstrict-aliasing=2 -Wwrite-strings -Werror=overflow -Werror=shift-count-overflow -Werror=shift-overflow=2 -Wdate-time -Wnested-externs -ffast-math -fno-common -fdiagnostics-show-option -fno-strict-aliasing -fvisibility=hidden -fstack-protector -fstack-protector-strong --param=ssp-buffer-size=4 -fPIE -ffunction-sections -fdata-sections -Wno-unused-parameter -Wno-missing-field-initializers -Wno-unused-result -Wno-format-signedness -Wno-error=nonnull -Werror=shadow -include config.h -O2 -fwrapv -Wformat -Werror=format-security -gdwarf-4 -fno-debug-types-section -fvar-tracking-assignments -g2 -Wp,-D_FORTIFY_SOURCE=2 -fstack-protector-strong --param=ssp-buffer-size=4 -fPIC -mtune=generic -march=x86-64 -gdwarf-4 -fno-debug-types-section -fvar-tracking-assignments -g2 -fPIC -pthread  -MD -MQ 'src/core/src@core@@core@sta/audit-fd.c.o' -MF 'src/core/src@core@@core@sta/audit-fd.c.o.d' -o 'src/core/src@core@@core@sta/audit-fd.c.o' -c ../src/core/audit-fd.c
[317/1560] x86_64-pld-linux-gnux32-gcc -Isrc/shared/src@shared@@systemd-shared-239@sta -Isrc/shared -I../src/shared -Isrc/basic -I../src/basic -Isrc/systemd -I../src/systemd -Isrc/journal -I../src/journal -Isrc/journal-remote -I../src/journal-remote -Isrc/nspawn -I../src/nspawn -Isrc/resolve -I../src/resolve -Isrc/timesync -I../src/timesync -I../src/time-wait-sync -Isrc/login -I../src/login -Isrc/udev -I../src/udev -Isrc/libudev -I../src/libudev -Isrc/core -I../src/core -I../src/libsystemd/sd-bus -I../src/libsystemd/sd-device -I../src/libsystemd/sd-hwdb -I../src/libsystemd/sd-id128 -I../src/libsystemd/sd-netlink -I../src/libsystemd/sd-network -Isrc/libsystemd-network -I../src/libsystemd-network -I. -I../ -I/usr/include/blkid -I/usr/include/uuid -fdiagnostics-color=always -pipe -D_FILE_OFFSET_BITS=64 -std=gnu99 -Wextra -Werror=undef -Wlogical-op -Wmissing-include-dirs -Wold-style-definition -Wpointer-arith -Winit-self -Wfloat-equal -Wsuggest-attribute=noreturn -Werror=missing-prototypes -Werror=implicit-function-declaration -Werror=missing-declarations -Werror=return-type -Werror=incompatible-pointer-types -Werror=format=2 -Wstrict-prototypes -Wredundant-decls -Wmissing-noreturn -Wimplicit-fallthrough=5 -Wshadow -Wendif-labels -Wstrict-aliasing=2 -Wwrite-strings -Werror=overflow -Werror=shift-count-overflow -Werror=shift-overflow=2 -Wdate-time -Wnested-externs -ffast-math -fno-common -fdiagnostics-show-option -fno-strict-aliasing -fvisibility=hidden -fstack-protector -fstack-protector-strong --param=ssp-buffer-size=4 -fPIE -ffunction-sections -fdata-sections -Wno-unused-parameter -Wno-missing-field-initializers -Wno-unused-result -Wno-format-signedness -Wno-error=nonnull -Werror=shadow -include config.h -O2 -fwrapv -Wformat -Werror=format-security -gdwarf-4 -fno-debug-types-section -fvar-tracking-assignments -g2 -Wp,-D_FORTIFY_SOURCE=2 -fstack-protector-strong --param=ssp-buffer-size=4 -fPIC -mtune=generic -march=x86-64 -gdwarf-4 -fno-debug-types-section -fvar-tracking-assignments -g2 -fPIC -pthread -fvisibility=default  -MD -MQ 'src/shared/src@shared@@systemd-shared-239@sta/install.c.o' -MF 'src/shared/src@shared@@systemd-shared-239@sta/install.c.o.d' -o 'src/shared/src@shared@@systemd-shared-239@sta/install.c.o' -c ../src/shared/install.c
[318/1560] x86_64-pld-linux-gnux32-gcc -Isrc/shared/src@shared@@systemd-shared-239@sta -Isrc/shared -I../src/shared -Isrc/basic -I../src/basic -Isrc/systemd -I../src/systemd -Isrc/journal -I../src/journal -Isrc/journal-remote -I../src/journal-remote -Isrc/nspawn -I../src/nspawn -Isrc/resolve -I../src/resolve -Isrc/timesync -I../src/timesync -I../src/time-wait-sync -Isrc/login -I../src/login -Isrc/udev -I../src/udev -Isrc/libudev -I../src/libudev -Isrc/core -I../src/core -I../src/libsystemd/sd-bus -I../src/libsystemd/sd-device -I../src/libsystemd/sd-hwdb -I../src/libsystemd/sd-id128 -I../src/libsystemd/sd-netlink -I../src/libsystemd/sd-network -Isrc/libsystemd-network -I../src/libsystemd-network -I. -I../ -I/usr/include/blkid -I/usr/include/uuid -fdiagnostics-color=always -pipe -D_FILE_OFFSET_BITS=64 -std=gnu99 -Wextra -Werror=undef -Wlogical-op -Wmissing-include-dirs -Wold-style-definition -Wpointer-arith -Winit-self -Wfloat-equal -Wsuggest-attribute=noreturn -Werror=missing-prototypes -Werror=implicit-function-declaration -Werror=missing-declarations -Werror=return-type -Werror=incompatible-pointer-types -Werror=format=2 -Wstrict-prototypes -Wredundant-decls -Wmissing-noreturn -Wimplicit-fallthrough=5 -Wshadow -Wendif-labels -Wstrict-aliasing=2 -Wwrite-strings -Werror=overflow -Werror=shift-count-overflow -Werror=shift-overflow=2 -Wdate-time -Wnested-externs -ffast-math -fno-common -fdiagnostics-show-option -fno-strict-aliasing -fvisibility=hidden -fstack-protector -fstack-protector-strong --param=ssp-buffer-size=4 -fPIE -ffunction-sections -fdata-sections -Wno-unused-parameter -Wno-missing-field-initializers -Wno-unused-result -Wno-format-signedness -Wno-error=nonnull -Werror=shadow -include config.h -O2 -fwrapv -Wformat -Werror=format-security -gdwarf-4 -fno-debug-types-section -fvar-tracking-assignments -g2 -Wp,-D_FORTIFY_SOURCE=2 -fstack-protector-strong --param=ssp-buffer-size=4 -fPIC -mtune=generic -march=x86-64 -gdwarf-4 -fno-debug-types-section -fvar-tracking-assignments -g2 -fPIC -pthread -fvisibility=default  -MD -MQ 'src/shared/src@shared@@systemd-shared-239@sta/seccomp-util.c.o' -MF 'src/shared/src@shared@@systemd-shared-239@sta/seccomp-util.c.o.d' -o 'src/shared/src@shared@@systemd-shared-239@sta/seccomp-util.c.o' -c ../src/shared/seccomp-util.c
[319/1560] x86_64-pld-linux-gnux32-gcc -Isrc/core/src@core@@core@sta -Isrc/core -I../src/core -Isrc/basic -I../src/basic -Isrc/shared -I../src/shared -Isrc/systemd -I../src/systemd -Isrc/journal -I../src/journal -Isrc/journal-remote -I../src/journal-remote -Isrc/nspawn -I../src/nspawn -Isrc/resolve -I../src/resolve -Isrc/timesync -I../src/timesync -I../src/time-wait-sync -Isrc/login -I../src/login -Isrc/udev -I../src/udev -Isrc/libudev -I../src/libudev -I../src/libsystemd/sd-bus -I../src/libsystemd/sd-device -I../src/libsystemd/sd-hwdb -I../src/libsystemd/sd-id128 -I../src/libsystemd/sd-netlink -I../src/libsystemd/sd-network -Isrc/libsystemd-network -I../src/libsystemd-network -I. -I../ -I/usr/include/libmount -I/usr/include/blkid -I/usr/include/uuid -fdiagnostics-color=always -pipe -D_FILE_OFFSET_BITS=64 -std=gnu99 -Wextra -Werror=undef -Wlogical-op -Wmissing-include-dirs -Wold-style-definition -Wpointer-arith -Winit-self -Wfloat-equal -Wsuggest-attribute=noreturn -Werror=missing-prototypes -Werror=implicit-function-declaration -Werror=missing-declarations -Werror=return-type -Werror=incompatible-pointer-types -Werror=format=2 -Wstrict-prototypes -Wredundant-decls -Wmissing-noreturn -Wimplicit-fallthrough=5 -Wshadow -Wendif-labels -Wstrict-aliasing=2 -Wwrite-strings -Werror=overflow -Werror=shift-count-overflow -Werror=shift-overflow=2 -Wdate-time -Wnested-externs -ffast-math -fno-common -fdiagnostics-show-option -fno-strict-aliasing -fvisibility=hidden -fstack-protector -fstack-protector-strong --param=ssp-buffer-size=4 -fPIE -ffunction-sections -fdata-sections -Wno-unused-parameter -Wno-missing-field-initializers -Wno-unused-result -Wno-format-signedness -Wno-error=nonnull -Werror=shadow -include config.h -O2 -fwrapv -Wformat -Werror=format-security -gdwarf-4 -fno-debug-types-section -fvar-tracking-assignments -g2 -Wp,-D_FORTIFY_SOURCE=2 -fstack-protector-strong --param=ssp-buffer-size=4 -fPIC -mtune=generic -march=x86-64 -gdwarf-4 -fno-debug-types-section -fvar-tracking-assignments -g2 -fPIC -pthread  -MD -MQ 'src/core/src@core@@core@sta/dbus-slice.c.o' -MF 'src/core/src@core@@core@sta/dbus-slice.c.o.d' -o 'src/core/src@core@@core@sta/dbus-slice.c.o' -c ../src/core/dbus-slice.c
[320/1560] x86_64-pld-linux-gnux32-gcc -Isrc/shared/src@shared@@systemd-shared-239@sha -Isrc/shared -I../src/shared -Isrc/basic -I../src/basic -Isrc/systemd -I../src/systemd -Isrc/journal -I../src/journal -Isrc/journal-remote -I../src/journal-remote -Isrc/nspawn -I../src/nspawn -Isrc/resolve -I../src/resolve -Isrc/timesync -I../src/timesync -I../src/time-wait-sync -Isrc/login -I../src/login -Isrc/udev -I../src/udev -Isrc/libudev -I../src/libudev -Isrc/core -I../src/core -I../src/libsystemd/sd-bus -I../src/libsystemd/sd-device -I../src/libsystemd/sd-hwdb -I../src/libsystemd/sd-id128 -I../src/libsystemd/sd-netlink -I../src/libsystemd/sd-network -Isrc/libsystemd-network -I../src/libsystemd-network -I. -I../ -I/usr/include/blkid -I/usr/include/uuid -fdiagnostics-color=always -pipe -D_FILE_OFFSET_BITS=64 -std=gnu99 -Wextra -Werror=undef -Wlogical-op -Wmissing-include-dirs -Wold-style-definition -Wpointer-arith -Winit-self -Wfloat-equal -Wsuggest-attribute=noreturn -Werror=missing-prototypes -Werror=implicit-function-declaration -Werror=missing-declarations -Werror=return-type -Werror=incompatible-pointer-types -Werror=format=2 -Wstrict-prototypes -Wredundant-decls -Wmissing-noreturn -Wimplicit-fallthrough=5 -Wshadow -Wendif-labels -Wstrict-aliasing=2 -Wwrite-strings -Werror=overflow -Werror=shift-count-overflow -Werror=shift-overflow=2 -Wdate-time -Wnested-externs -ffast-math -fno-common -fdiagnostics-show-option -fno-strict-aliasing -fvisibility=hidden -fstack-protector -fstack-protector-strong --param=ssp-buffer-size=4 -fPIE -ffunction-sections -fdata-sections -Wno-unused-parameter -Wno-missing-field-initializers -Wno-unused-result -Wno-format-signedness -Wno-error=nonnull -Werror=shadow -include config.h -O2 -fwrapv -Wformat -Werror=format-security -gdwarf-4 -fno-debug-types-section -fvar-tracking-assignments -g2 -Wp,-D_FORTIFY_SOURCE=2 -fstack-protector-strong --param=ssp-buffer-size=4 -fPIC -mtune=generic -march=x86-64 -gdwarf-4 -fno-debug-types-section -fvar-tracking-assignments -g2 -fPIC -pthread -fvisibility=default  -MD -MQ 'src/shared/src@shared@@systemd-shared-239@sha/.._libudev_libudev-monitor.c.o' -MF 'src/shared/src@shared@@systemd-shared-239@sha/.._libudev_libudev-monitor.c.o.d' -o 'src/shared/src@shared@@systemd-shared-239@sha/.._libudev_libudev-monitor.c.o' -c ../src/libudev/libudev-monitor.c
[321/1560] rm -f src/shared/libsystemd-shared-239.a && gcc-ar csrD src/shared/libsystemd-shared-239.a 'src/shared/src@shared@@systemd-shared-239@sta/acpi-fpdt.c.o' 'src/shared/src@shared@@systemd-shared-239@sta/apparmor-util.c.o' 'src/shared/src@shared@@systemd-shared-239@sta/ask-password-api.c.o' 'src/shared/src@shared@@systemd-shared-239@sta/base-filesystem.c.o' 'src/shared/src@shared@@systemd-shared-239@sta/boot-timestamps.c.o' 'src/shared/src@shared@@systemd-shared-239@sta/bootspec.c.o' 'src/shared/src@shared@@systemd-shared-239@sta/bus-unit-util.c.o' 'src/shared/src@shared@@systemd-shared-239@sta/bus-util.c.o' 'src/shared/src@shared@@systemd-shared-239@sta/cgroup-show.c.o' 'src/shared/src@shared@@systemd-shared-239@sta/clean-ipc.c.o' 'src/shared/src@shared@@systemd-shared-239@sta/condition.c.o' 'src/shared/src@shared@@systemd-shared-239@sta/conf-parser.c.o' 'src/shared/src@shared@@systemd-shared-239@sta/dev-setup.c.o' 'src/shared/src@shared@@systemd-shared-239@sta/dissect-image.c.o' 'src/shared/src@shared@@systemd-shared-239@sta/dns-domain.c.o' 'src/shared/src@shared@@systemd-shared-239@sta/dropin.c.o' 'src/shared/src@shared@@systemd-shared-239@sta/efivars.c.o' 'src/shared/src@shared@@systemd-shared-239@sta/fdset.c.o' 'src/shared/src@shared@@systemd-shared-239@sta/fstab-util.c.o' 'src/shared/src@shared@@systemd-shared-239@sta/generator.c.o' 'src/shared/src@shared@@systemd-shared-239@sta/ima-util.c.o' 'src/shared/src@shared@@systemd-shared-239@sta/import-util.c.o' 'src/shared/src@shared@@systemd-shared-239@sta/install.c.o' 'src/shared/src@shared@@systemd-shared-239@sta/install-printf.c.o' 'src/shared/src@shared@@systemd-shared-239@sta/journal-util.c.o' 'src/shared/src@shared@@systemd-shared-239@sta/logs-show.c.o' 'src/shared/src@shared@@systemd-shared-239@sta/loop-util.c.o' 'src/shared/src@shared@@systemd-shared-239@sta/machine-image.c.o' 'src/shared/src@shared@@systemd-shared-239@sta/machine-pool.c.o' 'src/shared/src@shared@@systemd-shared-239@sta/nsflags.c.o' 'src/shared/src@shared@@systemd-shared-239@sta/output-mode.c.o' 'src/shared/src@shared@@systemd-shared-239@sta/path-lookup.c.o' 'src/shared/src@shared@@systemd-shared-239@sta/ptyfwd.c.o' 'src/shared/src@shared@@systemd-shared-239@sta/resolve-util.c.o' 'src/shared/src@shared@@systemd-shared-239@sta/sleep-config.c.o' 'src/shared/src@shared@@systemd-shared-239@sta/spawn-ask-password-agent.c.o' 'src/shared/src@shared@@systemd-shared-239@sta/spawn-polkit-agent.c.o' 'src/shared/src@shared@@systemd-shared-239@sta/specifier.c.o' 'src/shared/src@shared@@systemd-shared-239@sta/switch-root.c.o' 'src/shared/src@shared@@systemd-shared-239@sta/sysctl-util.c.o' 'src/shared/src@shared@@systemd-shared-239@sta/tests.c.o' 'src/shared/src@shared@@systemd-shared-239@sta/tomoyo-util.c.o' 'src/shared/src@shared@@systemd-shared-239@sta/udev-util.c.o' 'src/shared/src@shared@@systemd-shared-239@sta/uid-range.c.o' 'src/shared/src@shared@@systemd-shared-239@sta/vlan-util.c.o' 'src/shared/src@shared@@systemd-shared-239@sta/volatile-util.c.o' 'src/shared/src@shared@@systemd-shared-239@sta/watchdog.c.o' 'src/shared/src@shared@@systemd-shared-239@sta/acl-util.c.o' 'src/shared/src@shared@@systemd-shared-239@sta/utmp-wtmp.c.o' 'src/shared/src@shared@@systemd-shared-239@sta/seccomp-util.c.o' 'src/shared/src@shared@@systemd-shared-239@sta/firewall-util.c.o'
[322/1560] x86_64-pld-linux-gnux32-gcc -Isrc/core/src@core@@core@sta -Isrc/core -I../src/core -Isrc/basic -I../src/basic -Isrc/shared -I../src/shared -Isrc/systemd -I../src/systemd -Isrc/journal -I../src/journal -Isrc/journal-remote -I../src/journal-remote -Isrc/nspawn -I../src/nspawn -Isrc/resolve -I../src/resolve -Isrc/timesync -I../src/timesync -I../src/time-wait-sync -Isrc/login -I../src/login -Isrc/udev -I../src/udev -Isrc/libudev -I../src/libudev -I../src/libsystemd/sd-bus -I../src/libsystemd/sd-device -I../src/libsystemd/sd-hwdb -I../src/libsystemd/sd-id128 -I../src/libsystemd/sd-netlink -I../src/libsystemd/sd-network -Isrc/libsystemd-network -I../src/libsystemd-network -I. -I../ -I/usr/include/libmount -I/usr/include/blkid -I/usr/include/uuid -fdiagnostics-color=always -pipe -D_FILE_OFFSET_BITS=64 -std=gnu99 -Wextra -Werror=undef -Wlogical-op -Wmissing-include-dirs -Wold-style-definition -Wpointer-arith -Winit-self -Wfloat-equal -Wsuggest-attribute=noreturn -Werror=missing-prototypes -Werror=implicit-function-declaration -Werror=missing-declarations -Werror=return-type -Werror=incompatible-pointer-types -Werror=format=2 -Wstrict-prototypes -Wredundant-decls -Wmissing-noreturn -Wimplicit-fallthrough=5 -Wshadow -Wendif-labels -Wstrict-aliasing=2 -Wwrite-strings -Werror=overflow -Werror=shift-count-overflow -Werror=shift-overflow=2 -Wdate-time -Wnested-externs -ffast-math -fno-common -fdiagnostics-show-option -fno-strict-aliasing -fvisibility=hidden -fstack-protector -fstack-protector-strong --param=ssp-buffer-size=4 -fPIE -ffunction-sections -fdata-sections -Wno-unused-parameter -Wno-missing-field-initializers -Wno-unused-result -Wno-format-signedness -Wno-error=nonnull -Werror=shadow -include config.h -O2 -fwrapv -Wformat -Werror=format-security -gdwarf-4 -fno-debug-types-section -fvar-tracking-assignments -g2 -Wp,-D_FORTIFY_SOURCE=2 -fstack-protector-strong --param=ssp-buffer-size=4 -fPIC -mtune=generic -march=x86-64 -gdwarf-4 -fno-debug-types-section -fvar-tracking-assignments -g2 -fPIC -pthread  -MD -MQ 'src/core/src@core@@core@sta/bpf-firewall.c.o' -MF 'src/core/src@core@@core@sta/bpf-firewall.c.o.d' -o 'src/core/src@core@@core@sta/bpf-firewall.c.o' -c ../src/core/bpf-firewall.c
[323/1560] x86_64-pld-linux-gnux32-gcc  -o src/shared/libsystemd-shared-239.so 'src/shared/src@shared@@systemd-shared-239@sha/.._libudev_libudev.c.o' 'src/shared/src@shared@@systemd-shared-239@sha/.._libudev_libudev-list.c.o' 'src/shared/src@shared@@systemd-shared-239@sha/.._libudev_libudev-util.c.o' 'src/shared/src@shared@@systemd-shared-239@sha/.._libudev_libudev-device.c.o' 'src/shared/src@shared@@systemd-shared-239@sha/.._libudev_libudev-device-private.c.o' 'src/shared/src@shared@@systemd-shared-239@sha/.._libudev_libudev-enumerate.c.o' 'src/shared/src@shared@@systemd-shared-239@sha/.._libudev_libudev-monitor.c.o' 'src/shared/src@shared@@systemd-shared-239@sha/.._libudev_libudev-queue.c.o' 'src/shared/src@shared@@systemd-shared-239@sha/.._libudev_libudev-hwdb.c.o' -Wl,--no-undefined -Wl,--as-needed -shared -fPIC -Wl,--start-group -Wl,-soname,libsystemd-shared-239.so -Wl,--whole-archive src/shared/libsystemd-shared-239.a src/basic/libbasic.a src/basic/libbasic-gcrypt.a src/libsystemd/libsystemd_static.a src/journal/libjournal-client.a -Wl,--no-whole-archive -Wl,-z,relro -Wl,-z,now -pie -Wl,--gc-sections -O2 -fwrapv -pipe -Wformat -Werror=format-security -gdwarf-4 -fno-debug-types-section -fvar-tracking-assignments -g2 -Wp,-D_FORTIFY_SOURCE=2 -fstack-protector-strong --param=ssp-buffer-size=4 -fPIC -mtune=generic -march=x86-64 -gdwarf-4 -fno-debug-types-section -fvar-tracking-assignments -g2 -Wl,--as-needed -Wl,--no-copy-dt-needed-entries -Wl,-z,relro -Wl,-z,combreloc -shared -Wl,--version-script=/tmp/B.esxPMU/BUILD/systemd-239/src/shared/libshared.sym -lrt /usr/libx32/libcap.so -lacl /usr/libx32/libcryptsetup.so -lgcrypt /usr/libx32/libip4tc.so /usr/libx32/libip6tc.so /usr/libx32/libseccomp.so /usr/libx32/libselinux.so -lidn2 /usr/libx32/liblzma.so /usr/libx32/liblz4.so /usr/libx32/libblkid.so -lrt -lacl -lgcrypt -lidn2 /usr/libx32/libmount.so -lgcrypt -lrt -Wl,--end-group -pthread  
FAILED: src/shared/libsystemd-shared-239.so 
x86_64-pld-linux-gnux32-gcc  -o src/shared/libsystemd-shared-239.so 'src/shared/src@shared@@systemd-shared-239@sha/.._libudev_libudev.c.o' 'src/shared/src@shared@@systemd-shared-239@sha/.._libudev_libudev-list.c.o' 'src/shared/src@shared@@systemd-shared-239@sha/.._libudev_libudev-util.c.o' 'src/shared/src@shared@@systemd-shared-239@sha/.._libudev_libudev-device.c.o' 'src/shared/src@shared@@systemd-shared-239@sha/.._libudev_libudev-device-private.c.o' 'src/shared/src@shared@@systemd-shared-239@sha/.._libudev_libudev-enumerate.c.o' 'src/shared/src@shared@@systemd-shared-239@sha/.._libudev_libudev-monitor.c.o' 'src/shared/src@shared@@systemd-shared-239@sha/.._libudev_libudev-queue.c.o' 'src/shared/src@shared@@systemd-shared-239@sha/.._libudev_libudev-hwdb.c.o' -Wl,--no-undefined -Wl,--as-needed -shared -fPIC -Wl,--start-group -Wl,-soname,libsystemd-shared-239.so -Wl,--whole-archive src/shared/libsystemd-shared-239.a src/basic/libbasic.a src/basic/libbasic-gcrypt.a src/libsystemd/libsystemd_static.a src/journal/libjournal-client.a -Wl,--no-whole-archive -Wl,-z,relro -Wl,-z,now -pie -Wl,--gc-sections -O2 -fwrapv -pipe -Wformat -Werror=format-security -gdwarf-4 -fno-debug-types-section -fvar-tracking-assignments -g2 -Wp,-D_FORTIFY_SOURCE=2 -fstack-protector-strong --param=ssp-buffer-size=4 -fPIC -mtune=generic -march=x86-64 -gdwarf-4 -fno-debug-types-section -fvar-tracking-assignments -g2 -Wl,--as-needed -Wl,--no-copy-dt-needed-entries -Wl,-z,relro -Wl,-z,combreloc -shared -Wl,--version-script=/tmp/B.esxPMU/BUILD/systemd-239/src/shared/libshared.sym -lrt /usr/libx32/libcap.so -lacl /usr/libx32/libcryptsetup.so -lgcrypt /usr/libx32/libip4tc.so /usr/libx32/libip6tc.so /usr/libx32/libseccomp.so /usr/libx32/libselinux.so -lidn2 /usr/libx32/liblzma.so /usr/libx32/liblz4.so /usr/libx32/libblkid.so -lrt -lacl -lgcrypt -lidn2 /usr/libx32/libmount.so -lgcrypt -lrt -Wl,--end-group -pthread  
/usr/bin/ld: cannot find -lidn2
/usr/bin/ld: cannot find -lidn2
collect2: error: ld returned 1 exit status
[324/1560] x86_64-pld-linux-gnux32-gcc -Isrc/core/src@core@@core@sta -Isrc/core -I../src/core -Isrc/basic -I../src/basic -Isrc/shared -I../src/shared -Isrc/systemd -I../src/systemd -Isrc/journal -I../src/journal -Isrc/journal-remote -I../src/journal-remote -Isrc/nspawn -I../src/nspawn -Isrc/resolve -I../src/resolve -Isrc/timesync -I../src/timesync -I../src/time-wait-sync -Isrc/login -I../src/login -Isrc/udev -I../src/udev -Isrc/libudev -I../src/libudev -I../src/libsystemd/sd-bus -I../src/libsystemd/sd-device -I../src/libsystemd/sd-hwdb -I../src/libsystemd/sd-id128 -I../src/libsystemd/sd-netlink -I../src/libsystemd/sd-network -Isrc/libsystemd-network -I../src/libsystemd-network -I. -I../ -I/usr/include/libmount -I/usr/include/blkid -I/usr/include/uuid -fdiagnostics-color=always -pipe -D_FILE_OFFSET_BITS=64 -std=gnu99 -Wextra -Werror=undef -Wlogical-op -Wmissing-include-dirs -Wold-style-definition -Wpointer-arith -Winit-self -Wfloat-equal -Wsuggest-attribute=noreturn -Werror=missing-prototypes -Werror=implicit-function-declaration -Werror=missing-declarations -Werror=return-type -Werror=incompatible-pointer-types -Werror=format=2 -Wstrict-prototypes -Wredundant-decls -Wmissing-noreturn -Wimplicit-fallthrough=5 -Wshadow -Wendif-labels -Wstrict-aliasing=2 -Wwrite-strings -Werror=overflow -Werror=shift-count-overflow -Werror=shift-overflow=2 -Wdate-time -Wnested-externs -ffast-math -fno-common -fdiagnostics-show-option -fno-strict-aliasing -fvisibility=hidden -fstack-protector -fstack-protector-strong --param=ssp-buffer-size=4 -fPIE -ffunction-sections -fdata-sections -Wno-unused-parameter -Wno-missing-field-initializers -Wno-unused-result -Wno-format-signedness -Wno-error=nonnull -Werror=shadow -include config.h -O2 -fwrapv -Wformat -Werror=format-security -gdwarf-4 -fno-debug-types-section -fvar-tracking-assignments -g2 -Wp,-D_FORTIFY_SOURCE=2 -fstack-protector-strong --param=ssp-buffer-size=4 -fPIC -mtune=generic -march=x86-64 -gdwarf-4 -fno-debug-types-section -fvar-tracking-assignments -g2 -fPIC -pthread  -MD -MQ 'src/core/src@core@@core@sta/dbus-service.c.o' -MF 'src/core/src@core@@core@sta/dbus-service.c.o.d' -o 'src/core/src@core@@core@sta/dbus-service.c.o' -c ../src/core/dbus-service.c
[325/1560] /usr/bin/meson --internal exe /tmp/B.esxPMU/BUILD/systemd-239/build/meson-private/meson_exe_meson-apply-m4.sh_7f6ebef6e87798a154db8d90305aa8d84626a2a2.dat
[326/1560] x86_64-pld-linux-gnux32-gcc -Isrc/core/src@core@@core@sta -Isrc/core -I../src/core -Isrc/basic -I../src/basic -Isrc/shared -I../src/shared -Isrc/systemd -I../src/systemd -Isrc/journal -I../src/journal -Isrc/journal-remote -I../src/journal-remote -Isrc/nspawn -I../src/nspawn -Isrc/resolve -I../src/resolve -Isrc/timesync -I../src/timesync -I../src/time-wait-sync -Isrc/login -I../src/login -Isrc/udev -I../src/udev -Isrc/libudev -I../src/libudev -I../src/libsystemd/sd-bus -I../src/libsystemd/sd-device -I../src/libsystemd/sd-hwdb -I../src/libsystemd/sd-id128 -I../src/libsystemd/sd-netlink -I../src/libsystemd/sd-network -Isrc/libsystemd-network -I../src/libsystemd-network -I. -I../ -I/usr/include/libmount -I/usr/include/blkid -I/usr/include/uuid -fdiagnostics-color=always -pipe -D_FILE_OFFSET_BITS=64 -std=gnu99 -Wextra -Werror=undef -Wlogical-op -Wmissing-include-dirs -Wold-style-definition -Wpointer-arith -Winit-self -Wfloat-equal -Wsuggest-attribute=noreturn -Werror=missing-prototypes -Werror=implicit-function-declaration -Werror=missing-declarations -Werror=return-type -Werror=incompatible-pointer-types -Werror=format=2 -Wstrict-prototypes -Wredundant-decls -Wmissing-noreturn -Wimplicit-fallthrough=5 -Wshadow -Wendif-labels -Wstrict-aliasing=2 -Wwrite-strings -Werror=overflow -Werror=shift-count-overflow -Werror=shift-overflow=2 -Wdate-time -Wnested-externs -ffast-math -fno-common -fdiagnostics-show-option -fno-strict-aliasing -fvisibility=hidden -fstack-protector -fstack-protector-strong --param=ssp-buffer-size=4 -fPIE -ffunction-sections -fdata-sections -Wno-unused-parameter -Wno-missing-field-initializers -Wno-unused-result -Wno-format-signedness -Wno-error=nonnull -Werror=shadow -include config.h -O2 -fwrapv -Wformat -Werror=format-security -gdwarf-4 -fno-debug-types-section -fvar-tracking-assignments -g2 -Wp,-D_FORTIFY_SOURCE=2 -fstack-protector-strong --param=ssp-buffer-size=4 -fPIC -mtune=generic -march=x86-64 -gdwarf-4 -fno-debug-types-section -fvar-tracking-assignments -g2 -fPIC -pthread  -MD -MQ 'src/core/src@core@@core@sta/dbus-kill.c.o' -MF 'src/core/src@core@@core@sta/dbus-kill.c.o.d' -o 'src/core/src@core@@core@sta/dbus-kill.c.o' -c ../src/core/dbus-kill.c
[327/1560] x86_64-pld-linux-gnux32-gcc -Isrc/core/src@core@@core@sta -Isrc/core -I../src/core -Isrc/basic -I../src/basic -Isrc/shared -I../src/shared -Isrc/systemd -I../src/systemd -Isrc/journal -I../src/journal -Isrc/journal-remote -I../src/journal-remote -Isrc/nspawn -I../src/nspawn -Isrc/resolve -I../src/resolve -Isrc/timesync -I../src/timesync -I../src/time-wait-sync -Isrc/login -I../src/login -Isrc/udev -I../src/udev -Isrc/libudev -I../src/libudev -I../src/libsystemd/sd-bus -I../src/libsystemd/sd-device -I../src/libsystemd/sd-hwdb -I../src/libsystemd/sd-id128 -I../src/libsystemd/sd-netlink -I../src/libsystemd/sd-network -Isrc/libsystemd-network -I../src/libsystemd-network -I. -I../ -I/usr/include/libmount -I/usr/include/blkid -I/usr/include/uuid -fdiagnostics-color=always -pipe -D_FILE_OFFSET_BITS=64 -std=gnu99 -Wextra -Werror=undef -Wlogical-op -Wmissing-include-dirs -Wold-style-definition -Wpointer-arith -Winit-self -Wfloat-equal -Wsuggest-attribute=noreturn -Werror=missing-prototypes -Werror=implicit-function-declaration -Werror=missing-declarations -Werror=return-type -Werror=incompatible-pointer-types -Werror=format=2 -Wstrict-prototypes -Wredundant-decls -Wmissing-noreturn -Wimplicit-fallthrough=5 -Wshadow -Wendif-labels -Wstrict-aliasing=2 -Wwrite-strings -Werror=overflow -Werror=shift-count-overflow -Werror=shift-overflow=2 -Wdate-time -Wnested-externs -ffast-math -fno-common -fdiagnostics-show-option -fno-strict-aliasing -fvisibility=hidden -fstack-protector -fstack-protector-strong --param=ssp-buffer-size=4 -fPIE -ffunction-sections -fdata-sections -Wno-unused-parameter -Wno-missing-field-initializers -Wno-unused-result -Wno-format-signedness -Wno-error=nonnull -Werror=shadow -include config.h -O2 -fwrapv -Wformat -Werror=format-security -gdwarf-4 -fno-debug-types-section -fvar-tracking-assignments -g2 -Wp,-D_FORTIFY_SOURCE=2 -fstack-protector-strong --param=ssp-buffer-size=4 -fPIC -mtune=generic -march=x86-64 -gdwarf-4 -fno-debug-types-section -fvar-tracking-assignments -g2 -fPIC -pthread  -MD -MQ 'src/core/src@core@@core@sta/automount.c.o' -MF 'src/core/src@core@@core@sta/automount.c.o.d' -o 'src/core/src@core@@core@sta/automount.c.o' -c ../src/core/automount.c
[328/1560] x86_64-pld-linux-gnux32-gcc -Isrc/core/src@core@@core@sta -Isrc/core -I../src/core -Isrc/basic -I../src/basic -Isrc/shared -I../src/shared -Isrc/systemd -I../src/systemd -Isrc/journal -I../src/journal -Isrc/journal-remote -I../src/journal-remote -Isrc/nspawn -I../src/nspawn -Isrc/resolve -I../src/resolve -Isrc/timesync -I../src/timesync -I../src/time-wait-sync -Isrc/login -I../src/login -Isrc/udev -I../src/udev -Isrc/libudev -I../src/libudev -I../src/libsystemd/sd-bus -I../src/libsystemd/sd-device -I../src/libsystemd/sd-hwdb -I../src/libsystemd/sd-id128 -I../src/libsystemd/sd-netlink -I../src/libsystemd/sd-network -Isrc/libsystemd-network -I../src/libsystemd-network -I. -I../ -I/usr/include/libmount -I/usr/include/blkid -I/usr/include/uuid -fdiagnostics-color=always -pipe -D_FILE_OFFSET_BITS=64 -std=gnu99 -Wextra -Werror=undef -Wlogical-op -Wmissing-include-dirs -Wold-style-definition -Wpointer-arith -Winit-self -Wfloat-equal -Wsuggest-attribute=noreturn -Werror=missing-prototypes -Werror=implicit-function-declaration -Werror=missing-declarations -Werror=return-type -Werror=incompatible-pointer-types -Werror=format=2 -Wstrict-prototypes -Wredundant-decls -Wmissing-noreturn -Wimplicit-fallthrough=5 -Wshadow -Wendif-labels -Wstrict-aliasing=2 -Wwrite-strings -Werror=overflow -Werror=shift-count-overflow -Werror=shift-overflow=2 -Wdate-time -Wnested-externs -ffast-math -fno-common -fdiagnostics-show-option -fno-strict-aliasing -fvisibility=hidden -fstack-protector -fstack-protector-strong --param=ssp-buffer-size=4 -fPIE -ffunction-sections -fdata-sections -Wno-unused-parameter -Wno-missing-field-initializers -Wno-unused-result -Wno-format-signedness -Wno-error=nonnull -Werror=shadow -include config.h -O2 -fwrapv -Wformat -Werror=format-security -gdwarf-4 -fno-debug-types-section -fvar-tracking-assignments -g2 -Wp,-D_FORTIFY_SOURCE=2 -fstack-protector-strong --param=ssp-buffer-size=4 -fPIC -mtune=generic -march=x86-64 -gdwarf-4 -fno-debug-types-section -fvar-tracking-assignments -g2 -fPIC -pthread  -MD -MQ 'src/core/src@core@@core@sta/dbus-mount.c.o' -MF 'src/core/src@core@@core@sta/dbus-mount.c.o.d' -o 'src/core/src@core@@core@sta/dbus-mount.c.o' -c ../src/core/dbus-mount.c
[329/1560] x86_64-pld-linux-gnux32-gcc -Isrc/core/src@core@@core@sta -Isrc/core -I../src/core -Isrc/basic -I../src/basic -Isrc/shared -I../src/shared -Isrc/systemd -I../src/systemd -Isrc/journal -I../src/journal -Isrc/journal-remote -I../src/journal-remote -Isrc/nspawn -I../src/nspawn -Isrc/resolve -I../src/resolve -Isrc/timesync -I../src/timesync -I../src/time-wait-sync -Isrc/login -I../src/login -Isrc/udev -I../src/udev -Isrc/libudev -I../src/libudev -I../src/libsystemd/sd-bus -I../src/libsystemd/sd-device -I../src/libsystemd/sd-hwdb -I../src/libsystemd/sd-id128 -I../src/libsystemd/sd-netlink -I../src/libsystemd/sd-network -Isrc/libsystemd-network -I../src/libsystemd-network -I. -I../ -I/usr/include/libmount -I/usr/include/blkid -I/usr/include/uuid -fdiagnostics-color=always -pipe -D_FILE_OFFSET_BITS=64 -std=gnu99 -Wextra -Werror=undef -Wlogical-op -Wmissing-include-dirs -Wold-style-definition -Wpointer-arith -Winit-self -Wfloat-equal -Wsuggest-attribute=noreturn -Werror=missing-prototypes -Werror=implicit-function-declaration -Werror=missing-declarations -Werror=return-type -Werror=incompatible-pointer-types -Werror=format=2 -Wstrict-prototypes -Wredundant-decls -Wmissing-noreturn -Wimplicit-fallthrough=5 -Wshadow -Wendif-labels -Wstrict-aliasing=2 -Wwrite-strings -Werror=overflow -Werror=shift-count-overflow -Werror=shift-overflow=2 -Wdate-time -Wnested-externs -ffast-math -fno-common -fdiagnostics-show-option -fno-strict-aliasing -fvisibility=hidden -fstack-protector -fstack-protector-strong --param=ssp-buffer-size=4 -fPIE -ffunction-sections -fdata-sections -Wno-unused-parameter -Wno-missing-field-initializers -Wno-unused-result -Wno-format-signedness -Wno-error=nonnull -Werror=shadow -include config.h -O2 -fwrapv -Wformat -Werror=format-security -gdwarf-4 -fno-debug-types-section -fvar-tracking-assignments -g2 -Wp,-D_FORTIFY_SOURCE=2 -fstack-protector-strong --param=ssp-buffer-size=4 -fPIC -mtune=generic -march=x86-64 -gdwarf-4 -fno-debug-types-section -fvar-tracking-assignments -g2 -fPIC -pthread  -MD -MQ 'src/core/src@core@@core@sta/dbus-socket.c.o' -MF 'src/core/src@core@@core@sta/dbus-socket.c.o.d' -o 'src/core/src@core@@core@sta/dbus-socket.c.o' -c ../src/core/dbus-socket.c
[330/1560] x86_64-pld-linux-gnux32-gcc -Isrc/core/src@core@@core@sta -Isrc/core -I../src/core -Isrc/basic -I../src/basic -Isrc/shared -I../src/shared -Isrc/systemd -I../src/systemd -Isrc/journal -I../src/journal -Isrc/journal-remote -I../src/journal-remote -Isrc/nspawn -I../src/nspawn -Isrc/resolve -I../src/resolve -Isrc/timesync -I../src/timesync -I../src/time-wait-sync -Isrc/login -I../src/login -Isrc/udev -I../src/udev -Isrc/libudev -I../src/libudev -I../src/libsystemd/sd-bus -I../src/libsystemd/sd-device -I../src/libsystemd/sd-hwdb -I../src/libsystemd/sd-id128 -I../src/libsystemd/sd-netlink -I../src/libsystemd/sd-network -Isrc/libsystemd-network -I../src/libsystemd-network -I. -I../ -I/usr/include/libmount -I/usr/include/blkid -I/usr/include/uuid -fdiagnostics-color=always -pipe -D_FILE_OFFSET_BITS=64 -std=gnu99 -Wextra -Werror=undef -Wlogical-op -Wmissing-include-dirs -Wold-style-definition -Wpointer-arith -Winit-self -Wfloat-equal -Wsuggest-attribute=noreturn -Werror=missing-prototypes -Werror=implicit-function-declaration -Werror=missing-declarations -Werror=return-type -Werror=incompatible-pointer-types -Werror=format=2 -Wstrict-prototypes -Wredundant-decls -Wmissing-noreturn -Wimplicit-fallthrough=5 -Wshadow -Wendif-labels -Wstrict-aliasing=2 -Wwrite-strings -Werror=overflow -Werror=shift-count-overflow -Werror=shift-overflow=2 -Wdate-time -Wnested-externs -ffast-math -fno-common -fdiagnostics-show-option -fno-strict-aliasing -fvisibility=hidden -fstack-protector -fstack-protector-strong --param=ssp-buffer-size=4 -fPIE -ffunction-sections -fdata-sections -Wno-unused-parameter -Wno-missing-field-initializers -Wno-unused-result -Wno-format-signedness -Wno-error=nonnull -Werror=shadow -include config.h -O2 -fwrapv -Wformat -Werror=format-security -gdwarf-4 -fno-debug-types-section -fvar-tracking-assignments -g2 -Wp,-D_FORTIFY_SOURCE=2 -fstack-protector-strong --param=ssp-buffer-size=4 -fPIC -mtune=generic -march=x86-64 -gdwarf-4 -fno-debug-types-section -fvar-tracking-assignments -g2 -fPIC -pthread  -MD -MQ 'src/core/src@core@@core@sta/dbus-manager.c.o' -MF 'src/core/src@core@@core@sta/dbus-manager.c.o.d' -o 'src/core/src@core@@core@sta/dbus-manager.c.o' -c ../src/core/dbus-manager.c
[331/1560] x86_64-pld-linux-gnux32-gcc -Isrc/core/src@core@@core@sta -Isrc/core -I../src/core -Isrc/basic -I../src/basic -Isrc/shared -I../src/shared -Isrc/systemd -I../src/systemd -Isrc/journal -I../src/journal -Isrc/journal-remote -I../src/journal-remote -Isrc/nspawn -I../src/nspawn -Isrc/resolve -I../src/resolve -Isrc/timesync -I../src/timesync -I../src/time-wait-sync -Isrc/login -I../src/login -Isrc/udev -I../src/udev -Isrc/libudev -I../src/libudev -I../src/libsystemd/sd-bus -I../src/libsystemd/sd-device -I../src/libsystemd/sd-hwdb -I../src/libsystemd/sd-id128 -I../src/libsystemd/sd-netlink -I../src/libsystemd/sd-network -Isrc/libsystemd-network -I../src/libsystemd-network -I. -I../ -I/usr/include/libmount -I/usr/include/blkid -I/usr/include/uuid -fdiagnostics-color=always -pipe -D_FILE_OFFSET_BITS=64 -std=gnu99 -Wextra -Werror=undef -Wlogical-op -Wmissing-include-dirs -Wold-style-definition -Wpointer-arith -Winit-self -Wfloat-equal -Wsuggest-attribute=noreturn -Werror=missing-prototypes -Werror=implicit-function-declaration -Werror=missing-declarations -Werror=return-type -Werror=incompatible-pointer-types -Werror=format=2 -Wstrict-prototypes -Wredundant-decls -Wmissing-noreturn -Wimplicit-fallthrough=5 -Wshadow -Wendif-labels -Wstrict-aliasing=2 -Wwrite-strings -Werror=overflow -Werror=shift-count-overflow -Werror=shift-overflow=2 -Wdate-time -Wnested-externs -ffast-math -fno-common -fdiagnostics-show-option -fno-strict-aliasing -fvisibility=hidden -fstack-protector -fstack-protector-strong --param=ssp-buffer-size=4 -fPIE -ffunction-sections -fdata-sections -Wno-unused-parameter -Wno-missing-field-initializers -Wno-unused-result -Wno-format-signedness -Wno-error=nonnull -Werror=shadow -include config.h -O2 -fwrapv -Wformat -Werror=format-security -gdwarf-4 -fno-debug-types-section -fvar-tracking-assignments -g2 -Wp,-D_FORTIFY_SOURCE=2 -fstack-protector-strong --param=ssp-buffer-size=4 -fPIC -mtune=generic -march=x86-64 -gdwarf-4 -fno-debug-types-section -fvar-tracking-assignments -g2 -fPIC -pthread  -MD -MQ 'src/core/src@core@@core@sta/cgroup.c.o' -MF 'src/core/src@core@@core@sta/cgroup.c.o.d' -o 'src/core/src@core@@core@sta/cgroup.c.o' -c ../src/core/cgroup.c
ninja: build stopped: subcommand failed.
error: Bad exit status from /tmp/B.esxPMU/BUILD/tmp/rpm-tmp.46174 (%build)


RPM build errors:
    Bad exit status from /tmp/B.esxPMU/BUILD/tmp/rpm-tmp.46174 (%build)
ended at: Fri Feb  8 22:28:20 2019, done in 0:00:29.099657
error: No files produced.
+ chmod -R u+rwX /tmp/B.esxPMU/BUILD
+ rm -rf /tmp/B.esxPMU/tmp /tmp/B.esxPMU/BUILD
+ rm -rf /tmp/B.esxPMU
Begin-PLD-Builder-Info
Build-Time: user:127.59s sys:15.55s real:34.73s (faults io:7 non-io:2472117)

End-PLD-Builder-Info
[Back to list of logs] [View rpm -qa of builder]