FailedOk

th/SRPMS[OK]
th/x32[OK]
th/i686[OK]
th/x86_64[OK]

ac/SRPMS[OK]
ac/i386[OK]
ac/i586[OK]
ac/i686[OK]
ac/alpha[OK]
ac/amd64[OK]
ac/athlon[OK]
ac/ppc[OK]
ac/sparc[OK]
ac/sparc64[OK]

Advanced Search
main()
Powered by PLD Linux
(c) 2002-2018 PLD Team
$Revision: 1.37 $
Powered by NSA.
Your IP: 54.161.49.216

systemd 4a1835e9-52ee-440a-826b-d37d8071801f

Status:Failed
Source URL:ftp://buildlogs.pld-linux.org/th/x32/FAIL/systemd,4a1835e9-52ee-440a-826b-d37d8071801f.bz2
text/plain URL:View!
full text:View!
rpm -qa of builder:View!
Date:2018/05/15 12:23:53
Runtime:0:02:17.221869

Toc:

  • error 1
  • error: No files produced.
  • error 2
  • ../src/basic/alloc-util.h:27:10: fatal error: macro.h: No such file or directory
  • error 3
  • compilation terminated.

Content:

[824/1834] x86_64-pld-linux-gnux32-gcc  -o test-dlopen 'test-dlopen@exe/src_test_test-dlopen.c.o' -Wl,--no-undefined -Wl,--as-needed -Wl,-z,relro -Wl,-z,now -pie -Wl,--gc-sections -O2 -fwrapv -pipe -Wformat -Werror=format-security -gdwarf-4 -fno-debug-types-section -fvar-tracking-assignments -g2 -Wp,-D_FORTIFY_SOURCE=2 -fstack-protector-strong --param=ssp-buffer-size=4 -fPIC -mtune=generic -march=x86-64 -gdwarf-4 -fno-debug-types-section -fvar-tracking-assignments -g2 -Wl,--as-needed -Wl,--no-copy-dt-needed-entries -Wl,-z,relro -Wl,-z,combreloc -Wl,--start-group src/basic/libbasic.a -ldl -lcap -lblkid -lselinux -Wl,--end-group  
[825/1834] x86_64-pld-linux-gnux32-gcc -Isrc/machine/src@machine@@machine-core@sta -Isrc/machine -I../src/machine -Isrc/basic -I../src/basic -Isrc/shared -I../src/shared -Isrc/systemd -I../src/systemd -Isrc/journal -I../src/journal -Isrc/resolve -I../src/resolve -Isrc/timesync -I../src/timesync -Isrc/login -I../src/login -Isrc/udev -I../src/udev -Isrc/libudev -I../src/libudev -Isrc/core -I../src/core -I../src/libsystemd/sd-bus -I../src/libsystemd/sd-device -I../src/libsystemd/sd-hwdb -I../src/libsystemd/sd-id128 -I../src/libsystemd/sd-netlink -I../src/libsystemd/sd-network -Isrc/libsystemd-network -I../src/libsystemd-network -I. -I../ -fdiagnostics-color=always -pipe -D_FILE_OFFSET_BITS=64 -std=gnu99 -Wextra -Werror=undef -Wlogical-op -Wmissing-include-dirs -Wold-style-definition -Wpointer-arith -Winit-self -Wdeclaration-after-statement -Wfloat-equal -Wsuggest-attribute=noreturn -Werror=missing-prototypes -Werror=implicit-function-declaration -Werror=missing-declarations -Werror=return-type -Werror=incompatible-pointer-types -Werror=format=2 -Wstrict-prototypes -Wredundant-decls -Wmissing-noreturn -Wshadow -Wendif-labels -Wstrict-aliasing=2 -Wwrite-strings -Werror=overflow -Wdate-time -Wnested-externs -ffast-math -fno-common -fdiagnostics-show-option -fno-strict-aliasing -fvisibility=hidden -fstack-protector -fstack-protector-strong -fPIE --param=ssp-buffer-size=4 -Wno-unused-parameter -Wno-missing-field-initializers -Wno-unused-result -Wno-format-signedness -Wno-error=nonnull -Werror=shadow -ffunction-sections -fdata-sections -include config.h -O2 -fwrapv -Wformat -Werror=format-security -gdwarf-4 -fno-debug-types-section -fvar-tracking-assignments -g2 -Wp,-D_FORTIFY_SOURCE=2 -fstack-protector-strong --param=ssp-buffer-size=4 -fPIC -mtune=generic -march=x86-64 -gdwarf-4 -fno-debug-types-section -fvar-tracking-assignments -g2 -fPIC -pthread  -MD -MQ 'src/machine/src@machine@@machine-core@sta/machined-dbus.c.o' -MF 'src/machine/src@machine@@machine-core@sta/machined-dbus.c.o.d' -o 'src/machine/src@machine@@machine-core@sta/machined-dbus.c.o' -c ../src/machine/machined-dbus.c
[826/1834] rm -f src/machine/libmachine-core.a && gcc-ar csrD src/machine/libmachine-core.a 'src/machine/src@machine@@machine-core@sta/machine.c.o' 'src/machine/src@machine@@machine-core@sta/machined-dbus.c.o' 'src/machine/src@machine@@machine-core@sta/machine-dbus.c.o' 'src/machine/src@machine@@machine-core@sta/image-dbus.c.o' 'src/machine/src@machine@@machine-core@sta/operation.c.o'
[827/1834] /usr/bin/python3 /usr/bin/meson --internal exe /tmp/B.snKZS9/BUILD/systemd-235/build/meson-private/meson_exe_awk_334f559c4eae60aea0de0bad45630573eb03366a.dat
[828/1834] /usr/bin/python3 /usr/bin/meson --internal exe /tmp/B.snKZS9/BUILD/systemd-235/build/meson-private/meson_exe_gperf_c4b259312413e151adc88814e101a17866c3b719.dat
[829/1834] x86_64-pld-linux-gnux32-gcc -Inss_myhostname@sha -I. -I.. -Isrc/basic -I../src/basic -Isrc/shared -I../src/shared -Isrc/systemd -I../src/systemd -Isrc/journal -I../src/journal -Isrc/resolve -I../src/resolve -Isrc/timesync -I../src/timesync -Isrc/login -I../src/login -Isrc/udev -I../src/udev -Isrc/libudev -I../src/libudev -Isrc/core -I../src/core -I../src/libsystemd/sd-bus -I../src/libsystemd/sd-device -I../src/libsystemd/sd-hwdb -I../src/libsystemd/sd-id128 -I../src/libsystemd/sd-netlink -I../src/libsystemd/sd-network -Isrc/libsystemd-network -I../src/libsystemd-network -I../ -fdiagnostics-color=always -pipe -D_FILE_OFFSET_BITS=64 -std=gnu99 -Wextra -Werror=undef -Wlogical-op -Wmissing-include-dirs -Wold-style-definition -Wpointer-arith -Winit-self -Wdeclaration-after-statement -Wfloat-equal -Wsuggest-attribute=noreturn -Werror=missing-prototypes -Werror=implicit-function-declaration -Werror=missing-declarations -Werror=return-type -Werror=incompatible-pointer-types -Werror=format=2 -Wstrict-prototypes -Wredundant-decls -Wmissing-noreturn -Wshadow -Wendif-labels -Wstrict-aliasing=2 -Wwrite-strings -Werror=overflow -Wdate-time -Wnested-externs -ffast-math -fno-common -fdiagnostics-show-option -fno-strict-aliasing -fvisibility=hidden -fstack-protector -fstack-protector-strong -fPIE --param=ssp-buffer-size=4 -Wno-unused-parameter -Wno-missing-field-initializers -Wno-unused-result -Wno-format-signedness -Wno-error=nonnull -Werror=shadow -ffunction-sections -fdata-sections -include config.h -O2 -fwrapv -Wformat -Werror=format-security -gdwarf-4 -fno-debug-types-section -fvar-tracking-assignments -g2 -Wp,-D_FORTIFY_SOURCE=2 -fstack-protector-strong --param=ssp-buffer-size=4 -fPIC -mtune=generic -march=x86-64 -gdwarf-4 -fno-debug-types-section -fvar-tracking-assignments -g2 -fPIC -pthread  -MD -MQ 'nss_myhostname@sha/src_nss-myhostname_nss-myhostname.c.o' -MF 'nss_myhostname@sha/src_nss-myhostname_nss-myhostname.c.o.d' -o 'nss_myhostname@sha/src_nss-myhostname_nss-myhostname.c.o' -c ../src/nss-myhostname/nss-myhostname.c
[830/1834] x86_64-pld-linux-gnux32-gcc -Inss_resolve@sha -I. -I.. -Isrc/basic -I../src/basic -Isrc/shared -I../src/shared -Isrc/systemd -I../src/systemd -Isrc/journal -I../src/journal -Isrc/resolve -I../src/resolve -Isrc/timesync -I../src/timesync -Isrc/login -I../src/login -Isrc/udev -I../src/udev -Isrc/libudev -I../src/libudev -Isrc/core -I../src/core -I../src/libsystemd/sd-bus -I../src/libsystemd/sd-device -I../src/libsystemd/sd-hwdb -I../src/libsystemd/sd-id128 -I../src/libsystemd/sd-netlink -I../src/libsystemd/sd-network -Isrc/libsystemd-network -I../src/libsystemd-network -I../ -fdiagnostics-color=always -pipe -D_FILE_OFFSET_BITS=64 -std=gnu99 -Wextra -Werror=undef -Wlogical-op -Wmissing-include-dirs -Wold-style-definition -Wpointer-arith -Winit-self -Wdeclaration-after-statement -Wfloat-equal -Wsuggest-attribute=noreturn -Werror=missing-prototypes -Werror=implicit-function-declaration -Werror=missing-declarations -Werror=return-type -Werror=incompatible-pointer-types -Werror=format=2 -Wstrict-prototypes -Wredundant-decls -Wmissing-noreturn -Wshadow -Wendif-labels -Wstrict-aliasing=2 -Wwrite-strings -Werror=overflow -Wdate-time -Wnested-externs -ffast-math -fno-common -fdiagnostics-show-option -fno-strict-aliasing -fvisibility=hidden -fstack-protector -fstack-protector-strong -fPIE --param=ssp-buffer-size=4 -Wno-unused-parameter -Wno-missing-field-initializers -Wno-unused-result -Wno-format-signedness -Wno-error=nonnull -Werror=shadow -ffunction-sections -fdata-sections -include config.h -O2 -fwrapv -Wformat -Werror=format-security -gdwarf-4 -fno-debug-types-section -fvar-tracking-assignments -g2 -Wp,-D_FORTIFY_SOURCE=2 -fstack-protector-strong --param=ssp-buffer-size=4 -fPIC -mtune=generic -march=x86-64 -gdwarf-4 -fno-debug-types-section -fvar-tracking-assignments -g2 -fPIC -pthread  -MD -MQ 'nss_resolve@sha/src_nss-resolve_nss-resolve.c.o' -MF 'nss_resolve@sha/src_nss-resolve_nss-resolve.c.o.d' -o 'nss_resolve@sha/src_nss-resolve_nss-resolve.c.o' -c ../src/nss-resolve/nss-resolve.c
[831/1834] x86_64-pld-linux-gnux32-gcc -Inss_systemd@sha -I. -I.. -Isrc/basic -I../src/basic -Isrc/shared -I../src/shared -Isrc/systemd -I../src/systemd -Isrc/journal -I../src/journal -Isrc/resolve -I../src/resolve -Isrc/timesync -I../src/timesync -Isrc/login -I../src/login -Isrc/udev -I../src/udev -Isrc/libudev -I../src/libudev -Isrc/core -I../src/core -I../src/libsystemd/sd-bus -I../src/libsystemd/sd-device -I../src/libsystemd/sd-hwdb -I../src/libsystemd/sd-id128 -I../src/libsystemd/sd-netlink -I../src/libsystemd/sd-network -Isrc/libsystemd-network -I../src/libsystemd-network -I../ -fdiagnostics-color=always -pipe -D_FILE_OFFSET_BITS=64 -std=gnu99 -Wextra -Werror=undef -Wlogical-op -Wmissing-include-dirs -Wold-style-definition -Wpointer-arith -Winit-self -Wdeclaration-after-statement -Wfloat-equal -Wsuggest-attribute=noreturn -Werror=missing-prototypes -Werror=implicit-function-declaration -Werror=missing-declarations -Werror=return-type -Werror=incompatible-pointer-types -Werror=format=2 -Wstrict-prototypes -Wredundant-decls -Wmissing-noreturn -Wshadow -Wendif-labels -Wstrict-aliasing=2 -Wwrite-strings -Werror=overflow -Wdate-time -Wnested-externs -ffast-math -fno-common -fdiagnostics-show-option -fno-strict-aliasing -fvisibility=hidden -fstack-protector -fstack-protector-strong -fPIE --param=ssp-buffer-size=4 -Wno-unused-parameter -Wno-missing-field-initializers -Wno-unused-result -Wno-format-signedness -Wno-error=nonnull -Werror=shadow -ffunction-sections -fdata-sections -include config.h -O2 -fwrapv -Wformat -Werror=format-security -gdwarf-4 -fno-debug-types-section -fvar-tracking-assignments -g2 -Wp,-D_FORTIFY_SOURCE=2 -fstack-protector-strong --param=ssp-buffer-size=4 -fPIC -mtune=generic -march=x86-64 -gdwarf-4 -fno-debug-types-section -fvar-tracking-assignments -g2 -fPIC -pthread  -MD -MQ 'nss_systemd@sha/src_nss-systemd_nss-systemd.c.o' -MF 'nss_systemd@sha/src_nss-systemd_nss-systemd.c.o.d' -o 'nss_systemd@sha/src_nss-systemd_nss-systemd.c.o' -c ../src/nss-systemd/nss-systemd.c
[832/1834] /tmp/B.snKZS9/BUILD/systemd-235/test/sys-script.py /tmp/B.snKZS9/BUILD/systemd-235/build/test
[833/1834] x86_64-pld-linux-gnux32-gcc -Isystemd-analyze@exe -I. -I.. -Isrc/basic -I../src/basic -Isrc/shared -I../src/shared -Isrc/systemd -I../src/systemd -Isrc/journal -I../src/journal -Isrc/resolve -I../src/resolve -Isrc/timesync -I../src/timesync -Isrc/login -I../src/login -Isrc/udev -I../src/udev -Isrc/libudev -I../src/libudev -Isrc/core -I../src/core -I../src/libsystemd/sd-bus -I../src/libsystemd/sd-device -I../src/libsystemd/sd-hwdb -I../src/libsystemd/sd-id128 -I../src/libsystemd/sd-netlink -I../src/libsystemd/sd-network -Isrc/libsystemd-network -I../src/libsystemd-network -I../ -I/usr/include/libmount -I/usr/include/blkid -I/usr/include/uuid -fdiagnostics-color=always -pipe -D_FILE_OFFSET_BITS=64 -std=gnu99 -Wextra -Werror=undef -Wlogical-op -Wmissing-include-dirs -Wold-style-definition -Wpointer-arith -Winit-self -Wdeclaration-after-statement -Wfloat-equal -Wsuggest-attribute=noreturn -Werror=missing-prototypes -Werror=implicit-function-declaration -Werror=missing-declarations -Werror=return-type -Werror=incompatible-pointer-types -Werror=format=2 -Wstrict-prototypes -Wredundant-decls -Wmissing-noreturn -Wshadow -Wendif-labels -Wstrict-aliasing=2 -Wwrite-strings -Werror=overflow -Wdate-time -Wnested-externs -ffast-math -fno-common -fdiagnostics-show-option -fno-strict-aliasing -fvisibility=hidden -fstack-protector -fstack-protector-strong -fPIE --param=ssp-buffer-size=4 -Wno-unused-parameter -Wno-missing-field-initializers -Wno-unused-result -Wno-format-signedness -Wno-error=nonnull -Werror=shadow -ffunction-sections -fdata-sections -include config.h -O2 -fwrapv -Wformat -Werror=format-security -gdwarf-4 -fno-debug-types-section -fvar-tracking-assignments -g2 -Wp,-D_FORTIFY_SOURCE=2 -fstack-protector-strong --param=ssp-buffer-size=4 -fPIC -mtune=generic -march=x86-64 -gdwarf-4 -fno-debug-types-section -fvar-tracking-assignments -g2 -pthread  -MD -MQ 'systemd-analyze@exe/src_analyze_analyze-verify.c.o' -MF 'systemd-analyze@exe/src_analyze_analyze-verify.c.o.d' -o 'systemd-analyze@exe/src_analyze_analyze-verify.c.o' -c ../src/analyze/analyze-verify.c
[834/1834] x86_64-pld-linux-gnux32-gcc  -o libnss_myhostname.so.2 'nss_myhostname@sha/src_nss-myhostname_nss-myhostname.c.o' -Wl,--no-undefined -Wl,--as-needed -shared -fPIC -Wl,--start-group -Wl,-soname,libnss_myhostname.so.2 -Wl,-z,relro -Wl,-z,now -pie -Wl,--gc-sections -O2 -fwrapv -pipe -Wformat -Werror=format-security -gdwarf-4 -fno-debug-types-section -fvar-tracking-assignments -g2 -Wp,-D_FORTIFY_SOURCE=2 -fstack-protector-strong --param=ssp-buffer-size=4 -fPIC -mtune=generic -march=x86-64 -gdwarf-4 -fno-debug-types-section -fvar-tracking-assignments -g2 -Wl,--as-needed -Wl,--no-copy-dt-needed-entries -Wl,-z,relro -Wl,-z,combreloc src/libsystemd/libsystemd.a src/basic/libbasic.a -pthread -shared -Wl,--version-script=/tmp/B.snKZS9/BUILD/systemd-235/src/nss-myhostname/nss-myhostname.sym -Wl,--undefined -lrt -lrt -lcap -lblkid -lselinux -Wl,--end-group  
[835/1834] x86_64-pld-linux-gnux32-gcc  -o libnss_systemd.so.2 'nss_systemd@sha/src_nss-systemd_nss-systemd.c.o' -Wl,--no-undefined -Wl,--as-needed -shared -fPIC -Wl,--start-group -Wl,-soname,libnss_systemd.so.2 -Wl,-z,relro -Wl,-z,now -pie -Wl,--gc-sections -O2 -fwrapv -pipe -Wformat -Werror=format-security -gdwarf-4 -fno-debug-types-section -fvar-tracking-assignments -g2 -Wp,-D_FORTIFY_SOURCE=2 -fstack-protector-strong --param=ssp-buffer-size=4 -fPIC -mtune=generic -march=x86-64 -gdwarf-4 -fno-debug-types-section -fvar-tracking-assignments -g2 -Wl,--as-needed -Wl,--no-copy-dt-needed-entries -Wl,-z,relro -Wl,-z,combreloc src/libsystemd/libsystemd.a src/basic/libbasic.a -pthread -shared -Wl,--version-script=/tmp/B.snKZS9/BUILD/systemd-235/src/nss-systemd/nss-systemd.sym -Wl,--undefined -lrt -lrt -lcap -lblkid -lselinux -Wl,--end-group  
[836/1834] x86_64-pld-linux-gnux32-gcc -Isrc/network/src@network@@networkd-core@sta -Isrc/network -I../src/network -Isrc/basic -I../src/basic -Isrc/shared -I../src/shared -Isrc/systemd -I../src/systemd -Isrc/journal -I../src/journal -Isrc/resolve -I../src/resolve -Isrc/timesync -I../src/timesync -Isrc/login -I../src/login -Isrc/udev -I../src/udev -Isrc/libudev -I../src/libudev -Isrc/core -I../src/core -I../src/libsystemd/sd-bus -I../src/libsystemd/sd-device -I../src/libsystemd/sd-hwdb -I../src/libsystemd/sd-id128 -I../src/libsystemd/sd-netlink -I../src/libsystemd/sd-network -Isrc/libsystemd-network -I../src/libsystemd-network -I. -I../ -fdiagnostics-color=always -pipe -D_FILE_OFFSET_BITS=64 -std=gnu99 -Wextra -Werror=undef -Wlogical-op -Wmissing-include-dirs -Wold-style-definition -Wpointer-arith -Winit-self -Wdeclaration-after-statement -Wfloat-equal -Wsuggest-attribute=noreturn -Werror=missing-prototypes -Werror=implicit-function-declaration -Werror=missing-declarations -Werror=return-type -Werror=incompatible-pointer-types -Werror=format=2 -Wstrict-prototypes -Wredundant-decls -Wmissing-noreturn -Wshadow -Wendif-labels -Wstrict-aliasing=2 -Wwrite-strings -Werror=overflow -Wdate-time -Wnested-externs -ffast-math -fno-common -fdiagnostics-show-option -fno-strict-aliasing -fvisibility=hidden -fstack-protector -fstack-protector-strong -fPIE --param=ssp-buffer-size=4 -Wno-unused-parameter -Wno-missing-field-initializers -Wno-unused-result -Wno-format-signedness -Wno-error=nonnull -Werror=shadow -ffunction-sections -fdata-sections -include config.h -O2 -fwrapv -Wformat -Werror=format-security -gdwarf-4 -fno-debug-types-section -fvar-tracking-assignments -g2 -Wp,-D_FORTIFY_SOURCE=2 -fstack-protector-strong --param=ssp-buffer-size=4 -fPIC -mtune=generic -march=x86-64 -gdwarf-4 -fno-debug-types-section -fvar-tracking-assignments -g2 -fPIC  -MD -MQ 'src/network/src@network@@networkd-core@sta/networkd-link.c.o' -MF 'src/network/src@network@@networkd-core@sta/networkd-link.c.o.d' -o 'src/network/src@network@@networkd-core@sta/networkd-link.c.o' -c ../src/network/networkd-link.c
[837/1834] x86_64-pld-linux-gnux32-gcc  -o libnss_resolve.so.2 'nss_resolve@sha/src_nss-resolve_nss-resolve.c.o' -Wl,--no-undefined -Wl,--as-needed -shared -fPIC -Wl,--start-group -Wl,-soname,libnss_resolve.so.2 -Wl,-z,relro -Wl,-z,now -pie -Wl,--gc-sections -O2 -fwrapv -pipe -Wformat -Werror=format-security -gdwarf-4 -fno-debug-types-section -fvar-tracking-assignments -g2 -Wp,-D_FORTIFY_SOURCE=2 -fstack-protector-strong --param=ssp-buffer-size=4 -fPIC -mtune=generic -march=x86-64 -gdwarf-4 -fno-debug-types-section -fvar-tracking-assignments -g2 -Wl,--as-needed -Wl,--no-copy-dt-needed-entries -Wl,-z,relro -Wl,-z,combreloc src/libsystemd/libsystemd.a src/basic/libbasic.a -pthread -shared -Wl,--version-script=/tmp/B.snKZS9/BUILD/systemd-235/src/nss-resolve/nss-resolve.sym -Wl,--undefined -lrt -lrt -lcap -lblkid -lselinux -Wl,--end-group  
[838/1834] x86_64-pld-linux-gnux32-gcc -Inss_mymachines@sha -I. -I.. -Isrc/basic -I../src/basic -Isrc/shared -I../src/shared -Isrc/systemd -I../src/systemd -Isrc/journal -I../src/journal -Isrc/resolve -I../src/resolve -Isrc/timesync -I../src/timesync -Isrc/login -I../src/login -Isrc/udev -I../src/udev -Isrc/libudev -I../src/libudev -Isrc/core -I../src/core -I../src/libsystemd/sd-bus -I../src/libsystemd/sd-device -I../src/libsystemd/sd-hwdb -I../src/libsystemd/sd-id128 -I../src/libsystemd/sd-netlink -I../src/libsystemd/sd-network -Isrc/libsystemd-network -I../src/libsystemd-network -I../ -fdiagnostics-color=always -pipe -D_FILE_OFFSET_BITS=64 -std=gnu99 -Wextra -Werror=undef -Wlogical-op -Wmissing-include-dirs -Wold-style-definition -Wpointer-arith -Winit-self -Wdeclaration-after-statement -Wfloat-equal -Wsuggest-attribute=noreturn -Werror=missing-prototypes -Werror=implicit-function-declaration -Werror=missing-declarations -Werror=return-type -Werror=incompatible-pointer-types -Werror=format=2 -Wstrict-prototypes -Wredundant-decls -Wmissing-noreturn -Wshadow -Wendif-labels -Wstrict-aliasing=2 -Wwrite-strings -Werror=overflow -Wdate-time -Wnested-externs -ffast-math -fno-common -fdiagnostics-show-option -fno-strict-aliasing -fvisibility=hidden -fstack-protector -fstack-protector-strong -fPIE --param=ssp-buffer-size=4 -Wno-unused-parameter -Wno-missing-field-initializers -Wno-unused-result -Wno-format-signedness -Wno-error=nonnull -Werror=shadow -ffunction-sections -fdata-sections -include config.h -O2 -fwrapv -Wformat -Werror=format-security -gdwarf-4 -fno-debug-types-section -fvar-tracking-assignments -g2 -Wp,-D_FORTIFY_SOURCE=2 -fstack-protector-strong --param=ssp-buffer-size=4 -fPIC -mtune=generic -march=x86-64 -gdwarf-4 -fno-debug-types-section -fvar-tracking-assignments -g2 -fPIC -pthread  -MD -MQ 'nss_mymachines@sha/src_nss-mymachines_nss-mymachines.c.o' -MF 'nss_mymachines@sha/src_nss-mymachines_nss-mymachines.c.o.d' -o 'nss_mymachines@sha/src_nss-mymachines_nss-mymachines.c.o' -c ../src/nss-mymachines/nss-mymachines.c
[839/1834] x86_64-pld-linux-gnux32-gcc -Isystemd-cat@exe -I. -I.. -Isrc/basic -I../src/basic -Isrc/shared -I../src/shared -Isrc/systemd -I../src/systemd -Isrc/journal -I../src/journal -Isrc/resolve -I../src/resolve -Isrc/timesync -I../src/timesync -Isrc/login -I../src/login -Isrc/udev -I../src/udev -Isrc/libudev -I../src/libudev -Isrc/core -I../src/core -I../src/libsystemd/sd-bus -I../src/libsystemd/sd-device -I../src/libsystemd/sd-hwdb -I../src/libsystemd/sd-id128 -I../src/libsystemd/sd-netlink -I../src/libsystemd/sd-network -Isrc/libsystemd-network -I../src/libsystemd-network -I../ -fdiagnostics-color=always -pipe -D_FILE_OFFSET_BITS=64 -std=gnu99 -Wextra -Werror=undef -Wlogical-op -Wmissing-include-dirs -Wold-style-definition -Wpointer-arith -Winit-self -Wdeclaration-after-statement -Wfloat-equal -Wsuggest-attribute=noreturn -Werror=missing-prototypes -Werror=implicit-function-declaration -Werror=missing-declarations -Werror=return-type -Werror=incompatible-pointer-types -Werror=format=2 -Wstrict-prototypes -Wredundant-decls -Wmissing-noreturn -Wshadow -Wendif-labels -Wstrict-aliasing=2 -Wwrite-strings -Werror=overflow -Wdate-time -Wnested-externs -ffast-math -fno-common -fdiagnostics-show-option -fno-strict-aliasing -fvisibility=hidden -fstack-protector -fstack-protector-strong -fPIE --param=ssp-buffer-size=4 -Wno-unused-parameter -Wno-missing-field-initializers -Wno-unused-result -Wno-format-signedness -Wno-error=nonnull -Werror=shadow -ffunction-sections -fdata-sections -include config.h -O2 -fwrapv -Wformat -Werror=format-security -gdwarf-4 -fno-debug-types-section -fvar-tracking-assignments -g2 -Wp,-D_FORTIFY_SOURCE=2 -fstack-protector-strong --param=ssp-buffer-size=4 -fPIC -mtune=generic -march=x86-64 -gdwarf-4 -fno-debug-types-section -fvar-tracking-assignments -g2 -pthread  -MD -MQ 'systemd-cat@exe/src_journal_cat.c.o' -MF 'systemd-cat@exe/src_journal_cat.c.o.d' -o 'systemd-cat@exe/src_journal_cat.c.o' -c ../src/journal/cat.c
[840/1834] rm -f src/network/libnetworkd-core.a && gcc-ar csrD src/network/libnetworkd-core.a 'src/network/src@network@@networkd-core@sta/meson-generated_.._networkd-gperf.c.o' 'src/network/src@network@@networkd-core@sta/meson-generated_.._networkd-network-gperf.c.o' 'src/network/src@network@@networkd-core@sta/meson-generated_.._netdev-gperf.c.o' 'src/network/src@network@@networkd-core@sta/netdev_bond.c.o' 'src/network/src@network@@networkd-core@sta/netdev_bridge.c.o' 'src/network/src@network@@networkd-core@sta/netdev_dummy.c.o' 'src/network/src@network@@networkd-core@sta/netdev_ipvlan.c.o' 'src/network/src@network@@networkd-core@sta/netdev_macvlan.c.o' 'src/network/src@network@@networkd-core@sta/netdev_netdev.c.o' 'src/network/src@network@@networkd-core@sta/netdev_tunnel.c.o' 'src/network/src@network@@networkd-core@sta/netdev_tuntap.c.o' 'src/network/src@network@@networkd-core@sta/netdev_vcan.c.o' 'src/network/src@network@@networkd-core@sta/netdev_veth.c.o' 'src/network/src@network@@networkd-core@sta/netdev_vlan.c.o' 'src/network/src@network@@networkd-core@sta/netdev_vrf.c.o' 'src/network/src@network@@networkd-core@sta/netdev_vxlan.c.o' 'src/network/src@network@@networkd-core@sta/netdev_geneve.c.o' 'src/network/src@network@@networkd-core@sta/networkd-address-label.c.o' 'src/network/src@network@@networkd-core@sta/networkd-address-pool.c.o' 'src/network/src@network@@networkd-core@sta/networkd-address.c.o' 'src/network/src@network@@networkd-core@sta/networkd-brvlan.c.o' 'src/network/src@network@@networkd-core@sta/networkd-conf.c.o' 'src/network/src@network@@networkd-core@sta/networkd-dhcp4.c.o' 'src/network/src@network@@networkd-core@sta/networkd-dhcp6.c.o' 'src/network/src@network@@networkd-core@sta/networkd-fdb.c.o' 'src/network/src@network@@networkd-core@sta/networkd-ipv4ll.c.o' 'src/network/src@network@@networkd-core@sta/networkd-ipv6-proxy-ndp.c.o' 'src/network/src@network@@networkd-core@sta/networkd-link-bus.c.o' 'src/network/src@network@@networkd-core@sta/networkd-link.c.o' 'src/network/src@network@@networkd-core@sta/networkd-lldp-tx.c.o' 'src/network/src@network@@networkd-core@sta/networkd-manager-bus.c.o' 'src/network/src@network@@networkd-core@sta/networkd-manager.c.o' 'src/network/src@network@@networkd-core@sta/networkd-ndisc.c.o' 'src/network/src@network@@networkd-core@sta/networkd-radv.c.o' 'src/network/src@network@@networkd-core@sta/networkd-network-bus.c.o' 'src/network/src@network@@networkd-core@sta/networkd-network.c.o' 'src/network/src@network@@networkd-core@sta/networkd-route.c.o' 'src/network/src@network@@networkd-core@sta/networkd-routing-policy-rule.c.o' 'src/network/src@network@@networkd-core@sta/networkd-util.c.o'
[841/1834] x86_64-pld-linux-gnux32-gcc -Isystemd-journald@exe -I. -I.. -Isrc/basic -I../src/basic -Isrc/shared -I../src/shared -Isrc/systemd -I../src/systemd -Isrc/journal -I../src/journal -Isrc/resolve -I../src/resolve -Isrc/timesync -I../src/timesync -Isrc/login -I../src/login -Isrc/udev -I../src/udev -Isrc/libudev -I../src/libudev -Isrc/core -I../src/core -I../src/libsystemd/sd-bus -I../src/libsystemd/sd-device -I../src/libsystemd/sd-hwdb -I../src/libsystemd/sd-id128 -I../src/libsystemd/sd-netlink -I../src/libsystemd/sd-network -Isrc/libsystemd-network -I../src/libsystemd-network -I../ -I/usr/include/lz4 -fdiagnostics-color=always -pipe -D_FILE_OFFSET_BITS=64 -std=gnu99 -Wextra -Werror=undef -Wlogical-op -Wmissing-include-dirs -Wold-style-definition -Wpointer-arith -Winit-self -Wdeclaration-after-statement -Wfloat-equal -Wsuggest-attribute=noreturn -Werror=missing-prototypes -Werror=implicit-function-declaration -Werror=missing-declarations -Werror=return-type -Werror=incompatible-pointer-types -Werror=format=2 -Wstrict-prototypes -Wredundant-decls -Wmissing-noreturn -Wshadow -Wendif-labels -Wstrict-aliasing=2 -Wwrite-strings -Werror=overflow -Wdate-time -Wnested-externs -ffast-math -fno-common -fdiagnostics-show-option -fno-strict-aliasing -fvisibility=hidden -fstack-protector -fstack-protector-strong -fPIE --param=ssp-buffer-size=4 -Wno-unused-parameter -Wno-missing-field-initializers -Wno-unused-result -Wno-format-signedness -Wno-error=nonnull -Werror=shadow -ffunction-sections -fdata-sections -include config.h -O2 -fwrapv -Wformat -Werror=format-security -gdwarf-4 -fno-debug-types-section -fvar-tracking-assignments -g2 -Wp,-D_FORTIFY_SOURCE=2 -fstack-protector-strong --param=ssp-buffer-size=4 -fPIC -mtune=generic -march=x86-64 -gdwarf-4 -fno-debug-types-section -fvar-tracking-assignments -g2 -pthread  -MD -MQ 'systemd-journald@exe/src_journal_journald.c.o' -MF 'systemd-journald@exe/src_journal_journald.c.o.d' -o 'systemd-journald@exe/src_journal_journald.c.o' -c ../src/journal/journald.c
[842/1834] x86_64-pld-linux-gnux32-gcc -Ijournalctl@exe -I. -I.. -Isrc/basic -I../src/basic -Isrc/shared -I../src/shared -Isrc/systemd -I../src/systemd -Isrc/journal -I../src/journal -Isrc/resolve -I../src/resolve -Isrc/timesync -I../src/timesync -Isrc/login -I../src/login -Isrc/udev -I../src/udev -Isrc/libudev -I../src/libudev -Isrc/core -I../src/core -I../src/libsystemd/sd-bus -I../src/libsystemd/sd-device -I../src/libsystemd/sd-hwdb -I../src/libsystemd/sd-id128 -I../src/libsystemd/sd-netlink -I../src/libsystemd/sd-network -Isrc/libsystemd-network -I../src/libsystemd-network -I../ -I/usr/include/lz4 -fdiagnostics-color=always -pipe -D_FILE_OFFSET_BITS=64 -std=gnu99 -Wextra -Werror=undef -Wlogical-op -Wmissing-include-dirs -Wold-style-definition -Wpointer-arith -Winit-self -Wdeclaration-after-statement -Wfloat-equal -Wsuggest-attribute=noreturn -Werror=missing-prototypes -Werror=implicit-function-declaration -Werror=missing-declarations -Werror=return-type -Werror=incompatible-pointer-types -Werror=format=2 -Wstrict-prototypes -Wredundant-decls -Wmissing-noreturn -Wshadow -Wendif-labels -Wstrict-aliasing=2 -Wwrite-strings -Werror=overflow -Wdate-time -Wnested-externs -ffast-math -fno-common -fdiagnostics-show-option -fno-strict-aliasing -fvisibility=hidden -fstack-protector -fstack-protector-strong -fPIE --param=ssp-buffer-size=4 -Wno-unused-parameter -Wno-missing-field-initializers -Wno-unused-result -Wno-format-signedness -Wno-error=nonnull -Werror=shadow -ffunction-sections -fdata-sections -include config.h -O2 -fwrapv -Wformat -Werror=format-security -gdwarf-4 -fno-debug-types-section -fvar-tracking-assignments -g2 -Wp,-D_FORTIFY_SOURCE=2 -fstack-protector-strong --param=ssp-buffer-size=4 -fPIC -mtune=generic -march=x86-64 -gdwarf-4 -fno-debug-types-section -fvar-tracking-assignments -g2 -pthread  -MD -MQ 'journalctl@exe/src_journal_journal-qrcode.c.o' -MF 'journalctl@exe/src_journal_journal-qrcode.c.o.d' -o 'journalctl@exe/src_journal_journal-qrcode.c.o' -c ../src/journal/journal-qrcode.c
[843/1834] x86_64-pld-linux-gnux32-gcc -Isystemd-hibernate-resume-generator@exe -I. -I.. -Isrc/basic -I../src/basic -Isrc/shared -I../src/shared -Isrc/systemd -I../src/systemd -Isrc/journal -I../src/journal -Isrc/resolve -I../src/resolve -Isrc/timesync -I../src/timesync -Isrc/login -I../src/login -Isrc/udev -I../src/udev -Isrc/libudev -I../src/libudev -Isrc/core -I../src/core -I../src/libsystemd/sd-bus -I../src/libsystemd/sd-device -I../src/libsystemd/sd-hwdb -I../src/libsystemd/sd-id128 -I../src/libsystemd/sd-netlink -I../src/libsystemd/sd-network -Isrc/libsystemd-network -I../src/libsystemd-network -I../ -fdiagnostics-color=always -pipe -D_FILE_OFFSET_BITS=64 -std=gnu99 -Wextra -Werror=undef -Wlogical-op -Wmissing-include-dirs -Wold-style-definition -Wpointer-arith -Winit-self -Wdeclaration-after-statement -Wfloat-equal -Wsuggest-attribute=noreturn -Werror=missing-prototypes -Werror=implicit-function-declaration -Werror=missing-declarations -Werror=return-type -Werror=incompatible-pointer-types -Werror=format=2 -Wstrict-prototypes -Wredundant-decls -Wmissing-noreturn -Wshadow -Wendif-labels -Wstrict-aliasing=2 -Wwrite-strings -Werror=overflow -Wdate-time -Wnested-externs -ffast-math -fno-common -fdiagnostics-show-option -fno-strict-aliasing -fvisibility=hidden -fstack-protector -fstack-protector-strong -fPIE --param=ssp-buffer-size=4 -Wno-unused-parameter -Wno-missing-field-initializers -Wno-unused-result -Wno-format-signedness -Wno-error=nonnull -Werror=shadow -ffunction-sections -fdata-sections -include config.h -O2 -fwrapv -Wformat -Werror=format-security -gdwarf-4 -fno-debug-types-section -fvar-tracking-assignments -g2 -Wp,-D_FORTIFY_SOURCE=2 -fstack-protector-strong --param=ssp-buffer-size=4 -fPIC -mtune=generic -march=x86-64 -gdwarf-4 -fno-debug-types-section -fvar-tracking-assignments -g2  -MD -MQ 'systemd-hibernate-resume-generator@exe/src_hibernate-resume_hibernate-resume-generator.c.o' -MF 'systemd-hibernate-resume-generator@exe/src_hibernate-resume_hibernate-resume-generator.c.o.d' -o 'systemd-hibernate-resume-generator@exe/src_hibernate-resume_hibernate-resume-generator.c.o' -c ../src/hibernate-resume/hibernate-resume-generator.c
[844/1834] x86_64-pld-linux-gnux32-gcc  -o libnss_mymachines.so.2 'nss_mymachines@sha/src_nss-mymachines_nss-mymachines.c.o' -Wl,--no-undefined -Wl,--as-needed -shared -fPIC -Wl,--start-group -Wl,-soname,libnss_mymachines.so.2 -Wl,-z,relro -Wl,-z,now -pie -Wl,--gc-sections -O2 -fwrapv -pipe -Wformat -Werror=format-security -gdwarf-4 -fno-debug-types-section -fvar-tracking-assignments -g2 -Wp,-D_FORTIFY_SOURCE=2 -fstack-protector-strong --param=ssp-buffer-size=4 -fPIC -mtune=generic -march=x86-64 -gdwarf-4 -fno-debug-types-section -fvar-tracking-assignments -g2 -Wl,--as-needed -Wl,--no-copy-dt-needed-entries -Wl,-z,relro -Wl,-z,combreloc src/libsystemd/libsystemd.a src/basic/libbasic.a -pthread -shared -Wl,--version-script=/tmp/B.snKZS9/BUILD/systemd-235/src/nss-mymachines/nss-mymachines.sym -Wl,--undefined -lrt -lrt -lcap -lblkid -lselinux -Wl,--end-group  
[845/1834] x86_64-pld-linux-gnux32-gcc -I30-systemd-environment-d-generator@exe -I. -I.. -Isrc/basic -I../src/basic -Isrc/shared -I../src/shared -Isrc/systemd -I../src/systemd -Isrc/journal -I../src/journal -Isrc/resolve -I../src/resolve -Isrc/timesync -I../src/timesync -Isrc/login -I../src/login -Isrc/udev -I../src/udev -Isrc/libudev -I../src/libudev -Isrc/core -I../src/core -I../src/libsystemd/sd-bus -I../src/libsystemd/sd-device -I../src/libsystemd/sd-hwdb -I../src/libsystemd/sd-id128 -I../src/libsystemd/sd-netlink -I../src/libsystemd/sd-network -Isrc/libsystemd-network -I../src/libsystemd-network -I../ -fdiagnostics-color=always -pipe -D_FILE_OFFSET_BITS=64 -std=gnu99 -Wextra -Werror=undef -Wlogical-op -Wmissing-include-dirs -Wold-style-definition -Wpointer-arith -Winit-self -Wdeclaration-after-statement -Wfloat-equal -Wsuggest-attribute=noreturn -Werror=missing-prototypes -Werror=implicit-function-declaration -Werror=missing-declarations -Werror=return-type -Werror=incompatible-pointer-types -Werror=format=2 -Wstrict-prototypes -Wredundant-decls -Wmissing-noreturn -Wshadow -Wendif-labels -Wstrict-aliasing=2 -Wwrite-strings -Werror=overflow -Wdate-time -Wnested-externs -ffast-math -fno-common -fdiagnostics-show-option -fno-strict-aliasing -fvisibility=hidden -fstack-protector -fstack-protector-strong -fPIE --param=ssp-buffer-size=4 -Wno-unused-parameter -Wno-missing-field-initializers -Wno-unused-result -Wno-format-signedness -Wno-error=nonnull -Werror=shadow -ffunction-sections -fdata-sections -include config.h -O2 -fwrapv -Wformat -Werror=format-security -gdwarf-4 -fno-debug-types-section -fvar-tracking-assignments -g2 -Wp,-D_FORTIFY_SOURCE=2 -fstack-protector-strong --param=ssp-buffer-size=4 -fPIC -mtune=generic -march=x86-64 -gdwarf-4 -fno-debug-types-section -fvar-tracking-assignments -g2  -MD -MQ '30-systemd-environment-d-generator@exe/src_environment-d-generator_environment-d-generator.c.o' -MF '30-systemd-environment-d-generator@exe/src_environment-d-generator_environment-d-generator.c.o.d' -o '30-systemd-environment-d-generator@exe/src_environment-d-generator_environment-d-generator.c.o' -c ../src/environment-d-generator/environment-d-generator.c
[846/1834] x86_64-pld-linux-gnux32-gcc  -o systemd-cat 'systemd-cat@exe/src_journal_cat.c.o' -Wl,--no-undefined -Wl,--as-needed -Wl,-z,relro -Wl,-z,now -pie -Wl,--gc-sections -O2 -fwrapv -pipe -Wformat -Werror=format-security -gdwarf-4 -fno-debug-types-section -fvar-tracking-assignments -g2 -Wp,-D_FORTIFY_SOURCE=2 -fstack-protector-strong --param=ssp-buffer-size=4 -fPIC -mtune=generic -march=x86-64 -gdwarf-4 -fno-debug-types-section -fvar-tracking-assignments -g2 -Wl,--as-needed -Wl,--no-copy-dt-needed-entries -Wl,-z,relro -Wl,-z,combreloc -Wl,--start-group libjournal-core.a src/shared/libsystemd-shared-235.so -Wl,--end-group -pthread '-Wl,-rpath,$ORIGIN/src/shared' -Wl,-rpath-link,/tmp/B.snKZS9/BUILD/systemd-235/build/src/shared  
[847/1834] x86_64-pld-linux-gnux32-gcc -Isystemd-fstab-generator@exe -I. -I.. -Isrc/basic -I../src/basic -Isrc/shared -I../src/shared -Isrc/systemd -I../src/systemd -Isrc/journal -I../src/journal -Isrc/resolve -I../src/resolve -Isrc/timesync -I../src/timesync -Isrc/login -I../src/login -Isrc/udev -I../src/udev -Isrc/libudev -I../src/libudev -Isrc/core -I../src/core -I../src/libsystemd/sd-bus -I../src/libsystemd/sd-device -I../src/libsystemd/sd-hwdb -I../src/libsystemd/sd-id128 -I../src/libsystemd/sd-netlink -I../src/libsystemd/sd-network -Isrc/libsystemd-network -I../src/libsystemd-network -I../ -fdiagnostics-color=always -pipe -D_FILE_OFFSET_BITS=64 -std=gnu99 -Wextra -Werror=undef -Wlogical-op -Wmissing-include-dirs -Wold-style-definition -Wpointer-arith -Winit-self -Wdeclaration-after-statement -Wfloat-equal -Wsuggest-attribute=noreturn -Werror=missing-prototypes -Werror=implicit-function-declaration -Werror=missing-declarations -Werror=return-type -Werror=incompatible-pointer-types -Werror=format=2 -Wstrict-prototypes -Wredundant-decls -Wmissing-noreturn -Wshadow -Wendif-labels -Wstrict-aliasing=2 -Wwrite-strings -Werror=overflow -Wdate-time -Wnested-externs -ffast-math -fno-common -fdiagnostics-show-option -fno-strict-aliasing -fvisibility=hidden -fstack-protector -fstack-protector-strong -fPIE --param=ssp-buffer-size=4 -Wno-unused-parameter -Wno-missing-field-initializers -Wno-unused-result -Wno-format-signedness -Wno-error=nonnull -Werror=shadow -ffunction-sections -fdata-sections -include config.h -O2 -fwrapv -Wformat -Werror=format-security -gdwarf-4 -fno-debug-types-section -fvar-tracking-assignments -g2 -Wp,-D_FORTIFY_SOURCE=2 -fstack-protector-strong --param=ssp-buffer-size=4 -fPIC -mtune=generic -march=x86-64 -gdwarf-4 -fno-debug-types-section -fvar-tracking-assignments -g2  -MD -MQ 'systemd-fstab-generator@exe/src_core_mount-setup.c.o' -MF 'systemd-fstab-generator@exe/src_core_mount-setup.c.o.d' -o 'systemd-fstab-generator@exe/src_core_mount-setup.c.o' -c ../src/core/mount-setup.c
[848/1834] x86_64-pld-linux-gnux32-gcc -Isystemd-getty-generator@exe -I. -I.. -Isrc/basic -I../src/basic -Isrc/shared -I../src/shared -Isrc/systemd -I../src/systemd -Isrc/journal -I../src/journal -Isrc/resolve -I../src/resolve -Isrc/timesync -I../src/timesync -Isrc/login -I../src/login -Isrc/udev -I../src/udev -Isrc/libudev -I../src/libudev -Isrc/core -I../src/core -I../src/libsystemd/sd-bus -I../src/libsystemd/sd-device -I../src/libsystemd/sd-hwdb -I../src/libsystemd/sd-id128 -I../src/libsystemd/sd-netlink -I../src/libsystemd/sd-network -Isrc/libsystemd-network -I../src/libsystemd-network -I../ -fdiagnostics-color=always -pipe -D_FILE_OFFSET_BITS=64 -std=gnu99 -Wextra -Werror=undef -Wlogical-op -Wmissing-include-dirs -Wold-style-definition -Wpointer-arith -Winit-self -Wdeclaration-after-statement -Wfloat-equal -Wsuggest-attribute=noreturn -Werror=missing-prototypes -Werror=implicit-function-declaration -Werror=missing-declarations -Werror=return-type -Werror=incompatible-pointer-types -Werror=format=2 -Wstrict-prototypes -Wredundant-decls -Wmissing-noreturn -Wshadow -Wendif-labels -Wstrict-aliasing=2 -Wwrite-strings -Werror=overflow -Wdate-time -Wnested-externs -ffast-math -fno-common -fdiagnostics-show-option -fno-strict-aliasing -fvisibility=hidden -fstack-protector -fstack-protector-strong -fPIE --param=ssp-buffer-size=4 -Wno-unused-parameter -Wno-missing-field-initializers -Wno-unused-result -Wno-format-signedness -Wno-error=nonnull -Werror=shadow -ffunction-sections -fdata-sections -include config.h -O2 -fwrapv -Wformat -Werror=format-security -gdwarf-4 -fno-debug-types-section -fvar-tracking-assignments -g2 -Wp,-D_FORTIFY_SOURCE=2 -fstack-protector-strong --param=ssp-buffer-size=4 -fPIC -mtune=generic -march=x86-64 -gdwarf-4 -fno-debug-types-section -fvar-tracking-assignments -g2  -MD -MQ 'systemd-getty-generator@exe/src_getty-generator_getty-generator.c.o' -MF 'systemd-getty-generator@exe/src_getty-generator_getty-generator.c.o.d' -o 'systemd-getty-generator@exe/src_getty-generator_getty-generator.c.o' -c ../src/getty-generator/getty-generator.c
[849/1834] x86_64-pld-linux-gnux32-gcc  -o systemd-journald 'systemd-journald@exe/src_journal_journald.c.o' -Wl,--no-undefined -Wl,--as-needed -Wl,-z,relro -Wl,-z,now -pie -Wl,--gc-sections -O2 -fwrapv -pipe -Wformat -Werror=format-security -gdwarf-4 -fno-debug-types-section -fvar-tracking-assignments -g2 -Wp,-D_FORTIFY_SOURCE=2 -fstack-protector-strong --param=ssp-buffer-size=4 -fPIC -mtune=generic -march=x86-64 -gdwarf-4 -fno-debug-types-section -fvar-tracking-assignments -g2 -Wl,--as-needed -Wl,--no-copy-dt-needed-entries -Wl,-z,relro -Wl,-z,combreloc -Wl,--start-group libjournal-core.a src/shared/libsystemd-shared-235.so -pthread -llzma -llz4 -lselinux -Wl,--end-group '-Wl,-rpath,$ORIGIN/src/shared' -Wl,-rpath-link,/tmp/B.snKZS9/BUILD/systemd-235/build/src/shared  
[850/1834] x86_64-pld-linux-gnux32-gcc -Isystemd-debug-generator@exe -I. -I.. -Isrc/basic -I../src/basic -Isrc/shared -I../src/shared -Isrc/systemd -I../src/systemd -Isrc/journal -I../src/journal -Isrc/resolve -I../src/resolve -Isrc/timesync -I../src/timesync -Isrc/login -I../src/login -Isrc/udev -I../src/udev -Isrc/libudev -I../src/libudev -Isrc/core -I../src/core -I../src/libsystemd/sd-bus -I../src/libsystemd/sd-device -I../src/libsystemd/sd-hwdb -I../src/libsystemd/sd-id128 -I../src/libsystemd/sd-netlink -I../src/libsystemd/sd-network -Isrc/libsystemd-network -I../src/libsystemd-network -I../ -fdiagnostics-color=always -pipe -D_FILE_OFFSET_BITS=64 -std=gnu99 -Wextra -Werror=undef -Wlogical-op -Wmissing-include-dirs -Wold-style-definition -Wpointer-arith -Winit-self -Wdeclaration-after-statement -Wfloat-equal -Wsuggest-attribute=noreturn -Werror=missing-prototypes -Werror=implicit-function-declaration -Werror=missing-declarations -Werror=return-type -Werror=incompatible-pointer-types -Werror=format=2 -Wstrict-prototypes -Wredundant-decls -Wmissing-noreturn -Wshadow -Wendif-labels -Wstrict-aliasing=2 -Wwrite-strings -Werror=overflow -Wdate-time -Wnested-externs -ffast-math -fno-common -fdiagnostics-show-option -fno-strict-aliasing -fvisibility=hidden -fstack-protector -fstack-protector-strong -fPIE --param=ssp-buffer-size=4 -Wno-unused-parameter -Wno-missing-field-initializers -Wno-unused-result -Wno-format-signedness -Wno-error=nonnull -Werror=shadow -ffunction-sections -fdata-sections -include config.h -O2 -fwrapv -Wformat -Werror=format-security -gdwarf-4 -fno-debug-types-section -fvar-tracking-assignments -g2 -Wp,-D_FORTIFY_SOURCE=2 -fstack-protector-strong --param=ssp-buffer-size=4 -fPIC -mtune=generic -march=x86-64 -gdwarf-4 -fno-debug-types-section -fvar-tracking-assignments -g2  -MD -MQ 'systemd-debug-generator@exe/src_debug-generator_debug-generator.c.o' -MF 'systemd-debug-generator@exe/src_debug-generator_debug-generator.c.o.d' -o 'systemd-debug-generator@exe/src_debug-generator_debug-generator.c.o' -c ../src/debug-generator/debug-generator.c
[851/1834] x86_64-pld-linux-gnux32-gcc  -o 30-systemd-environment-d-generator '30-systemd-environment-d-generator@exe/src_environment-d-generator_environment-d-generator.c.o' -Wl,--no-undefined -Wl,--as-needed -Wl,-z,relro -Wl,-z,now -pie -Wl,--gc-sections -O2 -fwrapv -pipe -Wformat -Werror=format-security -gdwarf-4 -fno-debug-types-section -fvar-tracking-assignments -g2 -Wp,-D_FORTIFY_SOURCE=2 -fstack-protector-strong --param=ssp-buffer-size=4 -fPIC -mtune=generic -march=x86-64 -gdwarf-4 -fno-debug-types-section -fvar-tracking-assignments -g2 -Wl,--as-needed -Wl,--no-copy-dt-needed-entries -Wl,-z,relro -Wl,-z,combreloc -Wl,--start-group src/shared/libsystemd-shared-235.so -Wl,--end-group '-Wl,-rpath,$ORIGIN/src/shared' -Wl,-rpath-link,/tmp/B.snKZS9/BUILD/systemd-235/build/src/shared  
[852/1834] x86_64-pld-linux-gnux32-gcc  -o systemd-hibernate-resume-generator 'systemd-hibernate-resume-generator@exe/src_hibernate-resume_hibernate-resume-generator.c.o' -Wl,--no-undefined -Wl,--as-needed -Wl,-z,relro -Wl,-z,now -pie -Wl,--gc-sections -O2 -fwrapv -pipe -Wformat -Werror=format-security -gdwarf-4 -fno-debug-types-section -fvar-tracking-assignments -g2 -Wp,-D_FORTIFY_SOURCE=2 -fstack-protector-strong --param=ssp-buffer-size=4 -fPIC -mtune=generic -march=x86-64 -gdwarf-4 -fno-debug-types-section -fvar-tracking-assignments -g2 -Wl,--as-needed -Wl,--no-copy-dt-needed-entries -Wl,-z,relro -Wl,-z,combreloc -Wl,--start-group src/shared/libsystemd-shared-235.so -Wl,--end-group '-Wl,-rpath,$ORIGIN/src/shared' -Wl,-rpath-link,/tmp/B.snKZS9/BUILD/systemd-235/build/src/shared  
[853/1834] x86_64-pld-linux-gnux32-gcc -Isystemd-analyze@exe -I. -I.. -Isrc/basic -I../src/basic -Isrc/shared -I../src/shared -Isrc/systemd -I../src/systemd -Isrc/journal -I../src/journal -Isrc/resolve -I../src/resolve -Isrc/timesync -I../src/timesync -Isrc/login -I../src/login -Isrc/udev -I../src/udev -Isrc/libudev -I../src/libudev -Isrc/core -I../src/core -I../src/libsystemd/sd-bus -I../src/libsystemd/sd-device -I../src/libsystemd/sd-hwdb -I../src/libsystemd/sd-id128 -I../src/libsystemd/sd-netlink -I../src/libsystemd/sd-network -Isrc/libsystemd-network -I../src/libsystemd-network -I../ -I/usr/include/libmount -I/usr/include/blkid -I/usr/include/uuid -fdiagnostics-color=always -pipe -D_FILE_OFFSET_BITS=64 -std=gnu99 -Wextra -Werror=undef -Wlogical-op -Wmissing-include-dirs -Wold-style-definition -Wpointer-arith -Winit-self -Wdeclaration-after-statement -Wfloat-equal -Wsuggest-attribute=noreturn -Werror=missing-prototypes -Werror=implicit-function-declaration -Werror=missing-declarations -Werror=return-type -Werror=incompatible-pointer-types -Werror=format=2 -Wstrict-prototypes -Wredundant-decls -Wmissing-noreturn -Wshadow -Wendif-labels -Wstrict-aliasing=2 -Wwrite-strings -Werror=overflow -Wdate-time -Wnested-externs -ffast-math -fno-common -fdiagnostics-show-option -fno-strict-aliasing -fvisibility=hidden -fstack-protector -fstack-protector-strong -fPIE --param=ssp-buffer-size=4 -Wno-unused-parameter -Wno-missing-field-initializers -Wno-unused-result -Wno-format-signedness -Wno-error=nonnull -Werror=shadow -ffunction-sections -fdata-sections -include config.h -O2 -fwrapv -Wformat -Werror=format-security -gdwarf-4 -fno-debug-types-section -fvar-tracking-assignments -g2 -Wp,-D_FORTIFY_SOURCE=2 -fstack-protector-strong --param=ssp-buffer-size=4 -fPIC -mtune=generic -march=x86-64 -gdwarf-4 -fno-debug-types-section -fvar-tracking-assignments -g2 -pthread  -MD -MQ 'systemd-analyze@exe/src_analyze_analyze.c.o' -MF 'systemd-analyze@exe/src_analyze_analyze.c.o.d' -o 'systemd-analyze@exe/src_analyze_analyze.c.o' -c ../src/analyze/analyze.c
[854/1834] x86_64-pld-linux-gnux32-gcc  -o systemd-getty-generator 'systemd-getty-generator@exe/src_getty-generator_getty-generator.c.o' -Wl,--no-undefined -Wl,--as-needed -Wl,-z,relro -Wl,-z,now -pie -Wl,--gc-sections -O2 -fwrapv -pipe -Wformat -Werror=format-security -gdwarf-4 -fno-debug-types-section -fvar-tracking-assignments -g2 -Wp,-D_FORTIFY_SOURCE=2 -fstack-protector-strong --param=ssp-buffer-size=4 -fPIC -mtune=generic -march=x86-64 -gdwarf-4 -fno-debug-types-section -fvar-tracking-assignments -g2 -Wl,--as-needed -Wl,--no-copy-dt-needed-entries -Wl,-z,relro -Wl,-z,combreloc -Wl,--start-group src/shared/libsystemd-shared-235.so -Wl,--end-group '-Wl,-rpath,$ORIGIN/src/shared' -Wl,-rpath-link,/tmp/B.snKZS9/BUILD/systemd-235/build/src/shared  
[855/1834] x86_64-pld-linux-gnux32-gcc -Isystemd@exe -I. -I.. -Isrc/basic -I../src/basic -Isrc/shared -I../src/shared -Isrc/systemd -I../src/systemd -Isrc/journal -I../src/journal -Isrc/resolve -I../src/resolve -Isrc/timesync -I../src/timesync -Isrc/login -I../src/login -Isrc/udev -I../src/udev -Isrc/libudev -I../src/libudev -Isrc/core -I../src/core -I../src/libsystemd/sd-bus -I../src/libsystemd/sd-device -I../src/libsystemd/sd-hwdb -I../src/libsystemd/sd-id128 -I../src/libsystemd/sd-netlink -I../src/libsystemd/sd-network -Isrc/libsystemd-network -I../src/libsystemd-network -I../ -I/usr/include/libmount -I/usr/include/blkid -I/usr/include/uuid -fdiagnostics-color=always -pipe -D_FILE_OFFSET_BITS=64 -std=gnu99 -Wextra -Werror=undef -Wlogical-op -Wmissing-include-dirs -Wold-style-definition -Wpointer-arith -Winit-self -Wdeclaration-after-statement -Wfloat-equal -Wsuggest-attribute=noreturn -Werror=missing-prototypes -Werror=implicit-function-declaration -Werror=missing-declarations -Werror=return-type -Werror=incompatible-pointer-types -Werror=format=2 -Wstrict-prototypes -Wredundant-decls -Wmissing-noreturn -Wshadow -Wendif-labels -Wstrict-aliasing=2 -Wwrite-strings -Werror=overflow -Wdate-time -Wnested-externs -ffast-math -fno-common -fdiagnostics-show-option -fno-strict-aliasing -fvisibility=hidden -fstack-protector -fstack-protector-strong -fPIE --param=ssp-buffer-size=4 -Wno-unused-parameter -Wno-missing-field-initializers -Wno-unused-result -Wno-format-signedness -Wno-error=nonnull -Werror=shadow -ffunction-sections -fdata-sections -include config.h -O2 -fwrapv -Wformat -Werror=format-security -gdwarf-4 -fno-debug-types-section -fvar-tracking-assignments -g2 -Wp,-D_FORTIFY_SOURCE=2 -fstack-protector-strong --param=ssp-buffer-size=4 -fPIC -mtune=generic -march=x86-64 -gdwarf-4 -fno-debug-types-section -fvar-tracking-assignments -g2 -pthread  -MD -MQ 'systemd@exe/src_core_main.c.o' -MF 'systemd@exe/src_core_main.c.o.d' -o 'systemd@exe/src_core_main.c.o' -c ../src/core/main.c
[856/1834] x86_64-pld-linux-gnux32-gcc -Isystemd-hibernate-resume@exe -I. -I.. -Isrc/basic -I../src/basic -Isrc/shared -I../src/shared -Isrc/systemd -I../src/systemd -Isrc/journal -I../src/journal -Isrc/resolve -I../src/resolve -Isrc/timesync -I../src/timesync -Isrc/login -I../src/login -Isrc/udev -I../src/udev -Isrc/libudev -I../src/libudev -Isrc/core -I../src/core -I../src/libsystemd/sd-bus -I../src/libsystemd/sd-device -I../src/libsystemd/sd-hwdb -I../src/libsystemd/sd-id128 -I../src/libsystemd/sd-netlink -I../src/libsystemd/sd-network -Isrc/libsystemd-network -I../src/libsystemd-network -I../ -fdiagnostics-color=always -pipe -D_FILE_OFFSET_BITS=64 -std=gnu99 -Wextra -Werror=undef -Wlogical-op -Wmissing-include-dirs -Wold-style-definition -Wpointer-arith -Winit-self -Wdeclaration-after-statement -Wfloat-equal -Wsuggest-attribute=noreturn -Werror=missing-prototypes -Werror=implicit-function-declaration -Werror=missing-declarations -Werror=return-type -Werror=incompatible-pointer-types -Werror=format=2 -Wstrict-prototypes -Wredundant-decls -Wmissing-noreturn -Wshadow -Wendif-labels -Wstrict-aliasing=2 -Wwrite-strings -Werror=overflow -Wdate-time -Wnested-externs -ffast-math -fno-common -fdiagnostics-show-option -fno-strict-aliasing -fvisibility=hidden -fstack-protector -fstack-protector-strong -fPIE --param=ssp-buffer-size=4 -Wno-unused-parameter -Wno-missing-field-initializers -Wno-unused-result -Wno-format-signedness -Wno-error=nonnull -Werror=shadow -ffunction-sections -fdata-sections -include config.h -O2 -fwrapv -Wformat -Werror=format-security -gdwarf-4 -fno-debug-types-section -fvar-tracking-assignments -g2 -Wp,-D_FORTIFY_SOURCE=2 -fstack-protector-strong --param=ssp-buffer-size=4 -fPIC -mtune=generic -march=x86-64 -gdwarf-4 -fno-debug-types-section -fvar-tracking-assignments -g2  -MD -MQ 'systemd-hibernate-resume@exe/src_hibernate-resume_hibernate-resume.c.o' -MF 'systemd-hibernate-resume@exe/src_hibernate-resume_hibernate-resume.c.o.d' -o 'systemd-hibernate-resume@exe/src_hibernate-resume_hibernate-resume.c.o' -c ../src/hibernate-resume/hibernate-resume.c
[857/1834] x86_64-pld-linux-gnux32-gcc  -o systemd-debug-generator 'systemd-debug-generator@exe/src_debug-generator_debug-generator.c.o' -Wl,--no-undefined -Wl,--as-needed -Wl,-z,relro -Wl,-z,now -pie -Wl,--gc-sections -O2 -fwrapv -pipe -Wformat -Werror=format-security -gdwarf-4 -fno-debug-types-section -fvar-tracking-assignments -g2 -Wp,-D_FORTIFY_SOURCE=2 -fstack-protector-strong --param=ssp-buffer-size=4 -fPIC -mtune=generic -march=x86-64 -gdwarf-4 -fno-debug-types-section -fvar-tracking-assignments -g2 -Wl,--as-needed -Wl,--no-copy-dt-needed-entries -Wl,-z,relro -Wl,-z,combreloc -Wl,--start-group src/shared/libsystemd-shared-235.so -Wl,--end-group '-Wl,-rpath,$ORIGIN/src/shared' -Wl,-rpath-link,/tmp/B.snKZS9/BUILD/systemd-235/build/src/shared  
[858/1834] x86_64-pld-linux-gnux32-gcc -Isystemd-fstab-generator@exe -I. -I.. -Isrc/basic -I../src/basic -Isrc/shared -I../src/shared -Isrc/systemd -I../src/systemd -Isrc/journal -I../src/journal -Isrc/resolve -I../src/resolve -Isrc/timesync -I../src/timesync -Isrc/login -I../src/login -Isrc/udev -I../src/udev -Isrc/libudev -I../src/libudev -Isrc/core -I../src/core -I../src/libsystemd/sd-bus -I../src/libsystemd/sd-device -I../src/libsystemd/sd-hwdb -I../src/libsystemd/sd-id128 -I../src/libsystemd/sd-netlink -I../src/libsystemd/sd-network -Isrc/libsystemd-network -I../src/libsystemd-network -I../ -fdiagnostics-color=always -pipe -D_FILE_OFFSET_BITS=64 -std=gnu99 -Wextra -Werror=undef -Wlogical-op -Wmissing-include-dirs -Wold-style-definition -Wpointer-arith -Winit-self -Wdeclaration-after-statement -Wfloat-equal -Wsuggest-attribute=noreturn -Werror=missing-prototypes -Werror=implicit-function-declaration -Werror=missing-declarations -Werror=return-type -Werror=incompatible-pointer-types -Werror=format=2 -Wstrict-prototypes -Wredundant-decls -Wmissing-noreturn -Wshadow -Wendif-labels -Wstrict-aliasing=2 -Wwrite-strings -Werror=overflow -Wdate-time -Wnested-externs -ffast-math -fno-common -fdiagnostics-show-option -fno-strict-aliasing -fvisibility=hidden -fstack-protector -fstack-protector-strong -fPIE --param=ssp-buffer-size=4 -Wno-unused-parameter -Wno-missing-field-initializers -Wno-unused-result -Wno-format-signedness -Wno-error=nonnull -Werror=shadow -ffunction-sections -fdata-sections -include config.h -O2 -fwrapv -Wformat -Werror=format-security -gdwarf-4 -fno-debug-types-section -fvar-tracking-assignments -g2 -Wp,-D_FORTIFY_SOURCE=2 -fstack-protector-strong --param=ssp-buffer-size=4 -fPIC -mtune=generic -march=x86-64 -gdwarf-4 -fno-debug-types-section -fvar-tracking-assignments -g2  -MD -MQ 'systemd-fstab-generator@exe/src_fstab-generator_fstab-generator.c.o' -MF 'systemd-fstab-generator@exe/src_fstab-generator_fstab-generator.c.o.d' -o 'systemd-fstab-generator@exe/src_fstab-generator_fstab-generator.c.o' -c ../src/fstab-generator/fstab-generator.c
[859/1834] x86_64-pld-linux-gnux32-gcc -Isystemd-dissect@exe -I. -I.. -Isrc/basic -I../src/basic -Isrc/shared -I../src/shared -Isrc/systemd -I../src/systemd -Isrc/journal -I../src/journal -Isrc/resolve -I../src/resolve -Isrc/timesync -I../src/timesync -Isrc/login -I../src/login -Isrc/udev -I../src/udev -Isrc/libudev -I../src/libudev -Isrc/core -I../src/core -I../src/libsystemd/sd-bus -I../src/libsystemd/sd-device -I../src/libsystemd/sd-hwdb -I../src/libsystemd/sd-id128 -I../src/libsystemd/sd-netlink -I../src/libsystemd/sd-network -Isrc/libsystemd-network -I../src/libsystemd-network -I../ -fdiagnostics-color=always -pipe -D_FILE_OFFSET_BITS=64 -std=gnu99 -Wextra -Werror=undef -Wlogical-op -Wmissing-include-dirs -Wold-style-definition -Wpointer-arith -Winit-self -Wdeclaration-after-statement -Wfloat-equal -Wsuggest-attribute=noreturn -Werror=missing-prototypes -Werror=implicit-function-declaration -Werror=missing-declarations -Werror=return-type -Werror=incompatible-pointer-types -Werror=format=2 -Wstrict-prototypes -Wredundant-decls -Wmissing-noreturn -Wshadow -Wendif-labels -Wstrict-aliasing=2 -Wwrite-strings -Werror=overflow -Wdate-time -Wnested-externs -ffast-math -fno-common -fdiagnostics-show-option -fno-strict-aliasing -fvisibility=hidden -fstack-protector -fstack-protector-strong -fPIE --param=ssp-buffer-size=4 -Wno-unused-parameter -Wno-missing-field-initializers -Wno-unused-result -Wno-format-signedness -Wno-error=nonnull -Werror=shadow -ffunction-sections -fdata-sections -include config.h -O2 -fwrapv -Wformat -Werror=format-security -gdwarf-4 -fno-debug-types-section -fvar-tracking-assignments -g2 -Wp,-D_FORTIFY_SOURCE=2 -fstack-protector-strong --param=ssp-buffer-size=4 -fPIC -mtune=generic -march=x86-64 -gdwarf-4 -fno-debug-types-section -fvar-tracking-assignments -g2  -MD -MQ 'systemd-dissect@exe/src_dissect_dissect.c.o' -MF 'systemd-dissect@exe/src_dissect_dissect.c.o.d' -o 'systemd-dissect@exe/src_dissect_dissect.c.o' -c ../src/dissect/dissect.c
[860/1834] x86_64-pld-linux-gnux32-gcc -Isystemd-resolved@exe -I. -I.. -Isrc/basic -I../src/basic -Isrc/shared -I../src/shared -Isrc/systemd -I../src/systemd -Isrc/journal -I../src/journal -Isrc/resolve -I../src/resolve -Isrc/timesync -I../src/timesync -Isrc/login -I../src/login -Isrc/udev -I../src/udev -Isrc/libudev -I../src/libudev -Isrc/core -I../src/core -I../src/libsystemd/sd-bus -I../src/libsystemd/sd-device -I../src/libsystemd/sd-hwdb -I../src/libsystemd/sd-id128 -I../src/libsystemd/sd-netlink -I../src/libsystemd/sd-network -Isrc/libsystemd-network -I../src/libsystemd-network -I../ -fdiagnostics-color=always -pipe -D_FILE_OFFSET_BITS=64 -std=gnu99 -Wextra -Werror=undef -Wlogical-op -Wmissing-include-dirs -Wold-style-definition -Wpointer-arith -Winit-self -Wdeclaration-after-statement -Wfloat-equal -Wsuggest-attribute=noreturn -Werror=missing-prototypes -Werror=implicit-function-declaration -Werror=missing-declarations -Werror=return-type -Werror=incompatible-pointer-types -Werror=format=2 -Wstrict-prototypes -Wredundant-decls -Wmissing-noreturn -Wshadow -Wendif-labels -Wstrict-aliasing=2 -Wwrite-strings -Werror=overflow -Wdate-time -Wnested-externs -ffast-math -fno-common -fdiagnostics-show-option -fno-strict-aliasing -fvisibility=hidden -fstack-protector -fstack-protector-strong -fPIE --param=ssp-buffer-size=4 -Wno-unused-parameter -Wno-missing-field-initializers -Wno-unused-result -Wno-format-signedness -Wno-error=nonnull -Werror=shadow -ffunction-sections -fdata-sections -include config.h -O2 -fwrapv -Wformat -Werror=format-security -gdwarf-4 -fno-debug-types-section -fvar-tracking-assignments -g2 -Wp,-D_FORTIFY_SOURCE=2 -fstack-protector-strong --param=ssp-buffer-size=4 -fPIC -mtune=generic -march=x86-64 -gdwarf-4 -fno-debug-types-section -fvar-tracking-assignments -g2 -pthread  -MD -MQ 'systemd-resolved@exe/meson-generated_.._src_resolve_resolved-gperf.c.o' -MF 'systemd-resolved@exe/meson-generated_.._src_resolve_resolved-gperf.c.o.d' -o 'systemd-resolved@exe/meson-generated_.._src_resolve_resolved-gperf.c.o' -c src/resolve/resolved-gperf.c
[861/1834] x86_64-pld-linux-gnux32-gcc -Isystemd-gpt-auto-generator@exe -I. -I.. -Isrc/basic -I../src/basic -Isrc/shared -I../src/shared -Isrc/systemd -I../src/systemd -Isrc/journal -I../src/journal -Isrc/resolve -I../src/resolve -Isrc/timesync -I../src/timesync -Isrc/login -I../src/login -Isrc/udev -I../src/udev -Isrc/libudev -I../src/libudev -Isrc/core -I../src/core -I../src/libsystemd/sd-bus -I../src/libsystemd/sd-device -I../src/libsystemd/sd-hwdb -I../src/libsystemd/sd-id128 -I../src/libsystemd/sd-netlink -I../src/libsystemd/sd-network -Isrc/libsystemd-network -I../src/libsystemd-network -I../ -I/usr/include/blkid -I/usr/include/uuid -fdiagnostics-color=always -pipe -D_FILE_OFFSET_BITS=64 -std=gnu99 -Wextra -Werror=undef -Wlogical-op -Wmissing-include-dirs -Wold-style-definition -Wpointer-arith -Winit-self -Wdeclaration-after-statement -Wfloat-equal -Wsuggest-attribute=noreturn -Werror=missing-prototypes -Werror=implicit-function-declaration -Werror=missing-declarations -Werror=return-type -Werror=incompatible-pointer-types -Werror=format=2 -Wstrict-prototypes -Wredundant-decls -Wmissing-noreturn -Wshadow -Wendif-labels -Wstrict-aliasing=2 -Wwrite-strings -Werror=overflow -Wdate-time -Wnested-externs -ffast-math -fno-common -fdiagnostics-show-option -fno-strict-aliasing -fvisibility=hidden -fstack-protector -fstack-protector-strong -fPIE --param=ssp-buffer-size=4 -Wno-unused-parameter -Wno-missing-field-initializers -Wno-unused-result -Wno-format-signedness -Wno-error=nonnull -Werror=shadow -ffunction-sections -fdata-sections -include config.h -O2 -fwrapv -Wformat -Werror=format-security -gdwarf-4 -fno-debug-types-section -fvar-tracking-assignments -g2 -Wp,-D_FORTIFY_SOURCE=2 -fstack-protector-strong --param=ssp-buffer-size=4 -fPIC -mtune=generic -march=x86-64 -gdwarf-4 -fno-debug-types-section -fvar-tracking-assignments -g2  -MD -MQ 'systemd-gpt-auto-generator@exe/src_gpt-auto-generator_gpt-auto-generator.c.o' -MF 'systemd-gpt-auto-generator@exe/src_gpt-auto-generator_gpt-auto-generator.c.o.d' -o 'systemd-gpt-auto-generator@exe/src_gpt-auto-generator_gpt-auto-generator.c.o' -c ../src/gpt-auto-generator/gpt-auto-generator.c
[862/1834] x86_64-pld-linux-gnux32-gcc  -o systemd-hibernate-resume 'systemd-hibernate-resume@exe/src_hibernate-resume_hibernate-resume.c.o' -Wl,--no-undefined -Wl,--as-needed -Wl,-z,relro -Wl,-z,now -pie -Wl,--gc-sections -O2 -fwrapv -pipe -Wformat -Werror=format-security -gdwarf-4 -fno-debug-types-section -fvar-tracking-assignments -g2 -Wp,-D_FORTIFY_SOURCE=2 -fstack-protector-strong --param=ssp-buffer-size=4 -fPIC -mtune=generic -march=x86-64 -gdwarf-4 -fno-debug-types-section -fvar-tracking-assignments -g2 -Wl,--as-needed -Wl,--no-copy-dt-needed-entries -Wl,-z,relro -Wl,-z,combreloc -Wl,--start-group src/shared/libsystemd-shared-235.so -Wl,--end-group '-Wl,-rpath,$ORIGIN/src/shared' -Wl,-rpath-link,/tmp/B.snKZS9/BUILD/systemd-235/build/src/shared  
[863/1834] x86_64-pld-linux-gnux32-gcc -Ijournalctl@exe -I. -I.. -Isrc/basic -I../src/basic -Isrc/shared -I../src/shared -Isrc/systemd -I../src/systemd -Isrc/journal -I../src/journal -Isrc/resolve -I../src/resolve -Isrc/timesync -I../src/timesync -Isrc/login -I../src/login -Isrc/udev -I../src/udev -Isrc/libudev -I../src/libudev -Isrc/core -I../src/core -I../src/libsystemd/sd-bus -I../src/libsystemd/sd-device -I../src/libsystemd/sd-hwdb -I../src/libsystemd/sd-id128 -I../src/libsystemd/sd-netlink -I../src/libsystemd/sd-network -Isrc/libsystemd-network -I../src/libsystemd-network -I../ -I/usr/include/lz4 -fdiagnostics-color=always -pipe -D_FILE_OFFSET_BITS=64 -std=gnu99 -Wextra -Werror=undef -Wlogical-op -Wmissing-include-dirs -Wold-style-definition -Wpointer-arith -Winit-self -Wdeclaration-after-statement -Wfloat-equal -Wsuggest-attribute=noreturn -Werror=missing-prototypes -Werror=implicit-function-declaration -Werror=missing-declarations -Werror=return-type -Werror=incompatible-pointer-types -Werror=format=2 -Wstrict-prototypes -Wredundant-decls -Wmissing-noreturn -Wshadow -Wendif-labels -Wstrict-aliasing=2 -Wwrite-strings -Werror=overflow -Wdate-time -Wnested-externs -ffast-math -fno-common -fdiagnostics-show-option -fno-strict-aliasing -fvisibility=hidden -fstack-protector -fstack-protector-strong -fPIE --param=ssp-buffer-size=4 -Wno-unused-parameter -Wno-missing-field-initializers -Wno-unused-result -Wno-format-signedness -Wno-error=nonnull -Werror=shadow -ffunction-sections -fdata-sections -include config.h -O2 -fwrapv -Wformat -Werror=format-security -gdwarf-4 -fno-debug-types-section -fvar-tracking-assignments -g2 -Wp,-D_FORTIFY_SOURCE=2 -fstack-protector-strong --param=ssp-buffer-size=4 -fPIC -mtune=generic -march=x86-64 -gdwarf-4 -fno-debug-types-section -fvar-tracking-assignments -g2 -pthread  -MD -MQ 'journalctl@exe/src_journal_journalctl.c.o' -MF 'journalctl@exe/src_journal_journalctl.c.o.d' -o 'journalctl@exe/src_journal_journalctl.c.o' -c ../src/journal/journalctl.c
[864/1834] x86_64-pld-linux-gnux32-gcc  -o systemd-fstab-generator 'systemd-fstab-generator@exe/src_fstab-generator_fstab-generator.c.o' 'systemd-fstab-generator@exe/src_core_mount-setup.c.o' -Wl,--no-undefined -Wl,--as-needed -Wl,-z,relro -Wl,-z,now -pie -Wl,--gc-sections -O2 -fwrapv -pipe -Wformat -Werror=format-security -gdwarf-4 -fno-debug-types-section -fvar-tracking-assignments -g2 -Wp,-D_FORTIFY_SOURCE=2 -fstack-protector-strong --param=ssp-buffer-size=4 -fPIC -mtune=generic -march=x86-64 -gdwarf-4 -fno-debug-types-section -fvar-tracking-assignments -g2 -Wl,--as-needed -Wl,--no-copy-dt-needed-entries -Wl,-z,relro -Wl,-z,combreloc -Wl,--start-group src/shared/libsystemd-shared-235.so -Wl,--end-group '-Wl,-rpath,$ORIGIN/src/shared' -Wl,-rpath-link,/tmp/B.snKZS9/BUILD/systemd-235/build/src/shared  
[865/1834] x86_64-pld-linux-gnux32-gcc  -o systemd-dissect 'systemd-dissect@exe/src_dissect_dissect.c.o' -Wl,--no-undefined -Wl,--as-needed -Wl,-z,relro -Wl,-z,now -pie -Wl,--gc-sections -O2 -fwrapv -pipe -Wformat -Werror=format-security -gdwarf-4 -fno-debug-types-section -fvar-tracking-assignments -g2 -Wp,-D_FORTIFY_SOURCE=2 -fstack-protector-strong --param=ssp-buffer-size=4 -fPIC -mtune=generic -march=x86-64 -gdwarf-4 -fno-debug-types-section -fvar-tracking-assignments -g2 -Wl,--as-needed -Wl,--no-copy-dt-needed-entries -Wl,-z,relro -Wl,-z,combreloc -Wl,--start-group src/shared/libsystemd-shared-235.so -Wl,--end-group '-Wl,-rpath,$ORIGIN/src/shared' -Wl,-rpath-link,/tmp/B.snKZS9/BUILD/systemd-235/build/src/shared  
[866/1834] x86_64-pld-linux-gnux32-gcc  -o journalctl 'journalctl@exe/src_journal_journalctl.c.o' 'journalctl@exe/src_journal_journal-qrcode.c.o' -Wl,--no-undefined -Wl,--as-needed -Wl,-z,relro -Wl,-z,now -pie -Wl,--gc-sections -O2 -fwrapv -pipe -Wformat -Werror=format-security -gdwarf-4 -fno-debug-types-section -fvar-tracking-assignments -g2 -Wp,-D_FORTIFY_SOURCE=2 -fstack-protector-strong --param=ssp-buffer-size=4 -fPIC -mtune=generic -march=x86-64 -gdwarf-4 -fno-debug-types-section -fvar-tracking-assignments -g2 -Wl,--as-needed -Wl,--no-copy-dt-needed-entries -Wl,-z,relro -Wl,-z,combreloc -Wl,--start-group src/shared/libsystemd-shared-235.so -pthread -lqrencode -llzma -llz4 -Wl,--end-group '-Wl,-rpath,$ORIGIN/src/shared' -Wl,-rpath-link,/tmp/B.snKZS9/BUILD/systemd-235/build/src/shared  
[867/1834] x86_64-pld-linux-gnux32-gcc  -o systemd-gpt-auto-generator 'systemd-gpt-auto-generator@exe/src_gpt-auto-generator_gpt-auto-generator.c.o' -Wl,--no-undefined -Wl,--as-needed -Wl,-z,relro -Wl,-z,now -pie -Wl,--gc-sections -O2 -fwrapv -pipe -Wformat -Werror=format-security -gdwarf-4 -fno-debug-types-section -fvar-tracking-assignments -g2 -Wp,-D_FORTIFY_SOURCE=2 -fstack-protector-strong --param=ssp-buffer-size=4 -fPIC -mtune=generic -march=x86-64 -gdwarf-4 -fno-debug-types-section -fvar-tracking-assignments -g2 -Wl,--as-needed -Wl,--no-copy-dt-needed-entries -Wl,-z,relro -Wl,-z,combreloc -Wl,--start-group src/shared/libsystemd-shared-235.so -lblkid -Wl,--end-group '-Wl,-rpath,$ORIGIN/src/shared' -Wl,-rpath-link,/tmp/B.snKZS9/BUILD/systemd-235/build/src/shared  
[868/1834] x86_64-pld-linux-gnux32-gcc -Isystemd-resolved@exe -I. -I.. -Isrc/basic -I../src/basic -Isrc/shared -I../src/shared -Isrc/systemd -I../src/systemd -Isrc/journal -I../src/journal -Isrc/resolve -I../src/resolve -Isrc/timesync -I../src/timesync -Isrc/login -I../src/login -Isrc/udev -I../src/udev -Isrc/libudev -I../src/libudev -Isrc/core -I../src/core -I../src/libsystemd/sd-bus -I../src/libsystemd/sd-device -I../src/libsystemd/sd-hwdb -I../src/libsystemd/sd-id128 -I../src/libsystemd/sd-netlink -I../src/libsystemd/sd-network -Isrc/libsystemd-network -I../src/libsystemd-network -I../ -fdiagnostics-color=always -pipe -D_FILE_OFFSET_BITS=64 -std=gnu99 -Wextra -Werror=undef -Wlogical-op -Wmissing-include-dirs -Wold-style-definition -Wpointer-arith -Winit-self -Wdeclaration-after-statement -Wfloat-equal -Wsuggest-attribute=noreturn -Werror=missing-prototypes -Werror=implicit-function-declaration -Werror=missing-declarations -Werror=return-type -Werror=incompatible-pointer-types -Werror=format=2 -Wstrict-prototypes -Wredundant-decls -Wmissing-noreturn -Wshadow -Wendif-labels -Wstrict-aliasing=2 -Wwrite-strings -Werror=overflow -Wdate-time -Wnested-externs -ffast-math -fno-common -fdiagnostics-show-option -fno-strict-aliasing -fvisibility=hidden -fstack-protector -fstack-protector-strong -fPIE --param=ssp-buffer-size=4 -Wno-unused-parameter -Wno-missing-field-initializers -Wno-unused-result -Wno-format-signedness -Wno-error=nonnull -Werror=shadow -ffunction-sections -fdata-sections -include config.h -O2 -fwrapv -Wformat -Werror=format-security -gdwarf-4 -fno-debug-types-section -fvar-tracking-assignments -g2 -Wp,-D_FORTIFY_SOURCE=2 -fstack-protector-strong --param=ssp-buffer-size=4 -fPIC -mtune=generic -march=x86-64 -gdwarf-4 -fno-debug-types-section -fvar-tracking-assignments -g2 -pthread  -MD -MQ 'systemd-resolved@exe/src_resolve_resolved-resolv-conf.c.o' -MF 'systemd-resolved@exe/src_resolve_resolved-resolv-conf.c.o.d' -o 'systemd-resolved@exe/src_resolve_resolved-resolv-conf.c.o' -c ../src/resolve/resolved-resolv-conf.c
[869/1834] x86_64-pld-linux-gnux32-gcc -Isystemd-resolved@exe -I. -I.. -Isrc/basic -I../src/basic -Isrc/shared -I../src/shared -Isrc/systemd -I../src/systemd -Isrc/journal -I../src/journal -Isrc/resolve -I../src/resolve -Isrc/timesync -I../src/timesync -Isrc/login -I../src/login -Isrc/udev -I../src/udev -Isrc/libudev -I../src/libudev -Isrc/core -I../src/core -I../src/libsystemd/sd-bus -I../src/libsystemd/sd-device -I../src/libsystemd/sd-hwdb -I../src/libsystemd/sd-id128 -I../src/libsystemd/sd-netlink -I../src/libsystemd/sd-network -Isrc/libsystemd-network -I../src/libsystemd-network -I../ -fdiagnostics-color=always -pipe -D_FILE_OFFSET_BITS=64 -std=gnu99 -Wextra -Werror=undef -Wlogical-op -Wmissing-include-dirs -Wold-style-definition -Wpointer-arith -Winit-self -Wdeclaration-after-statement -Wfloat-equal -Wsuggest-attribute=noreturn -Werror=missing-prototypes -Werror=implicit-function-declaration -Werror=missing-declarations -Werror=return-type -Werror=incompatible-pointer-types -Werror=format=2 -Wstrict-prototypes -Wredundant-decls -Wmissing-noreturn -Wshadow -Wendif-labels -Wstrict-aliasing=2 -Wwrite-strings -Werror=overflow -Wdate-time -Wnested-externs -ffast-math -fno-common -fdiagnostics-show-option -fno-strict-aliasing -fvisibility=hidden -fstack-protector -fstack-protector-strong -fPIE --param=ssp-buffer-size=4 -Wno-unused-parameter -Wno-missing-field-initializers -Wno-unused-result -Wno-format-signedness -Wno-error=nonnull -Werror=shadow -ffunction-sections -fdata-sections -include config.h -O2 -fwrapv -Wformat -Werror=format-security -gdwarf-4 -fno-debug-types-section -fvar-tracking-assignments -g2 -Wp,-D_FORTIFY_SOURCE=2 -fstack-protector-strong --param=ssp-buffer-size=4 -fPIC -mtune=generic -march=x86-64 -gdwarf-4 -fno-debug-types-section -fvar-tracking-assignments -g2 -pthread  -MD -MQ 'systemd-resolved@exe/src_resolve_resolved-dns-synthesize.c.o' -MF 'systemd-resolved@exe/src_resolve_resolved-dns-synthesize.c.o.d' -o 'systemd-resolved@exe/src_resolve_resolved-dns-synthesize.c.o' -c ../src/resolve/resolved-dns-synthesize.c
In file included from ../src/basic/macro.h:413:0,
                 from ../src/basic/alloc-util.h:27,
                 from ../src/resolve/resolved-dns-synthesize.c:20:
../src/resolve/resolved-dns-synthesize.c: In function ‘dns_synthesize_answer’:
../src/basic/log.h:246:25: warning: ‘r’ may be used uninitialized in this function [-Wmaybe-uninitialized]
                         : -abs(_e);                                     \
                         ^
../src/resolve/resolved-dns-synthesize.c:376:13: note: ‘r’ was declared here
         int r;
             ^
[870/1834] x86_64-pld-linux-gnux32-gcc -Isystemd-resolved@exe -I. -I.. -Isrc/basic -I../src/basic -Isrc/shared -I../src/shared -Isrc/systemd -I../src/systemd -Isrc/journal -I../src/journal -Isrc/resolve -I../src/resolve -Isrc/timesync -I../src/timesync -Isrc/login -I../src/login -Isrc/udev -I../src/udev -Isrc/libudev -I../src/libudev -Isrc/core -I../src/core -I../src/libsystemd/sd-bus -I../src/libsystemd/sd-device -I../src/libsystemd/sd-hwdb -I../src/libsystemd/sd-id128 -I../src/libsystemd/sd-netlink -I../src/libsystemd/sd-network -Isrc/libsystemd-network -I../src/libsystemd-network -I../ -fdiagnostics-color=always -pipe -D_FILE_OFFSET_BITS=64 -std=gnu99 -Wextra -Werror=undef -Wlogical-op -Wmissing-include-dirs -Wold-style-definition -Wpointer-arith -Winit-self -Wdeclaration-after-statement -Wfloat-equal -Wsuggest-attribute=noreturn -Werror=missing-prototypes -Werror=implicit-function-declaration -Werror=missing-declarations -Werror=return-type -Werror=incompatible-pointer-types -Werror=format=2 -Wstrict-prototypes -Wredundant-decls -Wmissing-noreturn -Wshadow -Wendif-labels -Wstrict-aliasing=2 -Wwrite-strings -Werror=overflow -Wdate-time -Wnested-externs -ffast-math -fno-common -fdiagnostics-show-option -fno-strict-aliasing -fvisibility=hidden -fstack-protector -fstack-protector-strong -fPIE --param=ssp-buffer-size=4 -Wno-unused-parameter -Wno-missing-field-initializers -Wno-unused-result -Wno-format-signedness -Wno-error=nonnull -Werror=shadow -ffunction-sections -fdata-sections -include config.h -O2 -fwrapv -Wformat -Werror=format-security -gdwarf-4 -fno-debug-types-section -fvar-tracking-assignments -g2 -Wp,-D_FORTIFY_SOURCE=2 -fstack-protector-strong --param=ssp-buffer-size=4 -fPIC -mtune=generic -march=x86-64 -gdwarf-4 -fno-debug-types-section -fvar-tracking-assignments -g2 -pthread  -MD -MQ 'systemd-resolved@exe/src_resolve_resolved-dns-dnssec.c.o' -MF 'systemd-resolved@exe/src_resolve_resolved-dns-dnssec.c.o.d' -o 'systemd-resolved@exe/src_resolve_resolved-dns-dnssec.c.o' -c ../src/resolve/resolved-dns-dnssec.c
[871/1834] x86_64-pld-linux-gnux32-gcc -Isystemd-resolved@exe -I. -I.. -Isrc/basic -I../src/basic -Isrc/shared -I../src/shared -Isrc/systemd -I../src/systemd -Isrc/journal -I../src/journal -Isrc/resolve -I../src/resolve -Isrc/timesync -I../src/timesync -Isrc/login -I../src/login -Isrc/udev -I../src/udev -Isrc/libudev -I../src/libudev -Isrc/core -I../src/core -I../src/libsystemd/sd-bus -I../src/libsystemd/sd-device -I../src/libsystemd/sd-hwdb -I../src/libsystemd/sd-id128 -I../src/libsystemd/sd-netlink -I../src/libsystemd/sd-network -Isrc/libsystemd-network -I../src/libsystemd-network -I../ -fdiagnostics-color=always -pipe -D_FILE_OFFSET_BITS=64 -std=gnu99 -Wextra -Werror=undef -Wlogical-op -Wmissing-include-dirs -Wold-style-definition -Wpointer-arith -Winit-self -Wdeclaration-after-statement -Wfloat-equal -Wsuggest-attribute=noreturn -Werror=missing-prototypes -Werror=implicit-function-declaration -Werror=missing-declarations -Werror=return-type -Werror=incompatible-pointer-types -Werror=format=2 -Wstrict-prototypes -Wredundant-decls -Wmissing-noreturn -Wshadow -Wendif-labels -Wstrict-aliasing=2 -Wwrite-strings -Werror=overflow -Wdate-time -Wnested-externs -ffast-math -fno-common -fdiagnostics-show-option -fno-strict-aliasing -fvisibility=hidden -fstack-protector -fstack-protector-strong -fPIE --param=ssp-buffer-size=4 -Wno-unused-parameter -Wno-missing-field-initializers -Wno-unused-result -Wno-format-signedness -Wno-error=nonnull -Werror=shadow -ffunction-sections -fdata-sections -include config.h -O2 -fwrapv -Wformat -Werror=format-security -gdwarf-4 -fno-debug-types-section -fvar-tracking-assignments -g2 -Wp,-D_FORTIFY_SOURCE=2 -fstack-protector-strong --param=ssp-buffer-size=4 -fPIC -mtune=generic -march=x86-64 -gdwarf-4 -fno-debug-types-section -fvar-tracking-assignments -g2 -pthread  -MD -MQ 'systemd-resolved@exe/src_resolve_resolved-link-bus.c.o' -MF 'systemd-resolved@exe/src_resolve_resolved-link-bus.c.o.d' -o 'systemd-resolved@exe/src_resolve_resolved-link-bus.c.o' -c ../src/resolve/resolved-link-bus.c
[872/1834] x86_64-pld-linux-gnux32-gcc -Isystemd-resolved@exe -I. -I.. -Isrc/basic -I../src/basic -Isrc/shared -I../src/shared -Isrc/systemd -I../src/systemd -Isrc/journal -I../src/journal -Isrc/resolve -I../src/resolve -Isrc/timesync -I../src/timesync -Isrc/login -I../src/login -Isrc/udev -I../src/udev -Isrc/libudev -I../src/libudev -Isrc/core -I../src/core -I../src/libsystemd/sd-bus -I../src/libsystemd/sd-device -I../src/libsystemd/sd-hwdb -I../src/libsystemd/sd-id128 -I../src/libsystemd/sd-netlink -I../src/libsystemd/sd-network -Isrc/libsystemd-network -I../src/libsystemd-network -I../ -fdiagnostics-color=always -pipe -D_FILE_OFFSET_BITS=64 -std=gnu99 -Wextra -Werror=undef -Wlogical-op -Wmissing-include-dirs -Wold-style-definition -Wpointer-arith -Winit-self -Wdeclaration-after-statement -Wfloat-equal -Wsuggest-attribute=noreturn -Werror=missing-prototypes -Werror=implicit-function-declaration -Werror=missing-declarations -Werror=return-type -Werror=incompatible-pointer-types -Werror=format=2 -Wstrict-prototypes -Wredundant-decls -Wmissing-noreturn -Wshadow -Wendif-labels -Wstrict-aliasing=2 -Wwrite-strings -Werror=overflow -Wdate-time -Wnested-externs -ffast-math -fno-common -fdiagnostics-show-option -fno-strict-aliasing -fvisibility=hidden -fstack-protector -fstack-protector-strong -fPIE --param=ssp-buffer-size=4 -Wno-unused-parameter -Wno-missing-field-initializers -Wno-unused-result -Wno-format-signedness -Wno-error=nonnull -Werror=shadow -ffunction-sections -fdata-sections -include config.h -O2 -fwrapv -Wformat -Werror=format-security -gdwarf-4 -fno-debug-types-section -fvar-tracking-assignments -g2 -Wp,-D_FORTIFY_SOURCE=2 -fstack-protector-strong --param=ssp-buffer-size=4 -fPIC -mtune=generic -march=x86-64 -gdwarf-4 -fno-debug-types-section -fvar-tracking-assignments -g2 -pthread  -MD -MQ 'systemd-resolved@exe/src_resolve_resolved-dns-query.c.o' -MF 'systemd-resolved@exe/src_resolve_resolved-dns-query.c.o.d' -o 'systemd-resolved@exe/src_resolve_resolved-dns-query.c.o' -c ../src/resolve/resolved-dns-query.c
[873/1834] x86_64-pld-linux-gnux32-gcc -Isystemd-resolved@exe -I. -I.. -Isrc/basic -I../src/basic -Isrc/shared -I../src/shared -Isrc/systemd -I../src/systemd -Isrc/journal -I../src/journal -Isrc/resolve -I../src/resolve -Isrc/timesync -I../src/timesync -Isrc/login -I../src/login -Isrc/udev -I../src/udev -Isrc/libudev -I../src/libudev -Isrc/core -I../src/core -I../src/libsystemd/sd-bus -I../src/libsystemd/sd-device -I../src/libsystemd/sd-hwdb -I../src/libsystemd/sd-id128 -I../src/libsystemd/sd-netlink -I../src/libsystemd/sd-network -Isrc/libsystemd-network -I../src/libsystemd-network -I../ -fdiagnostics-color=always -pipe -D_FILE_OFFSET_BITS=64 -std=gnu99 -Wextra -Werror=undef -Wlogical-op -Wmissing-include-dirs -Wold-style-definition -Wpointer-arith -Winit-self -Wdeclaration-after-statement -Wfloat-equal -Wsuggest-attribute=noreturn -Werror=missing-prototypes -Werror=implicit-function-declaration -Werror=missing-declarations -Werror=return-type -Werror=incompatible-pointer-types -Werror=format=2 -Wstrict-prototypes -Wredundant-decls -Wmissing-noreturn -Wshadow -Wendif-labels -Wstrict-aliasing=2 -Wwrite-strings -Werror=overflow -Wdate-time -Wnested-externs -ffast-math -fno-common -fdiagnostics-show-option -fno-strict-aliasing -fvisibility=hidden -fstack-protector -fstack-protector-strong -fPIE --param=ssp-buffer-size=4 -Wno-unused-parameter -Wno-missing-field-initializers -Wno-unused-result -Wno-format-signedness -Wno-error=nonnull -Werror=shadow -ffunction-sections -fdata-sections -include config.h -O2 -fwrapv -Wformat -Werror=format-security -gdwarf-4 -fno-debug-types-section -fvar-tracking-assignments -g2 -Wp,-D_FORTIFY_SOURCE=2 -fstack-protector-strong --param=ssp-buffer-size=4 -fPIC -mtune=generic -march=x86-64 -gdwarf-4 -fno-debug-types-section -fvar-tracking-assignments -g2 -pthread  -MD -MQ 'systemd-resolved@exe/src_resolve_dns-type.c.o' -MF 'systemd-resolved@exe/src_resolve_dns-type.c.o.d' -o 'systemd-resolved@exe/src_resolve_dns-type.c.o' -c ../src/resolve/dns-type.c
[874/1834] x86_64-pld-linux-gnux32-gcc -Isystemd-resolved@exe -I. -I.. -Isrc/basic -I../src/basic -Isrc/shared -I../src/shared -Isrc/systemd -I../src/systemd -Isrc/journal -I../src/journal -Isrc/resolve -I../src/resolve -Isrc/timesync -I../src/timesync -Isrc/login -I../src/login -Isrc/udev -I../src/udev -Isrc/libudev -I../src/libudev -Isrc/core -I../src/core -I../src/libsystemd/sd-bus -I../src/libsystemd/sd-device -I../src/libsystemd/sd-hwdb -I../src/libsystemd/sd-id128 -I../src/libsystemd/sd-netlink -I../src/libsystemd/sd-network -Isrc/libsystemd-network -I../src/libsystemd-network -I../ -fdiagnostics-color=always -pipe -D_FILE_OFFSET_BITS=64 -std=gnu99 -Wextra -Werror=undef -Wlogical-op -Wmissing-include-dirs -Wold-style-definition -Wpointer-arith -Winit-self -Wdeclaration-after-statement -Wfloat-equal -Wsuggest-attribute=noreturn -Werror=missing-prototypes -Werror=implicit-function-declaration -Werror=missing-declarations -Werror=return-type -Werror=incompatible-pointer-types -Werror=format=2 -Wstrict-prototypes -Wredundant-decls -Wmissing-noreturn -Wshadow -Wendif-labels -Wstrict-aliasing=2 -Wwrite-strings -Werror=overflow -Wdate-time -Wnested-externs -ffast-math -fno-common -fdiagnostics-show-option -fno-strict-aliasing -fvisibility=hidden -fstack-protector -fstack-protector-strong -fPIE --param=ssp-buffer-size=4 -Wno-unused-parameter -Wno-missing-field-initializers -Wno-unused-result -Wno-format-signedness -Wno-error=nonnull -Werror=shadow -ffunction-sections -fdata-sections -include config.h -O2 -fwrapv -Wformat -Werror=format-security -gdwarf-4 -fno-debug-types-section -fvar-tracking-assignments -g2 -Wp,-D_FORTIFY_SOURCE=2 -fstack-protector-strong --param=ssp-buffer-size=4 -fPIC -mtune=generic -march=x86-64 -gdwarf-4 -fno-debug-types-section -fvar-tracking-assignments -g2 -pthread  -MD -MQ 'systemd-resolved@exe/src_resolve_resolved-dns-question.c.o' -MF 'systemd-resolved@exe/src_resolve_resolved-dns-question.c.o.d' -o 'systemd-resolved@exe/src_resolve_resolved-dns-question.c.o' -c ../src/resolve/resolved-dns-question.c
[875/1834] x86_64-pld-linux-gnux32-gcc  -o systemd 'systemd@exe/src_core_main.c.o' -Wl,--no-undefined -Wl,--as-needed -Wl,-z,relro -Wl,-z,now -pie -Wl,--gc-sections -O2 -fwrapv -pipe -Wformat -Werror=format-security -gdwarf-4 -fno-debug-types-section -fvar-tracking-assignments -g2 -Wp,-D_FORTIFY_SOURCE=2 -fstack-protector-strong --param=ssp-buffer-size=4 -fPIC -mtune=generic -march=x86-64 -gdwarf-4 -fno-debug-types-section -fvar-tracking-assignments -g2 -Wl,--as-needed -Wl,--no-copy-dt-needed-entries -Wl,-z,relro -Wl,-z,combreloc -Wl,--start-group src/core/libcore.a src/shared/libsystemd-shared-235.a src/shared/libsystemd-shared-235.so -pthread -lrt -lseccomp -lselinux -lmount -lblkid -Wl,--end-group -lseccomp -lpam -laudit -lkmod -lapparmor -lmount -lrt -lcap -lacl -lcryptsetup -lgcrypt -lip4tc -lip6tc -lseccomp -lselinux -lidn -llzma -llz4 -lblkid '-Wl,-rpath,$ORIGIN/src/shared' -Wl,-rpath-link,/tmp/B.snKZS9/BUILD/systemd-235/build/src/shared  
[876/1834] x86_64-pld-linux-gnux32-gcc  -o systemd-analyze 'systemd-analyze@exe/src_analyze_analyze.c.o' 'systemd-analyze@exe/src_analyze_analyze-verify.c.o' -Wl,--no-undefined -Wl,--as-needed -Wl,-z,relro -Wl,-z,now -pie -Wl,--gc-sections -O2 -fwrapv -pipe -Wformat -Werror=format-security -gdwarf-4 -fno-debug-types-section -fvar-tracking-assignments -g2 -Wp,-D_FORTIFY_SOURCE=2 -fstack-protector-strong --param=ssp-buffer-size=4 -fPIC -mtune=generic -march=x86-64 -gdwarf-4 -fno-debug-types-section -fvar-tracking-assignments -g2 -Wl,--as-needed -Wl,--no-copy-dt-needed-entries -Wl,-z,relro -Wl,-z,combreloc -Wl,--start-group src/core/libcore.a src/shared/libsystemd-shared-235.a src/shared/libsystemd-shared-235.so -pthread -lrt -lseccomp -lselinux -lmount -lblkid -Wl,--end-group -lseccomp -lpam -laudit -lkmod -lapparmor -lmount -lrt -lcap -lacl -lcryptsetup -lgcrypt -lip4tc -lip6tc -lseccomp -lselinux -lidn -llzma -llz4 -lblkid '-Wl,-rpath,$ORIGIN/src/shared' -Wl,-rpath-link,/tmp/B.snKZS9/BUILD/systemd-235/build/src/shared  
[877/1834] x86_64-pld-linux-gnux32-gcc -Isystemd-resolved@exe -I. -I.. -Isrc/basic -I../src/basic -Isrc/shared -I../src/shared -Isrc/systemd -I../src/systemd -Isrc/journal -I../src/journal -Isrc/resolve -I../src/resolve -Isrc/timesync -I../src/timesync -Isrc/login -I../src/login -Isrc/udev -I../src/udev -Isrc/libudev -I../src/libudev -Isrc/core -I../src/core -I../src/libsystemd/sd-bus -I../src/libsystemd/sd-device -I../src/libsystemd/sd-hwdb -I../src/libsystemd/sd-id128 -I../src/libsystemd/sd-netlink -I../src/libsystemd/sd-network -Isrc/libsystemd-network -I../src/libsystemd-network -I../ -fdiagnostics-color=always -pipe -D_FILE_OFFSET_BITS=64 -std=gnu99 -Wextra -Werror=undef -Wlogical-op -Wmissing-include-dirs -Wold-style-definition -Wpointer-arith -Winit-self -Wdeclaration-after-statement -Wfloat-equal -Wsuggest-attribute=noreturn -Werror=missing-prototypes -Werror=implicit-function-declaration -Werror=missing-declarations -Werror=return-type -Werror=incompatible-pointer-types -Werror=format=2 -Wstrict-prototypes -Wredundant-decls -Wmissing-noreturn -Wshadow -Wendif-labels -Wstrict-aliasing=2 -Wwrite-strings -Werror=overflow -Wdate-time -Wnested-externs -ffast-math -fno-common -fdiagnostics-show-option -fno-strict-aliasing -fvisibility=hidden -fstack-protector -fstack-protector-strong -fPIE --param=ssp-buffer-size=4 -Wno-unused-parameter -Wno-missing-field-initializers -Wno-unused-result -Wno-format-signedness -Wno-error=nonnull -Werror=shadow -ffunction-sections -fdata-sections -include config.h -O2 -fwrapv -Wformat -Werror=format-security -gdwarf-4 -fno-debug-types-section -fvar-tracking-assignments -g2 -Wp,-D_FORTIFY_SOURCE=2 -fstack-protector-strong --param=ssp-buffer-size=4 -fPIC -mtune=generic -march=x86-64 -gdwarf-4 -fno-debug-types-section -fvar-tracking-assignments -g2 -pthread  -MD -MQ 'systemd-resolved@exe/src_resolve_resolved.c.o' -MF 'systemd-resolved@exe/src_resolve_resolved.c.o.d' -o 'systemd-resolved@exe/src_resolve_resolved.c.o' -c ../src/resolve/resolved.c
[878/1834] x86_64-pld-linux-gnux32-gcc -Isystemd-resolved@exe -I. -I.. -Isrc/basic -I../src/basic -Isrc/shared -I../src/shared -Isrc/systemd -I../src/systemd -Isrc/journal -I../src/journal -Isrc/resolve -I../src/resolve -Isrc/timesync -I../src/timesync -Isrc/login -I../src/login -Isrc/udev -I../src/udev -Isrc/libudev -I../src/libudev -Isrc/core -I../src/core -I../src/libsystemd/sd-bus -I../src/libsystemd/sd-device -I../src/libsystemd/sd-hwdb -I../src/libsystemd/sd-id128 -I../src/libsystemd/sd-netlink -I../src/libsystemd/sd-network -Isrc/libsystemd-network -I../src/libsystemd-network -I../ -fdiagnostics-color=always -pipe -D_FILE_OFFSET_BITS=64 -std=gnu99 -Wextra -Werror=undef -Wlogical-op -Wmissing-include-dirs -Wold-style-definition -Wpointer-arith -Winit-self -Wdeclaration-after-statement -Wfloat-equal -Wsuggest-attribute=noreturn -Werror=missing-prototypes -Werror=implicit-function-declaration -Werror=missing-declarations -Werror=return-type -Werror=incompatible-pointer-types -Werror=format=2 -Wstrict-prototypes -Wredundant-decls -Wmissing-noreturn -Wshadow -Wendif-labels -Wstrict-aliasing=2 -Wwrite-strings -Werror=overflow -Wdate-time -Wnested-externs -ffast-math -fno-common -fdiagnostics-show-option -fno-strict-aliasing -fvisibility=hidden -fstack-protector -fstack-protector-strong -fPIE --param=ssp-buffer-size=4 -Wno-unused-parameter -Wno-missing-field-initializers -Wno-unused-result -Wno-format-signedness -Wno-error=nonnull -Werror=shadow -ffunction-sections -fdata-sections -include config.h -O2 -fwrapv -Wformat -Werror=format-security -gdwarf-4 -fno-debug-types-section -fvar-tracking-assignments -g2 -Wp,-D_FORTIFY_SOURCE=2 -fstack-protector-strong --param=ssp-buffer-size=4 -fPIC -mtune=generic -march=x86-64 -gdwarf-4 -fno-debug-types-section -fvar-tracking-assignments -g2 -pthread  -MD -MQ 'systemd-resolved@exe/src_resolve_resolved-conf.c.o' -MF 'systemd-resolved@exe/src_resolve_resolved-conf.c.o.d' -o 'systemd-resolved@exe/src_resolve_resolved-conf.c.o' -c ../src/resolve/resolved-conf.c
[879/1834] x86_64-pld-linux-gnux32-gcc -Isystemd-resolved@exe -I. -I.. -Isrc/basic -I../src/basic -Isrc/shared -I../src/shared -Isrc/systemd -I../src/systemd -Isrc/journal -I../src/journal -Isrc/resolve -I../src/resolve -Isrc/timesync -I../src/timesync -Isrc/login -I../src/login -Isrc/udev -I../src/udev -Isrc/libudev -I../src/libudev -Isrc/core -I../src/core -I../src/libsystemd/sd-bus -I../src/libsystemd/sd-device -I../src/libsystemd/sd-hwdb -I../src/libsystemd/sd-id128 -I../src/libsystemd/sd-netlink -I../src/libsystemd/sd-network -Isrc/libsystemd-network -I../src/libsystemd-network -I../ -fdiagnostics-color=always -pipe -D_FILE_OFFSET_BITS=64 -std=gnu99 -Wextra -Werror=undef -Wlogical-op -Wmissing-include-dirs -Wold-style-definition -Wpointer-arith -Winit-self -Wdeclaration-after-statement -Wfloat-equal -Wsuggest-attribute=noreturn -Werror=missing-prototypes -Werror=implicit-function-declaration -Werror=missing-declarations -Werror=return-type -Werror=incompatible-pointer-types -Werror=format=2 -Wstrict-prototypes -Wredundant-decls -Wmissing-noreturn -Wshadow -Wendif-labels -Wstrict-aliasing=2 -Wwrite-strings -Werror=overflow -Wdate-time -Wnested-externs -ffast-math -fno-common -fdiagnostics-show-option -fno-strict-aliasing -fvisibility=hidden -fstack-protector -fstack-protector-strong -fPIE --param=ssp-buffer-size=4 -Wno-unused-parameter -Wno-missing-field-initializers -Wno-unused-result -Wno-format-signedness -Wno-error=nonnull -Werror=shadow -ffunction-sections -fdata-sections -include config.h -O2 -fwrapv -Wformat -Werror=format-security -gdwarf-4 -fno-debug-types-section -fvar-tracking-assignments -g2 -Wp,-D_FORTIFY_SOURCE=2 -fstack-protector-strong --param=ssp-buffer-size=4 -fPIC -mtune=generic -march=x86-64 -gdwarf-4 -fno-debug-types-section -fvar-tracking-assignments -g2 -pthread  -MD -MQ 'systemd-resolved@exe/src_resolve_resolved-dns-packet.c.o' -MF 'systemd-resolved@exe/src_resolve_resolved-dns-packet.c.o.d' -o 'systemd-resolved@exe/src_resolve_resolved-dns-packet.c.o' -c ../src/resolve/resolved-dns-packet.c
[880/1834] x86_64-pld-linux-gnux32-gcc -Isystemd-resolved@exe -I. -I.. -Isrc/basic -I../src/basic -Isrc/shared -I../src/shared -Isrc/systemd -I../src/systemd -Isrc/journal -I../src/journal -Isrc/resolve -I../src/resolve -Isrc/timesync -I../src/timesync -Isrc/login -I../src/login -Isrc/udev -I../src/udev -Isrc/libudev -I../src/libudev -Isrc/core -I../src/core -I../src/libsystemd/sd-bus -I../src/libsystemd/sd-device -I../src/libsystemd/sd-hwdb -I../src/libsystemd/sd-id128 -I../src/libsystemd/sd-netlink -I../src/libsystemd/sd-network -Isrc/libsystemd-network -I../src/libsystemd-network -I../ -fdiagnostics-color=always -pipe -D_FILE_OFFSET_BITS=64 -std=gnu99 -Wextra -Werror=undef -Wlogical-op -Wmissing-include-dirs -Wold-style-definition -Wpointer-arith -Winit-self -Wdeclaration-after-statement -Wfloat-equal -Wsuggest-attribute=noreturn -Werror=missing-prototypes -Werror=implicit-function-declaration -Werror=missing-declarations -Werror=return-type -Werror=incompatible-pointer-types -Werror=format=2 -Wstrict-prototypes -Wredundant-decls -Wmissing-noreturn -Wshadow -Wendif-labels -Wstrict-aliasing=2 -Wwrite-strings -Werror=overflow -Wdate-time -Wnested-externs -ffast-math -fno-common -fdiagnostics-show-option -fno-strict-aliasing -fvisibility=hidden -fstack-protector -fstack-protector-strong -fPIE --param=ssp-buffer-size=4 -Wno-unused-parameter -Wno-missing-field-initializers -Wno-unused-result -Wno-format-signedness -Wno-error=nonnull -Werror=shadow -ffunction-sections -fdata-sections -include config.h -O2 -fwrapv -Wformat -Werror=format-security -gdwarf-4 -fno-debug-types-section -fvar-tracking-assignments -g2 -Wp,-D_FORTIFY_SOURCE=2 -fstack-protector-strong --param=ssp-buffer-size=4 -fPIC -mtune=generic -march=x86-64 -gdwarf-4 -fno-debug-types-section -fvar-tracking-assignments -g2 -pthread  -MD -MQ 'systemd-resolved@exe/src_resolve_resolved-dns-answer.c.o' -MF 'systemd-resolved@exe/src_resolve_resolved-dns-answer.c.o.d' -o 'systemd-resolved@exe/src_resolve_resolved-dns-answer.c.o' -c ../src/resolve/resolved-dns-answer.c
[881/1834] x86_64-pld-linux-gnux32-gcc -Isystemd-resolved@exe -I. -I.. -Isrc/basic -I../src/basic -Isrc/shared -I../src/shared -Isrc/systemd -I../src/systemd -Isrc/journal -I../src/journal -Isrc/resolve -I../src/resolve -Isrc/timesync -I../src/timesync -Isrc/login -I../src/login -Isrc/udev -I../src/udev -Isrc/libudev -I../src/libudev -Isrc/core -I../src/core -I../src/libsystemd/sd-bus -I../src/libsystemd/sd-device -I../src/libsystemd/sd-hwdb -I../src/libsystemd/sd-id128 -I../src/libsystemd/sd-netlink -I../src/libsystemd/sd-network -Isrc/libsystemd-network -I../src/libsystemd-network -I../ -fdiagnostics-color=always -pipe -D_FILE_OFFSET_BITS=64 -std=gnu99 -Wextra -Werror=undef -Wlogical-op -Wmissing-include-dirs -Wold-style-definition -Wpointer-arith -Winit-self -Wdeclaration-after-statement -Wfloat-equal -Wsuggest-attribute=noreturn -Werror=missing-prototypes -Werror=implicit-function-declaration -Werror=missing-declarations -Werror=return-type -Werror=incompatible-pointer-types -Werror=format=2 -Wstrict-prototypes -Wredundant-decls -Wmissing-noreturn -Wshadow -Wendif-labels -Wstrict-aliasing=2 -Wwrite-strings -Werror=overflow -Wdate-time -Wnested-externs -ffast-math -fno-common -fdiagnostics-show-option -fno-strict-aliasing -fvisibility=hidden -fstack-protector -fstack-protector-strong -fPIE --param=ssp-buffer-size=4 -Wno-unused-parameter -Wno-missing-field-initializers -Wno-unused-result -Wno-format-signedness -Wno-error=nonnull -Werror=shadow -ffunction-sections -fdata-sections -include config.h -O2 -fwrapv -Wformat -Werror=format-security -gdwarf-4 -fno-debug-types-section -fvar-tracking-assignments -g2 -Wp,-D_FORTIFY_SOURCE=2 -fstack-protector-strong --param=ssp-buffer-size=4 -fPIC -mtune=generic -march=x86-64 -gdwarf-4 -fno-debug-types-section -fvar-tracking-assignments -g2 -pthread  -MD -MQ 'systemd-resolved@exe/src_resolve_resolved-bus.c.o' -MF 'systemd-resolved@exe/src_resolve_resolved-bus.c.o.d' -o 'systemd-resolved@exe/src_resolve_resolved-bus.c.o' -c ../src/resolve/resolved-bus.c
[882/1834] x86_64-pld-linux-gnux32-gcc -Isystemd-resolved@exe -I. -I.. -Isrc/basic -I../src/basic -Isrc/shared -I../src/shared -Isrc/systemd -I../src/systemd -Isrc/journal -I../src/journal -Isrc/resolve -I../src/resolve -Isrc/timesync -I../src/timesync -Isrc/login -I../src/login -Isrc/udev -I../src/udev -Isrc/libudev -I../src/libudev -Isrc/core -I../src/core -I../src/libsystemd/sd-bus -I../src/libsystemd/sd-device -I../src/libsystemd/sd-hwdb -I../src/libsystemd/sd-id128 -I../src/libsystemd/sd-netlink -I../src/libsystemd/sd-network -Isrc/libsystemd-network -I../src/libsystemd-network -I../ -fdiagnostics-color=always -pipe -D_FILE_OFFSET_BITS=64 -std=gnu99 -Wextra -Werror=undef -Wlogical-op -Wmissing-include-dirs -Wold-style-definition -Wpointer-arith -Winit-self -Wdeclaration-after-statement -Wfloat-equal -Wsuggest-attribute=noreturn -Werror=missing-prototypes -Werror=implicit-function-declaration -Werror=missing-declarations -Werror=return-type -Werror=incompatible-pointer-types -Werror=format=2 -Wstrict-prototypes -Wredundant-decls -Wmissing-noreturn -Wshadow -Wendif-labels -Wstrict-aliasing=2 -Wwrite-strings -Werror=overflow -Wdate-time -Wnested-externs -ffast-math -fno-common -fdiagnostics-show-option -fno-strict-aliasing -fvisibility=hidden -fstack-protector -fstack-protector-strong -fPIE --param=ssp-buffer-size=4 -Wno-unused-parameter -Wno-missing-field-initializers -Wno-unused-result -Wno-format-signedness -Wno-error=nonnull -Werror=shadow -ffunction-sections -fdata-sections -include config.h -O2 -fwrapv -Wformat -Werror=format-security -gdwarf-4 -fno-debug-types-section -fvar-tracking-assignments -g2 -Wp,-D_FORTIFY_SOURCE=2 -fstack-protector-strong --param=ssp-buffer-size=4 -fPIC -mtune=generic -march=x86-64 -gdwarf-4 -fno-debug-types-section -fvar-tracking-assignments -g2 -pthread  -MD -MQ 'systemd-resolved@exe/src_resolve_resolved-llmnr.c.o' -MF 'systemd-resolved@exe/src_resolve_resolved-llmnr.c.o.d' -o 'systemd-resolved@exe/src_resolve_resolved-llmnr.c.o' -c ../src/resolve/resolved-llmnr.c
[883/1834] x86_64-pld-linux-gnux32-gcc -Isystemd-resolved@exe -I. -I.. -Isrc/basic -I../src/basic -Isrc/shared -I../src/shared -Isrc/systemd -I../src/systemd -Isrc/journal -I../src/journal -Isrc/resolve -I../src/resolve -Isrc/timesync -I../src/timesync -Isrc/login -I../src/login -Isrc/udev -I../src/udev -Isrc/libudev -I../src/libudev -Isrc/core -I../src/core -I../src/libsystemd/sd-bus -I../src/libsystemd/sd-device -I../src/libsystemd/sd-hwdb -I../src/libsystemd/sd-id128 -I../src/libsystemd/sd-netlink -I../src/libsystemd/sd-network -Isrc/libsystemd-network -I../src/libsystemd-network -I../ -fdiagnostics-color=always -pipe -D_FILE_OFFSET_BITS=64 -std=gnu99 -Wextra -Werror=undef -Wlogical-op -Wmissing-include-dirs -Wold-style-definition -Wpointer-arith -Winit-self -Wdeclaration-after-statement -Wfloat-equal -Wsuggest-attribute=noreturn -Werror=missing-prototypes -Werror=implicit-function-declaration -Werror=missing-declarations -Werror=return-type -Werror=incompatible-pointer-types -Werror=format=2 -Wstrict-prototypes -Wredundant-decls -Wmissing-noreturn -Wshadow -Wendif-labels -Wstrict-aliasing=2 -Wwrite-strings -Werror=overflow -Wdate-time -Wnested-externs -ffast-math -fno-common -fdiagnostics-show-option -fno-strict-aliasing -fvisibility=hidden -fstack-protector -fstack-protector-strong -fPIE --param=ssp-buffer-size=4 -Wno-unused-parameter -Wno-missing-field-initializers -Wno-unused-result -Wno-format-signedness -Wno-error=nonnull -Werror=shadow -ffunction-sections -fdata-sections -include config.h -O2 -fwrapv -Wformat -Werror=format-security -gdwarf-4 -fno-debug-types-section -fvar-tracking-assignments -g2 -Wp,-D_FORTIFY_SOURCE=2 -fstack-protector-strong --param=ssp-buffer-size=4 -fPIC -mtune=generic -march=x86-64 -gdwarf-4 -fno-debug-types-section -fvar-tracking-assignments -g2 -pthread  -MD -MQ 'systemd-resolved@exe/src_resolve_resolved-mdns.c.o' -MF 'systemd-resolved@exe/src_resolve_resolved-mdns.c.o.d' -o 'systemd-resolved@exe/src_resolve_resolved-mdns.c.o' -c ../src/resolve/resolved-mdns.c
[884/1834] x86_64-pld-linux-gnux32-gcc -Isystemd-resolved@exe -I. -I.. -Isrc/basic -I../src/basic -Isrc/shared -I../src/shared -Isrc/systemd -I../src/systemd -Isrc/journal -I../src/journal -Isrc/resolve -I../src/resolve -Isrc/timesync -I../src/timesync -Isrc/login -I../src/login -Isrc/udev -I../src/udev -Isrc/libudev -I../src/libudev -Isrc/core -I../src/core -I../src/libsystemd/sd-bus -I../src/libsystemd/sd-device -I../src/libsystemd/sd-hwdb -I../src/libsystemd/sd-id128 -I../src/libsystemd/sd-netlink -I../src/libsystemd/sd-network -Isrc/libsystemd-network -I../src/libsystemd-network -I../ -fdiagnostics-color=always -pipe -D_FILE_OFFSET_BITS=64 -std=gnu99 -Wextra -Werror=undef -Wlogical-op -Wmissing-include-dirs -Wold-style-definition -Wpointer-arith -Winit-self -Wdeclaration-after-statement -Wfloat-equal -Wsuggest-attribute=noreturn -Werror=missing-prototypes -Werror=implicit-function-declaration -Werror=missing-declarations -Werror=return-type -Werror=incompatible-pointer-types -Werror=format=2 -Wstrict-prototypes -Wredundant-decls -Wmissing-noreturn -Wshadow -Wendif-labels -Wstrict-aliasing=2 -Wwrite-strings -Werror=overflow -Wdate-time -Wnested-externs -ffast-math -fno-common -fdiagnostics-show-option -fno-strict-aliasing -fvisibility=hidden -fstack-protector -fstack-protector-strong -fPIE --param=ssp-buffer-size=4 -Wno-unused-parameter -Wno-missing-field-initializers -Wno-unused-result -Wno-format-signedness -Wno-error=nonnull -Werror=shadow -ffunction-sections -fdata-sections -include config.h -O2 -fwrapv -Wformat -Werror=format-security -gdwarf-4 -fno-debug-types-section -fvar-tracking-assignments -g2 -Wp,-D_FORTIFY_SOURCE=2 -fstack-protector-strong --param=ssp-buffer-size=4 -fPIC -mtune=generic -march=x86-64 -gdwarf-4 -fno-debug-types-section -fvar-tracking-assignments -g2 -pthread  -MD -MQ 'systemd-resolved@exe/src_resolve_resolved-manager.c.o' -MF 'systemd-resolved@exe/src_resolve_resolved-manager.c.o.d' -o 'systemd-resolved@exe/src_resolve_resolved-manager.c.o' -c ../src/resolve/resolved-manager.c
[885/1834] x86_64-pld-linux-gnux32-gcc -Isystemd-resolved@exe -I. -I.. -Isrc/basic -I../src/basic -Isrc/shared -I../src/shared -Isrc/systemd -I../src/systemd -Isrc/journal -I../src/journal -Isrc/resolve -I../src/resolve -Isrc/timesync -I../src/timesync -Isrc/login -I../src/login -Isrc/udev -I../src/udev -Isrc/libudev -I../src/libudev -Isrc/core -I../src/core -I../src/libsystemd/sd-bus -I../src/libsystemd/sd-device -I../src/libsystemd/sd-hwdb -I../src/libsystemd/sd-id128 -I../src/libsystemd/sd-netlink -I../src/libsystemd/sd-network -Isrc/libsystemd-network -I../src/libsystemd-network -I../ -fdiagnostics-color=always -pipe -D_FILE_OFFSET_BITS=64 -std=gnu99 -Wextra -Werror=undef -Wlogical-op -Wmissing-include-dirs -Wold-style-definition -Wpointer-arith -Winit-self -Wdeclaration-after-statement -Wfloat-equal -Wsuggest-attribute=noreturn -Werror=missing-prototypes -Werror=implicit-function-declaration -Werror=missing-declarations -Werror=return-type -Werror=incompatible-pointer-types -Werror=format=2 -Wstrict-prototypes -Wredundant-decls -Wmissing-noreturn -Wshadow -Wendif-labels -Wstrict-aliasing=2 -Wwrite-strings -Werror=overflow -Wdate-time -Wnested-externs -ffast-math -fno-common -fdiagnostics-show-option -fno-strict-aliasing -fvisibility=hidden -fstack-protector -fstack-protector-strong -fPIE --param=ssp-buffer-size=4 -Wno-unused-parameter -Wno-missing-field-initializers -Wno-unused-result -Wno-format-signedness -Wno-error=nonnull -Werror=shadow -ffunction-sections -fdata-sections -include config.h -O2 -fwrapv -Wformat -Werror=format-security -gdwarf-4 -fno-debug-types-section -fvar-tracking-assignments -g2 -Wp,-D_FORTIFY_SOURCE=2 -fstack-protector-strong --param=ssp-buffer-size=4 -fPIC -mtune=generic -march=x86-64 -gdwarf-4 -fno-debug-types-section -fvar-tracking-assignments -g2 -pthread  -MD -MQ 'systemd-resolved@exe/src_resolve_resolved-dns-search-domain.c.o' -MF 'systemd-resolved@exe/src_resolve_resolved-dns-search-domain.c.o.d' -o 'systemd-resolved@exe/src_resolve_resolved-dns-search-domain.c.o' -c ../src/resolve/resolved-dns-search-domain.c
[886/1834] x86_64-pld-linux-gnux32-gcc -Isystemd-resolved@exe -I. -I.. -Isrc/basic -I../src/basic -Isrc/shared -I../src/shared -Isrc/systemd -I../src/systemd -Isrc/journal -I../src/journal -Isrc/resolve -I../src/resolve -Isrc/timesync -I../src/timesync -Isrc/login -I../src/login -Isrc/udev -I../src/udev -Isrc/libudev -I../src/libudev -Isrc/core -I../src/core -I../src/libsystemd/sd-bus -I../src/libsystemd/sd-device -I../src/libsystemd/sd-hwdb -I../src/libsystemd/sd-id128 -I../src/libsystemd/sd-netlink -I../src/libsystemd/sd-network -Isrc/libsystemd-network -I../src/libsystemd-network -I../ -fdiagnostics-color=always -pipe -D_FILE_OFFSET_BITS=64 -std=gnu99 -Wextra -Werror=undef -Wlogical-op -Wmissing-include-dirs -Wold-style-definition -Wpointer-arith -Winit-self -Wdeclaration-after-statement -Wfloat-equal -Wsuggest-attribute=noreturn -Werror=missing-prototypes -Werror=implicit-function-declaration -Werror=missing-declarations -Werror=return-type -Werror=incompatible-pointer-types -Werror=format=2 -Wstrict-prototypes -Wredundant-decls -Wmissing-noreturn -Wshadow -Wendif-labels -Wstrict-aliasing=2 -Wwrite-strings -Werror=overflow -Wdate-time -Wnested-externs -ffast-math -fno-common -fdiagnostics-show-option -fno-strict-aliasing -fvisibility=hidden -fstack-protector -fstack-protector-strong -fPIE --param=ssp-buffer-size=4 -Wno-unused-parameter -Wno-missing-field-initializers -Wno-unused-result -Wno-format-signedness -Wno-error=nonnull -Werror=shadow -ffunction-sections -fdata-sections -include config.h -O2 -fwrapv -Wformat -Werror=format-security -gdwarf-4 -fno-debug-types-section -fvar-tracking-assignments -g2 -Wp,-D_FORTIFY_SOURCE=2 -fstack-protector-strong --param=ssp-buffer-size=4 -fPIC -mtune=generic -march=x86-64 -gdwarf-4 -fno-debug-types-section -fvar-tracking-assignments -g2 -pthread  -MD -MQ 'systemd-resolved@exe/src_resolve_resolved-dns-rr.c.o' -MF 'systemd-resolved@exe/src_resolve_resolved-dns-rr.c.o.d' -o 'systemd-resolved@exe/src_resolve_resolved-dns-rr.c.o' -c ../src/resolve/resolved-dns-rr.c
[887/1834] x86_64-pld-linux-gnux32-gcc -Isystemd-resolved@exe -I. -I.. -Isrc/basic -I../src/basic -Isrc/shared -I../src/shared -Isrc/systemd -I../src/systemd -Isrc/journal -I../src/journal -Isrc/resolve -I../src/resolve -Isrc/timesync -I../src/timesync -Isrc/login -I../src/login -Isrc/udev -I../src/udev -Isrc/libudev -I../src/libudev -Isrc/core -I../src/core -I../src/libsystemd/sd-bus -I../src/libsystemd/sd-device -I../src/libsystemd/sd-hwdb -I../src/libsystemd/sd-id128 -I../src/libsystemd/sd-netlink -I../src/libsystemd/sd-network -Isrc/libsystemd-network -I../src/libsystemd-network -I../ -fdiagnostics-color=always -pipe -D_FILE_OFFSET_BITS=64 -std=gnu99 -Wextra -Werror=undef -Wlogical-op -Wmissing-include-dirs -Wold-style-definition -Wpointer-arith -Winit-self -Wdeclaration-after-statement -Wfloat-equal -Wsuggest-attribute=noreturn -Werror=missing-prototypes -Werror=implicit-function-declaration -Werror=missing-declarations -Werror=return-type -Werror=incompatible-pointer-types -Werror=format=2 -Wstrict-prototypes -Wredundant-decls -Wmissing-noreturn -Wshadow -Wendif-labels -Wstrict-aliasing=2 -Wwrite-strings -Werror=overflow -Wdate-time -Wnested-externs -ffast-math -fno-common -fdiagnostics-show-option -fno-strict-aliasing -fvisibility=hidden -fstack-protector -fstack-protector-strong -fPIE --param=ssp-buffer-size=4 -Wno-unused-parameter -Wno-missing-field-initializers -Wno-unused-result -Wno-format-signedness -Wno-error=nonnull -Werror=shadow -ffunction-sections -fdata-sections -include config.h -O2 -fwrapv -Wformat -Werror=format-security -gdwarf-4 -fno-debug-types-section -fvar-tracking-assignments -g2 -Wp,-D_FORTIFY_SOURCE=2 -fstack-protector-strong --param=ssp-buffer-size=4 -fPIC -mtune=generic -march=x86-64 -gdwarf-4 -fno-debug-types-section -fvar-tracking-assignments -g2 -pthread  -MD -MQ 'systemd-resolved@exe/src_resolve_resolved-link.c.o' -MF 'systemd-resolved@exe/src_resolve_resolved-link.c.o.d' -o 'systemd-resolved@exe/src_resolve_resolved-link.c.o' -c ../src/resolve/resolved-link.c
[888/1834] x86_64-pld-linux-gnux32-gcc -Isystemd-resolved@exe -I. -I.. -Isrc/basic -I../src/basic -Isrc/shared -I../src/shared -Isrc/systemd -I../src/systemd -Isrc/journal -I../src/journal -Isrc/resolve -I../src/resolve -Isrc/timesync -I../src/timesync -Isrc/login -I../src/login -Isrc/udev -I../src/udev -Isrc/libudev -I../src/libudev -Isrc/core -I../src/core -I../src/libsystemd/sd-bus -I../src/libsystemd/sd-device -I../src/libsystemd/sd-hwdb -I../src/libsystemd/sd-id128 -I../src/libsystemd/sd-netlink -I../src/libsystemd/sd-network -Isrc/libsystemd-network -I../src/libsystemd-network -I../ -fdiagnostics-color=always -pipe -D_FILE_OFFSET_BITS=64 -std=gnu99 -Wextra -Werror=undef -Wlogical-op -Wmissing-include-dirs -Wold-style-definition -Wpointer-arith -Winit-self -Wdeclaration-after-statement -Wfloat-equal -Wsuggest-attribute=noreturn -Werror=missing-prototypes -Werror=implicit-function-declaration -Werror=missing-declarations -Werror=return-type -Werror=incompatible-pointer-types -Werror=format=2 -Wstrict-prototypes -Wredundant-decls -Wmissing-noreturn -Wshadow -Wendif-labels -Wstrict-aliasing=2 -Wwrite-strings -Werror=overflow -Wdate-time -Wnested-externs -ffast-math -fno-common -fdiagnostics-show-option -fno-strict-aliasing -fvisibility=hidden -fstack-protector -fstack-protector-strong -fPIE --param=ssp-buffer-size=4 -Wno-unused-parameter -Wno-missing-field-initializers -Wno-unused-result -Wno-format-signedness -Wno-error=nonnull -Werror=shadow -ffunction-sections -fdata-sections -include config.h -O2 -fwrapv -Wformat -Werror=format-security -gdwarf-4 -fno-debug-types-section -fvar-tracking-assignments -g2 -Wp,-D_FORTIFY_SOURCE=2 -fstack-protector-strong --param=ssp-buffer-size=4 -fPIC -mtune=generic -march=x86-64 -gdwarf-4 -fno-debug-types-section -fvar-tracking-assignments -g2 -pthread  -MD -MQ 'systemd-resolved@exe/src_resolve_resolved-dns-scope.c.o' -MF 'systemd-resolved@exe/src_resolve_resolved-dns-scope.c.o.d' -o 'systemd-resolved@exe/src_resolve_resolved-dns-scope.c.o' -c ../src/resolve/resolved-dns-scope.c
[889/1834] x86_64-pld-linux-gnux32-gcc -Isystemd-resolved@exe -I. -I.. -Isrc/basic -I../src/basic -Isrc/shared -I../src/shared -Isrc/systemd -I../src/systemd -Isrc/journal -I../src/journal -Isrc/resolve -I../src/resolve -Isrc/timesync -I../src/timesync -Isrc/login -I../src/login -Isrc/udev -I../src/udev -Isrc/libudev -I../src/libudev -Isrc/core -I../src/core -I../src/libsystemd/sd-bus -I../src/libsystemd/sd-device -I../src/libsystemd/sd-hwdb -I../src/libsystemd/sd-id128 -I../src/libsystemd/sd-netlink -I../src/libsystemd/sd-network -Isrc/libsystemd-network -I../src/libsystemd-network -I../ -fdiagnostics-color=always -pipe -D_FILE_OFFSET_BITS=64 -std=gnu99 -Wextra -Werror=undef -Wlogical-op -Wmissing-include-dirs -Wold-style-definition -Wpointer-arith -Winit-self -Wdeclaration-after-statement -Wfloat-equal -Wsuggest-attribute=noreturn -Werror=missing-prototypes -Werror=implicit-function-declaration -Werror=missing-declarations -Werror=return-type -Werror=incompatible-pointer-types -Werror=format=2 -Wstrict-prototypes -Wredundant-decls -Wmissing-noreturn -Wshadow -Wendif-labels -Wstrict-aliasing=2 -Wwrite-strings -Werror=overflow -Wdate-time -Wnested-externs -ffast-math -fno-common -fdiagnostics-show-option -fno-strict-aliasing -fvisibility=hidden -fstack-protector -fstack-protector-strong -fPIE --param=ssp-buffer-size=4 -Wno-unused-parameter -Wno-missing-field-initializers -Wno-unused-result -Wno-format-signedness -Wno-error=nonnull -Werror=shadow -ffunction-sections -fdata-sections -include config.h -O2 -fwrapv -Wformat -Werror=format-security -gdwarf-4 -fno-debug-types-section -fvar-tracking-assignments -g2 -Wp,-D_FORTIFY_SOURCE=2 -fstack-protector-strong --param=ssp-buffer-size=4 -fPIC -mtune=generic -march=x86-64 -gdwarf-4 -fno-debug-types-section -fvar-tracking-assignments -g2 -pthread  -MD -MQ 'systemd-resolved@exe/src_resolve_resolved-dns-server.c.o' -MF 'systemd-resolved@exe/src_resolve_resolved-dns-server.c.o.d' -o 'systemd-resolved@exe/src_resolve_resolved-dns-server.c.o' -c ../src/resolve/resolved-dns-server.c
[890/1834] x86_64-pld-linux-gnux32-gcc -Isystemd-resolved@exe -I. -I.. -Isrc/basic -I../src/basic -Isrc/shared -I../src/shared -Isrc/systemd -I../src/systemd -Isrc/journal -I../src/journal -Isrc/resolve -I../src/resolve -Isrc/timesync -I../src/timesync -Isrc/login -I../src/login -Isrc/udev -I../src/udev -Isrc/libudev -I../src/libudev -Isrc/core -I../src/core -I../src/libsystemd/sd-bus -I../src/libsystemd/sd-device -I../src/libsystemd/sd-hwdb -I../src/libsystemd/sd-id128 -I../src/libsystemd/sd-netlink -I../src/libsystemd/sd-network -Isrc/libsystemd-network -I../src/libsystemd-network -I../ -fdiagnostics-color=always -pipe -D_FILE_OFFSET_BITS=64 -std=gnu99 -Wextra -Werror=undef -Wlogical-op -Wmissing-include-dirs -Wold-style-definition -Wpointer-arith -Winit-self -Wdeclaration-after-statement -Wfloat-equal -Wsuggest-attribute=noreturn -Werror=missing-prototypes -Werror=implicit-function-declaration -Werror=missing-declarations -Werror=return-type -Werror=incompatible-pointer-types -Werror=format=2 -Wstrict-prototypes -Wredundant-decls -Wmissing-noreturn -Wshadow -Wendif-labels -Wstrict-aliasing=2 -Wwrite-strings -Werror=overflow -Wdate-time -Wnested-externs -ffast-math -fno-common -fdiagnostics-show-option -fno-strict-aliasing -fvisibility=hidden -fstack-protector -fstack-protector-strong -fPIE --param=ssp-buffer-size=4 -Wno-unused-parameter -Wno-missing-field-initializers -Wno-unused-result -Wno-format-signedness -Wno-error=nonnull -Werror=shadow -ffunction-sections -fdata-sections -include config.h -O2 -fwrapv -Wformat -Werror=format-security -gdwarf-4 -fno-debug-types-section -fvar-tracking-assignments -g2 -Wp,-D_FORTIFY_SOURCE=2 -fstack-protector-strong --param=ssp-buffer-size=4 -fPIC -mtune=generic -march=x86-64 -gdwarf-4 -fno-debug-types-section -fvar-tracking-assignments -g2 -pthread  -MD -MQ 'systemd-resolved@exe/src_resolve_resolved-dns-zone.c.o' -MF 'systemd-resolved@exe/src_resolve_resolved-dns-zone.c.o.d' -o 'systemd-resolved@exe/src_resolve_resolved-dns-zone.c.o' -c ../src/resolve/resolved-dns-zone.c
[891/1834] x86_64-pld-linux-gnux32-gcc -Isystemd-resolved@exe -I. -I.. -Isrc/basic -I../src/basic -Isrc/shared -I../src/shared -Isrc/systemd -I../src/systemd -Isrc/journal -I../src/journal -Isrc/resolve -I../src/resolve -Isrc/timesync -I../src/timesync -Isrc/login -I../src/login -Isrc/udev -I../src/udev -Isrc/libudev -I../src/libudev -Isrc/core -I../src/core -I../src/libsystemd/sd-bus -I../src/libsystemd/sd-device -I../src/libsystemd/sd-hwdb -I../src/libsystemd/sd-id128 -I../src/libsystemd/sd-netlink -I../src/libsystemd/sd-network -Isrc/libsystemd-network -I../src/libsystemd-network -I../ -fdiagnostics-color=always -pipe -D_FILE_OFFSET_BITS=64 -std=gnu99 -Wextra -Werror=undef -Wlogical-op -Wmissing-include-dirs -Wold-style-definition -Wpointer-arith -Winit-self -Wdeclaration-after-statement -Wfloat-equal -Wsuggest-attribute=noreturn -Werror=missing-prototypes -Werror=implicit-function-declaration -Werror=missing-declarations -Werror=return-type -Werror=incompatible-pointer-types -Werror=format=2 -Wstrict-prototypes -Wredundant-decls -Wmissing-noreturn -Wshadow -Wendif-labels -Wstrict-aliasing=2 -Wwrite-strings -Werror=overflow -Wdate-time -Wnested-externs -ffast-math -fno-common -fdiagnostics-show-option -fno-strict-aliasing -fvisibility=hidden -fstack-protector -fstack-protector-strong -fPIE --param=ssp-buffer-size=4 -Wno-unused-parameter -Wno-missing-field-initializers -Wno-unused-result -Wno-format-signedness -Wno-error=nonnull -Werror=shadow -ffunction-sections -fdata-sections -include config.h -O2 -fwrapv -Wformat -Werror=format-security -gdwarf-4 -fno-debug-types-section -fvar-tracking-assignments -g2 -Wp,-D_FORTIFY_SOURCE=2 -fstack-protector-strong --param=ssp-buffer-size=4 -fPIC -mtune=generic -march=x86-64 -gdwarf-4 -fno-debug-types-section -fvar-tracking-assignments -g2 -pthread  -MD -MQ 'systemd-resolved@exe/src_resolve_resolved-dns-cache.c.o' -MF 'systemd-resolved@exe/src_resolve_resolved-dns-cache.c.o.d' -o 'systemd-resolved@exe/src_resolve_resolved-dns-cache.c.o' -c ../src/resolve/resolved-dns-cache.c
[892/1834] x86_64-pld-linux-gnux32-gcc -Isystemd-resolved@exe -I. -I.. -Isrc/basic -I../src/basic -Isrc/shared -I../src/shared -Isrc/systemd -I../src/systemd -Isrc/journal -I../src/journal -Isrc/resolve -I../src/resolve -Isrc/timesync -I../src/timesync -Isrc/login -I../src/login -Isrc/udev -I../src/udev -Isrc/libudev -I../src/libudev -Isrc/core -I../src/core -I../src/libsystemd/sd-bus -I../src/libsystemd/sd-device -I../src/libsystemd/sd-hwdb -I../src/libsystemd/sd-id128 -I../src/libsystemd/sd-netlink -I../src/libsystemd/sd-network -Isrc/libsystemd-network -I../src/libsystemd-network -I../ -fdiagnostics-color=always -pipe -D_FILE_OFFSET_BITS=64 -std=gnu99 -Wextra -Werror=undef -Wlogical-op -Wmissing-include-dirs -Wold-style-definition -Wpointer-arith -Winit-self -Wdeclaration-after-statement -Wfloat-equal -Wsuggest-attribute=noreturn -Werror=missing-prototypes -Werror=implicit-function-declaration -Werror=missing-declarations -Werror=return-type -Werror=incompatible-pointer-types -Werror=format=2 -Wstrict-prototypes -Wredundant-decls -Wmissing-noreturn -Wshadow -Wendif-labels -Wstrict-aliasing=2 -Wwrite-strings -Werror=overflow -Wdate-time -Wnested-externs -ffast-math -fno-common -fdiagnostics-show-option -fno-strict-aliasing -fvisibility=hidden -fstack-protector -fstack-protector-strong -fPIE --param=ssp-buffer-size=4 -Wno-unused-parameter -Wno-missing-field-initializers -Wno-unused-result -Wno-format-signedness -Wno-error=nonnull -Werror=shadow -ffunction-sections -fdata-sections -include config.h -O2 -fwrapv -Wformat -Werror=format-security -gdwarf-4 -fno-debug-types-section -fvar-tracking-assignments -g2 -Wp,-D_FORTIFY_SOURCE=2 -fstack-protector-strong --param=ssp-buffer-size=4 -fPIC -mtune=generic -march=x86-64 -gdwarf-4 -fno-debug-types-section -fvar-tracking-assignments -g2 -pthread  -MD -MQ 'systemd-resolved@exe/src_resolve_resolved-dns-stub.c.o' -MF 'systemd-resolved@exe/src_resolve_resolved-dns-stub.c.o.d' -o 'systemd-resolved@exe/src_resolve_resolved-dns-stub.c.o' -c ../src/resolve/resolved-dns-stub.c
[893/1834] x86_64-pld-linux-gnux32-gcc -Isystemd-resolved@exe -I. -I.. -Isrc/basic -I../src/basic -Isrc/shared -I../src/shared -Isrc/systemd -I../src/systemd -Isrc/journal -I../src/journal -Isrc/resolve -I../src/resolve -Isrc/timesync -I../src/timesync -Isrc/login -I../src/login -Isrc/udev -I../src/udev -Isrc/libudev -I../src/libudev -Isrc/core -I../src/core -I../src/libsystemd/sd-bus -I../src/libsystemd/sd-device -I../src/libsystemd/sd-hwdb -I../src/libsystemd/sd-id128 -I../src/libsystemd/sd-netlink -I../src/libsystemd/sd-network -Isrc/libsystemd-network -I../src/libsystemd-network -I../ -fdiagnostics-color=always -pipe -D_FILE_OFFSET_BITS=64 -std=gnu99 -Wextra -Werror=undef -Wlogical-op -Wmissing-include-dirs -Wold-style-definition -Wpointer-arith -Winit-self -Wdeclaration-after-statement -Wfloat-equal -Wsuggest-attribute=noreturn -Werror=missing-prototypes -Werror=implicit-function-declaration -Werror=missing-declarations -Werror=return-type -Werror=incompatible-pointer-types -Werror=format=2 -Wstrict-prototypes -Wredundant-decls -Wmissing-noreturn -Wshadow -Wendif-labels -Wstrict-aliasing=2 -Wwrite-strings -Werror=overflow -Wdate-time -Wnested-externs -ffast-math -fno-common -fdiagnostics-show-option -fno-strict-aliasing -fvisibility=hidden -fstack-protector -fstack-protector-strong -fPIE --param=ssp-buffer-size=4 -Wno-unused-parameter -Wno-missing-field-initializers -Wno-unused-result -Wno-format-signedness -Wno-error=nonnull -Werror=shadow -ffunction-sections -fdata-sections -include config.h -O2 -fwrapv -Wformat -Werror=format-security -gdwarf-4 -fno-debug-types-section -fvar-tracking-assignments -g2 -Wp,-D_FORTIFY_SOURCE=2 -fstack-protector-strong --param=ssp-buffer-size=4 -fPIC -mtune=generic -march=x86-64 -gdwarf-4 -fno-debug-types-section -fvar-tracking-assignments -g2 -pthread  -MD -MQ 'systemd-resolved@exe/src_resolve_resolved-dns-stream.c.o' -MF 'systemd-resolved@exe/src_resolve_resolved-dns-stream.c.o.d' -o 'systemd-resolved@exe/src_resolve_resolved-dns-stream.c.o' -c ../src/resolve/resolved-dns-stream.c
[894/1834] x86_64-pld-linux-gnux32-gcc -Isystemd-resolved@exe -I. -I.. -Isrc/basic -I../src/basic -Isrc/shared -I../src/shared -Isrc/systemd -I../src/systemd -Isrc/journal -I../src/journal -Isrc/resolve -I../src/resolve -Isrc/timesync -I../src/timesync -Isrc/login -I../src/login -Isrc/udev -I../src/udev -Isrc/libudev -I../src/libudev -Isrc/core -I../src/core -I../src/libsystemd/sd-bus -I../src/libsystemd/sd-device -I../src/libsystemd/sd-hwdb -I../src/libsystemd/sd-id128 -I../src/libsystemd/sd-netlink -I../src/libsystemd/sd-network -Isrc/libsystemd-network -I../src/libsystemd-network -I../ -fdiagnostics-color=always -pipe -D_FILE_OFFSET_BITS=64 -std=gnu99 -Wextra -Werror=undef -Wlogical-op -Wmissing-include-dirs -Wold-style-definition -Wpointer-arith -Winit-self -Wdeclaration-after-statement -Wfloat-equal -Wsuggest-attribute=noreturn -Werror=missing-prototypes -Werror=implicit-function-declaration -Werror=missing-declarations -Werror=return-type -Werror=incompatible-pointer-types -Werror=format=2 -Wstrict-prototypes -Wredundant-decls -Wmissing-noreturn -Wshadow -Wendif-labels -Wstrict-aliasing=2 -Wwrite-strings -Werror=overflow -Wdate-time -Wnested-externs -ffast-math -fno-common -fdiagnostics-show-option -fno-strict-aliasing -fvisibility=hidden -fstack-protector -fstack-protector-strong -fPIE --param=ssp-buffer-size=4 -Wno-unused-parameter -Wno-missing-field-initializers -Wno-unused-result -Wno-format-signedness -Wno-error=nonnull -Werror=shadow -ffunction-sections -fdata-sections -include config.h -O2 -fwrapv -Wformat -Werror=format-security -gdwarf-4 -fno-debug-types-section -fvar-tracking-assignments -g2 -Wp,-D_FORTIFY_SOURCE=2 -fstack-protector-strong --param=ssp-buffer-size=4 -fPIC -mtune=generic -march=x86-64 -gdwarf-4 -fno-debug-types-section -fvar-tracking-assignments -g2 -pthread  -MD -MQ 'systemd-resolved@exe/src_resolve_resolved-dns-transaction.c.o' -MF 'systemd-resolved@exe/src_resolve_resolved-dns-transaction.c.o.d' -o 'systemd-resolved@exe/src_resolve_resolved-dns-transaction.c.o' -c ../src/resolve/resolved-dns-transaction.c
[895/1834] x86_64-pld-linux-gnux32-gcc -Isystemd-resolved@exe -I. -I.. -Isrc/basic -I../src/basic -Isrc/shared -I../src/shared -Isrc/systemd -I../src/systemd -Isrc/journal -I../src/journal -Isrc/resolve -I../src/resolve -Isrc/timesync -I../src/timesync -Isrc/login -I../src/login -Isrc/udev -I../src/udev -Isrc/libudev -I../src/libudev -Isrc/core -I../src/core -I../src/libsystemd/sd-bus -I../src/libsystemd/sd-device -I../src/libsystemd/sd-hwdb -I../src/libsystemd/sd-id128 -I../src/libsystemd/sd-netlink -I../src/libsystemd/sd-network -Isrc/libsystemd-network -I../src/libsystemd-network -I../ -fdiagnostics-color=always -pipe -D_FILE_OFFSET_BITS=64 -std=gnu99 -Wextra -Werror=undef -Wlogical-op -Wmissing-include-dirs -Wold-style-definition -Wpointer-arith -Winit-self -Wdeclaration-after-statement -Wfloat-equal -Wsuggest-attribute=noreturn -Werror=missing-prototypes -Werror=implicit-function-declaration -Werror=missing-declarations -Werror=return-type -Werror=incompatible-pointer-types -Werror=format=2 -Wstrict-prototypes -Wredundant-decls -Wmissing-noreturn -Wshadow -Wendif-labels -Wstrict-aliasing=2 -Wwrite-strings -Werror=overflow -Wdate-time -Wnested-externs -ffast-math -fno-common -fdiagnostics-show-option -fno-strict-aliasing -fvisibility=hidden -fstack-protector -fstack-protector-strong -fPIE --param=ssp-buffer-size=4 -Wno-unused-parameter -Wno-missing-field-initializers -Wno-unused-result -Wno-format-signedness -Wno-error=nonnull -Werror=shadow -ffunction-sections -fdata-sections -include config.h -O2 -fwrapv -Wformat -Werror=format-security -gdwarf-4 -fno-debug-types-section -fvar-tracking-assignments -g2 -Wp,-D_FORTIFY_SOURCE=2 -fstack-protector-strong --param=ssp-buffer-size=4 -fPIC -mtune=generic -march=x86-64 -gdwarf-4 -fno-debug-types-section -fvar-tracking-assignments -g2 -pthread  -MD -MQ 'systemd-resolved@exe/src_resolve_resolved-etc-hosts.c.o' -MF 'systemd-resolved@exe/src_resolve_resolved-etc-hosts.c.o.d' -o 'systemd-resolved@exe/src_resolve_resolved-etc-hosts.c.o' -c ../src/resolve/resolved-etc-hosts.c
[896/1834] x86_64-pld-linux-gnux32-gcc -Isystemd-resolve@exe -I. -I.. -Isrc/basic -I../src/basic -Isrc/shared -I../src/shared -Isrc/systemd -I../src/systemd -Isrc/journal -I../src/journal -Isrc/resolve -I../src/resolve -Isrc/timesync -I../src/timesync -Isrc/login -I../src/login -Isrc/udev -I../src/udev -Isrc/libudev -I../src/libudev -Isrc/core -I../src/core -I../src/libsystemd/sd-bus -I../src/libsystemd/sd-device -I../src/libsystemd/sd-hwdb -I../src/libsystemd/sd-id128 -I../src/libsystemd/sd-netlink -I../src/libsystemd/sd-network -Isrc/libsystemd-network -I../src/libsystemd-network -I../ -fdiagnostics-color=always -pipe -D_FILE_OFFSET_BITS=64 -std=gnu99 -Wextra -Werror=undef -Wlogical-op -Wmissing-include-dirs -Wold-style-definition -Wpointer-arith -Winit-self -Wdeclaration-after-statement -Wfloat-equal -Wsuggest-attribute=noreturn -Werror=missing-prototypes -Werror=implicit-function-declaration -Werror=missing-declarations -Werror=return-type -Werror=incompatible-pointer-types -Werror=format=2 -Wstrict-prototypes -Wredundant-decls -Wmissing-noreturn -Wshadow -Wendif-labels -Wstrict-aliasing=2 -Wwrite-strings -Werror=overflow -Wdate-time -Wnested-externs -ffast-math -fno-common -fdiagnostics-show-option -fno-strict-aliasing -fvisibility=hidden -fstack-protector -fstack-protector-strong -fPIE --param=ssp-buffer-size=4 -Wno-unused-parameter -Wno-missing-field-initializers -Wno-unused-result -Wno-format-signedness -Wno-error=nonnull -Werror=shadow -ffunction-sections -fdata-sections -include config.h -O2 -fwrapv -Wformat -Werror=format-security -gdwarf-4 -fno-debug-types-section -fvar-tracking-assignments -g2 -Wp,-D_FORTIFY_SOURCE=2 -fstack-protector-strong --param=ssp-buffer-size=4 -fPIC -mtune=generic -march=x86-64 -gdwarf-4 -fno-debug-types-section -fvar-tracking-assignments -g2 -pthread  -MD -MQ 'systemd-resolve@exe/src_resolve_dns-type.c.o' -MF 'systemd-resolve@exe/src_resolve_dns-type.c.o.d' -o 'systemd-resolve@exe/src_resolve_dns-type.c.o' -c ../src/resolve/dns-type.c
[897/1834] x86_64-pld-linux-gnux32-gcc -Isystemd-resolved@exe -I. -I.. -Isrc/basic -I../src/basic -Isrc/shared -I../src/shared -Isrc/systemd -I../src/systemd -Isrc/journal -I../src/journal -Isrc/resolve -I../src/resolve -Isrc/timesync -I../src/timesync -Isrc/login -I../src/login -Isrc/udev -I../src/udev -Isrc/libudev -I../src/libudev -Isrc/core -I../src/core -I../src/libsystemd/sd-bus -I../src/libsystemd/sd-device -I../src/libsystemd/sd-hwdb -I../src/libsystemd/sd-id128 -I../src/libsystemd/sd-netlink -I../src/libsystemd/sd-network -Isrc/libsystemd-network -I../src/libsystemd-network -I../ -fdiagnostics-color=always -pipe -D_FILE_OFFSET_BITS=64 -std=gnu99 -Wextra -Werror=undef -Wlogical-op -Wmissing-include-dirs -Wold-style-definition -Wpointer-arith -Winit-self -Wdeclaration-after-statement -Wfloat-equal -Wsuggest-attribute=noreturn -Werror=missing-prototypes -Werror=implicit-function-declaration -Werror=missing-declarations -Werror=return-type -Werror=incompatible-pointer-types -Werror=format=2 -Wstrict-prototypes -Wredundant-decls -Wmissing-noreturn -Wshadow -Wendif-labels -Wstrict-aliasing=2 -Wwrite-strings -Werror=overflow -Wdate-time -Wnested-externs -ffast-math -fno-common -fdiagnostics-show-option -fno-strict-aliasing -fvisibility=hidden -fstack-protector -fstack-protector-strong -fPIE --param=ssp-buffer-size=4 -Wno-unused-parameter -Wno-missing-field-initializers -Wno-unused-result -Wno-format-signedness -Wno-error=nonnull -Werror=shadow -ffunction-sections -fdata-sections -include config.h -O2 -fwrapv -Wformat -Werror=format-security -gdwarf-4 -fno-debug-types-section -fvar-tracking-assignments -g2 -Wp,-D_FORTIFY_SOURCE=2 -fstack-protector-strong --param=ssp-buffer-size=4 -fPIC -mtune=generic -march=x86-64 -gdwarf-4 -fno-debug-types-section -fvar-tracking-assignments -g2 -pthread  -MD -MQ 'systemd-resolved@exe/src_shared_gcrypt-util.c.o' -MF 'systemd-resolved@exe/src_shared_gcrypt-util.c.o.d' -o 'systemd-resolved@exe/src_shared_gcrypt-util.c.o' -c ../src/shared/gcrypt-util.c
[898/1834] x86_64-pld-linux-gnux32-gcc -Isystemd-resolved@exe -I. -I.. -Isrc/basic -I../src/basic -Isrc/shared -I../src/shared -Isrc/systemd -I../src/systemd -Isrc/journal -I../src/journal -Isrc/resolve -I../src/resolve -Isrc/timesync -I../src/timesync -Isrc/login -I../src/login -Isrc/udev -I../src/udev -Isrc/libudev -I../src/libudev -Isrc/core -I../src/core -I../src/libsystemd/sd-bus -I../src/libsystemd/sd-device -I../src/libsystemd/sd-hwdb -I../src/libsystemd/sd-id128 -I../src/libsystemd/sd-netlink -I../src/libsystemd/sd-network -Isrc/libsystemd-network -I../src/libsystemd-network -I../ -fdiagnostics-color=always -pipe -D_FILE_OFFSET_BITS=64 -std=gnu99 -Wextra -Werror=undef -Wlogical-op -Wmissing-include-dirs -Wold-style-definition -Wpointer-arith -Winit-self -Wdeclaration-after-statement -Wfloat-equal -Wsuggest-attribute=noreturn -Werror=missing-prototypes -Werror=implicit-function-declaration -Werror=missing-declarations -Werror=return-type -Werror=incompatible-pointer-types -Werror=format=2 -Wstrict-prototypes -Wredundant-decls -Wmissing-noreturn -Wshadow -Wendif-labels -Wstrict-aliasing=2 -Wwrite-strings -Werror=overflow -Wdate-time -Wnested-externs -ffast-math -fno-common -fdiagnostics-show-option -fno-strict-aliasing -fvisibility=hidden -fstack-protector -fstack-protector-strong -fPIE --param=ssp-buffer-size=4 -Wno-unused-parameter -Wno-missing-field-initializers -Wno-unused-result -Wno-format-signedness -Wno-error=nonnull -Werror=shadow -ffunction-sections -fdata-sections -include config.h -O2 -fwrapv -Wformat -Werror=format-security -gdwarf-4 -fno-debug-types-section -fvar-tracking-assignments -g2 -Wp,-D_FORTIFY_SOURCE=2 -fstack-protector-strong --param=ssp-buffer-size=4 -fPIC -mtune=generic -march=x86-64 -gdwarf-4 -fno-debug-types-section -fvar-tracking-assignments -g2 -pthread  -MD -MQ 'systemd-resolved@exe/src_resolve_resolved-dns-trust-anchor.c.o' -MF 'systemd-resolved@exe/src_resolve_resolved-dns-trust-anchor.c.o.d' -o 'systemd-resolved@exe/src_resolve_resolved-dns-trust-anchor.c.o' -c ../src/resolve/resolved-dns-trust-anchor.c
[899/1834] x86_64-pld-linux-gnux32-gcc -Isystemd-resolve@exe -I. -I.. -Isrc/basic -I../src/basic -Isrc/shared -I../src/shared -Isrc/systemd -I../src/systemd -Isrc/journal -I../src/journal -Isrc/resolve -I../src/resolve -Isrc/timesync -I../src/timesync -Isrc/login -I../src/login -Isrc/udev -I../src/udev -Isrc/libudev -I../src/libudev -Isrc/core -I../src/core -I../src/libsystemd/sd-bus -I../src/libsystemd/sd-device -I../src/libsystemd/sd-hwdb -I../src/libsystemd/sd-id128 -I../src/libsystemd/sd-netlink -I../src/libsystemd/sd-network -Isrc/libsystemd-network -I../src/libsystemd-network -I../ -fdiagnostics-color=always -pipe -D_FILE_OFFSET_BITS=64 -std=gnu99 -Wextra -Werror=undef -Wlogical-op -Wmissing-include-dirs -Wold-style-definition -Wpointer-arith -Winit-self -Wdeclaration-after-statement -Wfloat-equal -Wsuggest-attribute=noreturn -Werror=missing-prototypes -Werror=implicit-function-declaration -Werror=missing-declarations -Werror=return-type -Werror=incompatible-pointer-types -Werror=format=2 -Wstrict-prototypes -Wredundant-decls -Wmissing-noreturn -Wshadow -Wendif-labels -Wstrict-aliasing=2 -Wwrite-strings -Werror=overflow -Wdate-time -Wnested-externs -ffast-math -fno-common -fdiagnostics-show-option -fno-strict-aliasing -fvisibility=hidden -fstack-protector -fstack-protector-strong -fPIE --param=ssp-buffer-size=4 -Wno-unused-parameter -Wno-missing-field-initializers -Wno-unused-result -Wno-format-signedness -Wno-error=nonnull -Werror=shadow -ffunction-sections -fdata-sections -include config.h -O2 -fwrapv -Wformat -Werror=format-security -gdwarf-4 -fno-debug-types-section -fvar-tracking-assignments -g2 -Wp,-D_FORTIFY_SOURCE=2 -fstack-protector-strong --param=ssp-buffer-size=4 -fPIC -mtune=generic -march=x86-64 -gdwarf-4 -fno-debug-types-section -fvar-tracking-assignments -g2 -pthread  -MD -MQ 'systemd-resolve@exe/src_shared_gcrypt-util.c.o' -MF 'systemd-resolve@exe/src_shared_gcrypt-util.c.o.d' -o 'systemd-resolve@exe/src_shared_gcrypt-util.c.o' -c ../src/shared/gcrypt-util.c
[900/1834] x86_64-pld-linux-gnux32-gcc -Isystemd-resolve@exe -I. -I.. -Isrc/basic -I../src/basic -Isrc/shared -I../src/shared -Isrc/systemd -I../src/systemd -Isrc/journal -I../src/journal -Isrc/resolve -I../src/resolve -Isrc/timesync -I../src/timesync -Isrc/login -I../src/login -Isrc/udev -I../src/udev -Isrc/libudev -I../src/libudev -Isrc/core -I../src/core -I../src/libsystemd/sd-bus -I../src/libsystemd/sd-device -I../src/libsystemd/sd-hwdb -I../src/libsystemd/sd-id128 -I../src/libsystemd/sd-netlink -I../src/libsystemd/sd-network -Isrc/libsystemd-network -I../src/libsystemd-network -I../ -fdiagnostics-color=always -pipe -D_FILE_OFFSET_BITS=64 -std=gnu99 -Wextra -Werror=undef -Wlogical-op -Wmissing-include-dirs -Wold-style-definition -Wpointer-arith -Winit-self -Wdeclaration-after-statement -Wfloat-equal -Wsuggest-attribute=noreturn -Werror=missing-prototypes -Werror=implicit-function-declaration -Werror=missing-declarations -Werror=return-type -Werror=incompatible-pointer-types -Werror=format=2 -Wstrict-prototypes -Wredundant-decls -Wmissing-noreturn -Wshadow -Wendif-labels -Wstrict-aliasing=2 -Wwrite-strings -Werror=overflow -Wdate-time -Wnested-externs -ffast-math -fno-common -fdiagnostics-show-option -fno-strict-aliasing -fvisibility=hidden -fstack-protector -fstack-protector-strong -fPIE --param=ssp-buffer-size=4 -Wno-unused-parameter -Wno-missing-field-initializers -Wno-unused-result -Wno-format-signedness -Wno-error=nonnull -Werror=shadow -ffunction-sections -fdata-sections -include config.h -O2 -fwrapv -Wformat -Werror=format-security -gdwarf-4 -fno-debug-types-section -fvar-tracking-assignments -g2 -Wp,-D_FORTIFY_SOURCE=2 -fstack-protector-strong --param=ssp-buffer-size=4 -fPIC -mtune=generic -march=x86-64 -gdwarf-4 -fno-debug-types-section -fvar-tracking-assignments -g2 -pthread  -MD -MQ 'systemd-resolve@exe/src_resolve_resolved-dns-question.c.o' -MF 'systemd-resolve@exe/src_resolve_resolved-dns-question.c.o.d' -o 'systemd-resolve@exe/src_resolve_resolved-dns-question.c.o' -c ../src/resolve/resolved-dns-question.c
[901/1834] x86_64-pld-linux-gnux32-gcc -Isystemd-user-sessions@exe -I. -I.. -Isrc/basic -I../src/basic -Isrc/shared -I../src/shared -Isrc/systemd -I../src/systemd -Isrc/journal -I../src/journal -Isrc/resolve -I../src/resolve -Isrc/timesync -I../src/timesync -Isrc/login -I../src/login -Isrc/udev -I../src/udev -Isrc/libudev -I../src/libudev -Isrc/core -I../src/core -I../src/libsystemd/sd-bus -I../src/libsystemd/sd-device -I../src/libsystemd/sd-hwdb -I../src/libsystemd/sd-id128 -I../src/libsystemd/sd-netlink -I../src/libsystemd/sd-network -Isrc/libsystemd-network -I../src/libsystemd-network -I../ -fdiagnostics-color=always -pipe -D_FILE_OFFSET_BITS=64 -std=gnu99 -Wextra -Werror=undef -Wlogical-op -Wmissing-include-dirs -Wold-style-definition -Wpointer-arith -Winit-self -Wdeclaration-after-statement -Wfloat-equal -Wsuggest-attribute=noreturn -Werror=missing-prototypes -Werror=implicit-function-declaration -Werror=missing-declarations -Werror=return-type -Werror=incompatible-pointer-types -Werror=format=2 -Wstrict-prototypes -Wredundant-decls -Wmissing-noreturn -Wshadow -Wendif-labels -Wstrict-aliasing=2 -Wwrite-strings -Werror=overflow -Wdate-time -Wnested-externs -ffast-math -fno-common -fdiagnostics-show-option -fno-strict-aliasing -fvisibility=hidden -fstack-protector -fstack-protector-strong -fPIE --param=ssp-buffer-size=4 -Wno-unused-parameter -Wno-missing-field-initializers -Wno-unused-result -Wno-format-signedness -Wno-error=nonnull -Werror=shadow -ffunction-sections -fdata-sections -include config.h -O2 -fwrapv -Wformat -Werror=format-security -gdwarf-4 -fno-debug-types-section -fvar-tracking-assignments -g2 -Wp,-D_FORTIFY_SOURCE=2 -fstack-protector-strong --param=ssp-buffer-size=4 -fPIC -mtune=generic -march=x86-64 -gdwarf-4 -fno-debug-types-section -fvar-tracking-assignments -g2  -MD -MQ 'systemd-user-sessions@exe/src_user-sessions_user-sessions.c.o' -MF 'systemd-user-sessions@exe/src_user-sessions_user-sessions.c.o.d' -o 'systemd-user-sessions@exe/src_user-sessions_user-sessions.c.o' -c ../src/user-sessions/user-sessions.c
[902/1834] x86_64-pld-linux-gnux32-gcc -Isystemd-logind@exe -I. -I.. -Isrc/basic -I../src/basic -Isrc/shared -I../src/shared -Isrc/systemd -I../src/systemd -Isrc/journal -I../src/journal -Isrc/resolve -I../src/resolve -Isrc/timesync -I../src/timesync -Isrc/login -I../src/login -Isrc/udev -I../src/udev -Isrc/libudev -I../src/libudev -Isrc/core -I../src/core -I../src/libsystemd/sd-bus -I../src/libsystemd/sd-device -I../src/libsystemd/sd-hwdb -I../src/libsystemd/sd-id128 -I../src/libsystemd/sd-netlink -I../src/libsystemd/sd-network -Isrc/libsystemd-network -I../src/libsystemd-network -I../ -fdiagnostics-color=always -pipe -D_FILE_OFFSET_BITS=64 -std=gnu99 -Wextra -Werror=undef -Wlogical-op -Wmissing-include-dirs -Wold-style-definition -Wpointer-arith -Winit-self -Wdeclaration-after-statement -Wfloat-equal -Wsuggest-attribute=noreturn -Werror=missing-prototypes -Werror=implicit-function-declaration -Werror=missing-declarations -Werror=return-type -Werror=incompatible-pointer-types -Werror=format=2 -Wstrict-prototypes -Wredundant-decls -Wmissing-noreturn -Wshadow -Wendif-labels -Wstrict-aliasing=2 -Wwrite-strings -Werror=overflow -Wdate-time -Wnested-externs -ffast-math -fno-common -fdiagnostics-show-option -fno-strict-aliasing -fvisibility=hidden -fstack-protector -fstack-protector-strong -fPIE --param=ssp-buffer-size=4 -Wno-unused-parameter -Wno-missing-field-initializers -Wno-unused-result -Wno-format-signedness -Wno-error=nonnull -Werror=shadow -ffunction-sections -fdata-sections -include config.h -O2 -fwrapv -Wformat -Werror=format-security -gdwarf-4 -fno-debug-types-section -fvar-tracking-assignments -g2 -Wp,-D_FORTIFY_SOURCE=2 -fstack-protector-strong --param=ssp-buffer-size=4 -fPIC -mtune=generic -march=x86-64 -gdwarf-4 -fno-debug-types-section -fvar-tracking-assignments -g2 -pthread  -MD -MQ 'systemd-logind@exe/meson-generated_.._src_login_logind-gperf.c.o' -MF 'systemd-logind@exe/meson-generated_.._src_login_logind-gperf.c.o.d' -o 'systemd-logind@exe/meson-generated_.._src_login_logind-gperf.c.o' -c src/login/logind-gperf.c
[903/1834] x86_64-pld-linux-gnux32-gcc -Isystemd-inhibit@exe -I. -I.. -Isrc/basic -I../src/basic -Isrc/shared -I../src/shared -Isrc/systemd -I../src/systemd -Isrc/journal -I../src/journal -Isrc/resolve -I../src/resolve -Isrc/timesync -I../src/timesync -Isrc/login -I../src/login -Isrc/udev -I../src/udev -Isrc/libudev -I../src/libudev -Isrc/core -I../src/core -I../src/libsystemd/sd-bus -I../src/libsystemd/sd-device -I../src/libsystemd/sd-hwdb -I../src/libsystemd/sd-id128 -I../src/libsystemd/sd-netlink -I../src/libsystemd/sd-network -Isrc/libsystemd-network -I../src/libsystemd-network -I../ -fdiagnostics-color=always -pipe -D_FILE_OFFSET_BITS=64 -std=gnu99 -Wextra -Werror=undef -Wlogical-op -Wmissing-include-dirs -Wold-style-definition -Wpointer-arith -Winit-self -Wdeclaration-after-statement -Wfloat-equal -Wsuggest-attribute=noreturn -Werror=missing-prototypes -Werror=implicit-function-declaration -Werror=missing-declarations -Werror=return-type -Werror=incompatible-pointer-types -Werror=format=2 -Wstrict-prototypes -Wredundant-decls -Wmissing-noreturn -Wshadow -Wendif-labels -Wstrict-aliasing=2 -Wwrite-strings -Werror=overflow -Wdate-time -Wnested-externs -ffast-math -fno-common -fdiagnostics-show-option -fno-strict-aliasing -fvisibility=hidden -fstack-protector -fstack-protector-strong -fPIE --param=ssp-buffer-size=4 -Wno-unused-parameter -Wno-missing-field-initializers -Wno-unused-result -Wno-format-signedness -Wno-error=nonnull -Werror=shadow -ffunction-sections -fdata-sections -include config.h -O2 -fwrapv -Wformat -Werror=format-security -gdwarf-4 -fno-debug-types-section -fvar-tracking-assignments -g2 -Wp,-D_FORTIFY_SOURCE=2 -fstack-protector-strong --param=ssp-buffer-size=4 -fPIC -mtune=generic -march=x86-64 -gdwarf-4 -fno-debug-types-section -fvar-tracking-assignments -g2  -MD -MQ 'systemd-inhibit@exe/src_login_inhibit.c.o' -MF 'systemd-inhibit@exe/src_login_inhibit.c.o.d' -o 'systemd-inhibit@exe/src_login_inhibit.c.o' -c ../src/login/inhibit.c
[904/1834] x86_64-pld-linux-gnux32-gcc  -o systemd-resolved 'systemd-resolved@exe/meson-generated_.._src_resolve_resolved-gperf.c.o' 'systemd-resolved@exe/src_resolve_resolved-dns-dnssec.c.o' 'systemd-resolved@exe/src_resolve_resolved-dns-packet.c.o' 'systemd-resolved@exe/src_resolve_resolved-dns-rr.c.o' 'systemd-resolved@exe/src_resolve_resolved-dns-answer.c.o' 'systemd-resolved@exe/src_resolve_resolved-dns-question.c.o' 'systemd-resolved@exe/src_resolve_dns-type.c.o' 'systemd-resolved@exe/src_resolve_resolved.c.o' 'systemd-resolved@exe/src_resolve_resolved-manager.c.o' 'systemd-resolved@exe/src_resolve_resolved-conf.c.o' 'systemd-resolved@exe/src_resolve_resolved-resolv-conf.c.o' 'systemd-resolved@exe/src_resolve_resolved-bus.c.o' 'systemd-resolved@exe/src_resolve_resolved-link.c.o' 'systemd-resolved@exe/src_resolve_resolved-link-bus.c.o' 'systemd-resolved@exe/src_resolve_resolved-llmnr.c.o' 'systemd-resolved@exe/src_resolve_resolved-mdns.c.o' 'systemd-resolved@exe/src_resolve_resolved-dns-query.c.o' 'systemd-resolved@exe/src_resolve_resolved-dns-synthesize.c.o' 'systemd-resolved@exe/src_resolve_resolved-dns-transaction.c.o' 'systemd-resolved@exe/src_resolve_resolved-dns-scope.c.o' 'systemd-resolved@exe/src_resolve_resolved-dns-server.c.o' 'systemd-resolved@exe/src_resolve_resolved-dns-search-domain.c.o' 'systemd-resolved@exe/src_resolve_resolved-dns-cache.c.o' 'systemd-resolved@exe/src_resolve_resolved-dns-zone.c.o' 'systemd-resolved@exe/src_resolve_resolved-dns-stream.c.o' 'systemd-resolved@exe/src_resolve_resolved-dns-trust-anchor.c.o' 'systemd-resolved@exe/src_resolve_resolved-dns-stub.c.o' 'systemd-resolved@exe/src_resolve_resolved-etc-hosts.c.o' 'systemd-resolved@exe/src_shared_gcrypt-util.c.o' -Wl,--no-undefined -Wl,--as-needed -Wl,-z,relro -Wl,-z,now -pie -Wl,--gc-sections -O2 -fwrapv -pipe -Wformat -Werror=format-security -gdwarf-4 -fno-debug-types-section -fvar-tracking-assignments -g2 -Wp,-D_FORTIFY_SOURCE=2 -fstack-protector-strong --param=ssp-buffer-size=4 -fPIC -mtune=generic -march=x86-64 -gdwarf-4 -fno-debug-types-section -fvar-tracking-assignments -g2 -Wl,--as-needed -Wl,--no-copy-dt-needed-entries -Wl,-z,relro -Wl,-z,combreloc -Wl,--start-group src/shared/libsystemd-shared-235.so -pthread -lgcrypt -lgpg-error -lm -lidn -Wl,--end-group '-Wl,-rpath,$ORIGIN/src/shared' -Wl,-rpath-link,/tmp/B.snKZS9/BUILD/systemd-235/build/src/shared  
[905/1834] x86_64-pld-linux-gnux32-gcc -Isystemd-resolve@exe -I. -I.. -Isrc/basic -I../src/basic -Isrc/shared -I../src/shared -Isrc/systemd -I../src/systemd -Isrc/journal -I../src/journal -Isrc/resolve -I../src/resolve -Isrc/timesync -I../src/timesync -Isrc/login -I../src/login -Isrc/udev -I../src/udev -Isrc/libudev -I../src/libudev -Isrc/core -I../src/core -I../src/libsystemd/sd-bus -I../src/libsystemd/sd-device -I../src/libsystemd/sd-hwdb -I../src/libsystemd/sd-id128 -I../src/libsystemd/sd-netlink -I../src/libsystemd/sd-network -Isrc/libsystemd-network -I../src/libsystemd-network -I../ -fdiagnostics-color=always -pipe -D_FILE_OFFSET_BITS=64 -std=gnu99 -Wextra -Werror=undef -Wlogical-op -Wmissing-include-dirs -Wold-style-definition -Wpointer-arith -Winit-self -Wdeclaration-after-statement -Wfloat-equal -Wsuggest-attribute=noreturn -Werror=missing-prototypes -Werror=implicit-function-declaration -Werror=missing-declarations -Werror=return-type -Werror=incompatible-pointer-types -Werror=format=2 -Wstrict-prototypes -Wredundant-decls -Wmissing-noreturn -Wshadow -Wendif-labels -Wstrict-aliasing=2 -Wwrite-strings -Werror=overflow -Wdate-time -Wnested-externs -ffast-math -fno-common -fdiagnostics-show-option -fno-strict-aliasing -fvisibility=hidden -fstack-protector -fstack-protector-strong -fPIE --param=ssp-buffer-size=4 -Wno-unused-parameter -Wno-missing-field-initializers -Wno-unused-result -Wno-format-signedness -Wno-error=nonnull -Werror=shadow -ffunction-sections -fdata-sections -include config.h -O2 -fwrapv -Wformat -Werror=format-security -gdwarf-4 -fno-debug-types-section -fvar-tracking-assignments -g2 -Wp,-D_FORTIFY_SOURCE=2 -fstack-protector-strong --param=ssp-buffer-size=4 -fPIC -mtune=generic -march=x86-64 -gdwarf-4 -fno-debug-types-section -fvar-tracking-assignments -g2 -pthread  -MD -MQ 'systemd-resolve@exe/src_resolve_resolved-dns-rr.c.o' -MF 'systemd-resolve@exe/src_resolve_resolved-dns-rr.c.o.d' -o 'systemd-resolve@exe/src_resolve_resolved-dns-rr.c.o' -c ../src/resolve/resolved-dns-rr.c
[906/1834] x86_64-pld-linux-gnux32-gcc -Isystemd-resolve@exe -I. -I.. -Isrc/basic -I../src/basic -Isrc/shared -I../src/shared -Isrc/systemd -I../src/systemd -Isrc/journal -I../src/journal -Isrc/resolve -I../src/resolve -Isrc/timesync -I../src/timesync -Isrc/login -I../src/login -Isrc/udev -I../src/udev -Isrc/libudev -I../src/libudev -Isrc/core -I../src/core -I../src/libsystemd/sd-bus -I../src/libsystemd/sd-device -I../src/libsystemd/sd-hwdb -I../src/libsystemd/sd-id128 -I../src/libsystemd/sd-netlink -I../src/libsystemd/sd-network -Isrc/libsystemd-network -I../src/libsystemd-network -I../ -fdiagnostics-color=always -pipe -D_FILE_OFFSET_BITS=64 -std=gnu99 -Wextra -Werror=undef -Wlogical-op -Wmissing-include-dirs -Wold-style-definition -Wpointer-arith -Winit-self -Wdeclaration-after-statement -Wfloat-equal -Wsuggest-attribute=noreturn -Werror=missing-prototypes -Werror=implicit-function-declaration -Werror=missing-declarations -Werror=return-type -Werror=incompatible-pointer-types -Werror=format=2 -Wstrict-prototypes -Wredundant-decls -Wmissing-noreturn -Wshadow -Wendif-labels -Wstrict-aliasing=2 -Wwrite-strings -Werror=overflow -Wdate-time -Wnested-externs -ffast-math -fno-common -fdiagnostics-show-option -fno-strict-aliasing -fvisibility=hidden -fstack-protector -fstack-protector-strong -fPIE --param=ssp-buffer-size=4 -Wno-unused-parameter -Wno-missing-field-initializers -Wno-unused-result -Wno-format-signedness -Wno-error=nonnull -Werror=shadow -ffunction-sections -fdata-sections -include config.h -O2 -fwrapv -Wformat -Werror=format-security -gdwarf-4 -fno-debug-types-section -fvar-tracking-assignments -g2 -Wp,-D_FORTIFY_SOURCE=2 -fstack-protector-strong --param=ssp-buffer-size=4 -fPIC -mtune=generic -march=x86-64 -gdwarf-4 -fno-debug-types-section -fvar-tracking-assignments -g2 -pthread  -MD -MQ 'systemd-resolve@exe/src_resolve_resolved-dns-dnssec.c.o' -MF 'systemd-resolve@exe/src_resolve_resolved-dns-dnssec.c.o.d' -o 'systemd-resolve@exe/src_resolve_resolved-dns-dnssec.c.o' -c ../src/resolve/resolved-dns-dnssec.c
[907/1834] x86_64-pld-linux-gnux32-gcc -Isystemd-resolve@exe -I. -I.. -Isrc/basic -I../src/basic -Isrc/shared -I../src/shared -Isrc/systemd -I../src/systemd -Isrc/journal -I../src/journal -Isrc/resolve -I../src/resolve -Isrc/timesync -I../src/timesync -Isrc/login -I../src/login -Isrc/udev -I../src/udev -Isrc/libudev -I../src/libudev -Isrc/core -I../src/core -I../src/libsystemd/sd-bus -I../src/libsystemd/sd-device -I../src/libsystemd/sd-hwdb -I../src/libsystemd/sd-id128 -I../src/libsystemd/sd-netlink -I../src/libsystemd/sd-network -Isrc/libsystemd-network -I../src/libsystemd-network -I../ -fdiagnostics-color=always -pipe -D_FILE_OFFSET_BITS=64 -std=gnu99 -Wextra -Werror=undef -Wlogical-op -Wmissing-include-dirs -Wold-style-definition -Wpointer-arith -Winit-self -Wdeclaration-after-statement -Wfloat-equal -Wsuggest-attribute=noreturn -Werror=missing-prototypes -Werror=implicit-function-declaration -Werror=missing-declarations -Werror=return-type -Werror=incompatible-pointer-types -Werror=format=2 -Wstrict-prototypes -Wredundant-decls -Wmissing-noreturn -Wshadow -Wendif-labels -Wstrict-aliasing=2 -Wwrite-strings -Werror=overflow -Wdate-time -Wnested-externs -ffast-math -fno-common -fdiagnostics-show-option -fno-strict-aliasing -fvisibility=hidden -fstack-protector -fstack-protector-strong -fPIE --param=ssp-buffer-size=4 -Wno-unused-parameter -Wno-missing-field-initializers -Wno-unused-result -Wno-format-signedness -Wno-error=nonnull -Werror=shadow -ffunction-sections -fdata-sections -include config.h -O2 -fwrapv -Wformat -Werror=format-security -gdwarf-4 -fno-debug-types-section -fvar-tracking-assignments -g2 -Wp,-D_FORTIFY_SOURCE=2 -fstack-protector-strong --param=ssp-buffer-size=4 -fPIC -mtune=generic -march=x86-64 -gdwarf-4 -fno-debug-types-section -fvar-tracking-assignments -g2 -pthread  -MD -MQ 'systemd-resolve@exe/src_resolve_resolved-dns-packet.c.o' -MF 'systemd-resolve@exe/src_resolve_resolved-dns-packet.c.o.d' -o 'systemd-resolve@exe/src_resolve_resolved-dns-packet.c.o' -c ../src/resolve/resolved-dns-packet.c
[908/1834] x86_64-pld-linux-gnux32-gcc  -o systemd-inhibit 'systemd-inhibit@exe/src_login_inhibit.c.o' -Wl,--no-undefined -Wl,--as-needed -Wl,-z,relro -Wl,-z,now -pie -Wl,--gc-sections -O2 -fwrapv -pipe -Wformat -Werror=format-security -gdwarf-4 -fno-debug-types-section -fvar-tracking-assignments -g2 -Wp,-D_FORTIFY_SOURCE=2 -fstack-protector-strong --param=ssp-buffer-size=4 -fPIC -mtune=generic -march=x86-64 -gdwarf-4 -fno-debug-types-section -fvar-tracking-assignments -g2 -Wl,--as-needed -Wl,--no-copy-dt-needed-entries -Wl,-z,relro -Wl,-z,combreloc -Wl,--start-group src/shared/libsystemd-shared-235.so -Wl,--end-group '-Wl,-rpath,$ORIGIN/src/shared' -Wl,-rpath-link,/tmp/B.snKZS9/BUILD/systemd-235/build/src/shared  
Terminated
ended at: Tue May 15 12:23:48 2018, done in 0:02:17.221869
[909/1834] x86_64-pld-linux-gnux32-gcc -Isystemd-resolve@exe -I. -I.. -Isrc/basic -I../src/basic -Isrc/shared -I../src/shared -Isrc/systemd -I../src/systemd -Isrc/journal -I../src/journal -Isrc/resolve -I../src/resolve -Isrc/timesync -I../src/timesync -Isrc/login -I../src/login -Isrc/udev -I../src/udev -Isrc/libudev -I../src/libudev -Isrc/core -I../src/core -I../src/libsystemd/sd-bus -I../src/libsystemd/sd-device -I../src/libsystemd/sd-hwdb -I../src/libsystemd/sd-id128 -I../src/libsystemd/sd-netlink -I../src/libsystemd/sd-network -Isrc/libsystemd-network -I../src/libsystemd-network -I../ -fdiagnostics-color=always -pipe -D_FILE_OFFSET_BITS=64 -std=gnu99 -Wextra -Werror=undef -Wlogical-op -Wmissing-include-dirs -Wold-style-definition -Wpointer-arith -Winit-self -Wdeclaration-after-statement -Wfloat-equal -Wsuggest-attribute=noreturn -Werror=missing-prototypes -Werror=implicit-function-declaration -Werror=missing-declarations -Werror=return-type -Werror=incompatible-pointer-types -Werror=format=2 -Wstrict-prototypes -Wredundant-decls -Wmissing-noreturn -Wshadow -Wendif-labels -Wstrict-aliasing=2 -Wwrite-strings -Werror=overflow -Wdate-time -Wnested-externs -ffast-math -fno-common -fdiagnostics-show-option -fno-strict-aliasing -fvisibility=hidden -fstack-protector -fstack-protector-strong -fPIE --param=ssp-buffer-size=4 -Wno-unused-parameter -Wno-missing-field-initializers -Wno-unused-result -Wno-format-signedness -Wno-error=nonnull -Werror=shadow -ffunction-sections -fdata-sections -include config.h -O2 -fwrapv -Wformat -Werror=format-security -gdwarf-4 -fno-debug-types-section -fvar-tracking-assignments -g2 -Wp,-D_FORTIFY_SOURCE=2 -fstack-protector-strong --param=ssp-buffer-size=4 -fPIC -mtune=generic -march=x86-64 -gdwarf-4 -fno-debug-types-section -fvar-tracking-assignments -g2 -pthread  -MD -MQ 'systemd-resolve@exe/src_resolve_resolved-dns-answer.c.o' -MF 'systemd-resolve@exe/src_resolve_resolved-dns-answer.c.o.d' -o 'systemd-resolve@exe/src_resolve_resolved-dns-answer.c.o' -c ../src/resolve/resolved-dns-answer.c
[910/1834] x86_64-pld-linux-gnux32-gcc -Iloginctl@exe -I. -I.. -Isrc/basic -I../src/basic -Isrc/shared -I../src/shared -Isrc/systemd -I../src/systemd -Isrc/journal -I../src/journal -Isrc/resolve -I../src/resolve -Isrc/timesync -I../src/timesync -Isrc/login -I../src/login -Isrc/udev -I../src/udev -Isrc/libudev -I../src/libudev -Isrc/core -I../src/core -I../src/libsystemd/sd-bus -I../src/libsystemd/sd-device -I../src/libsystemd/sd-hwdb -I../src/libsystemd/sd-id128 -I../src/libsystemd/sd-netlink -I../src/libsystemd/sd-network -Isrc/libsystemd-network -I../src/libsystemd-network -I../ -I/usr/include/lz4 -fdiagnostics-color=always -pipe -D_FILE_OFFSET_BITS=64 -std=gnu99 -Wextra -Werror=undef -Wlogical-op -Wmissing-include-dirs -Wold-style-definition -Wpointer-arith -Winit-self -Wdeclaration-after-statement -Wfloat-equal -Wsuggest-attribute=noreturn -Werror=missing-prototypes -Werror=implicit-function-declaration -Werror=missing-declarations -Werror=return-type -Werror=incompatible-pointer-types -Werror=format=2 -Wstrict-prototypes -Wredundant-decls -Wmissing-noreturn -Wshadow -Wendif-labels -Wstrict-aliasing=2 -Wwrite-strings -Werror=overflow -Wdate-time -Wnested-externs -ffast-math -fno-common -fdiagnostics-show-option -fno-strict-aliasing -fvisibility=hidden -fstack-protector -fstack-protector-strong -fPIE --param=ssp-buffer-size=4 -Wno-unused-parameter -Wno-missing-field-initializers -Wno-unused-result -Wno-format-signedness -Wno-error=nonnull -Werror=shadow -ffunction-sections -fdata-sections -include config.h -O2 -fwrapv -Wformat -Werror=format-security -gdwarf-4 -fno-debug-types-section -fvar-tracking-assignments -g2 -Wp,-D_FORTIFY_SOURCE=2 -fstack-protector-strong --param=ssp-buffer-size=4 -fPIC -mtune=generic -march=x86-64 -gdwarf-4 -fno-debug-types-section -fvar-tracking-assignments -g2 -pthread  -MD -MQ 'loginctl@exe/src_login_sysfs-show.c.o' -MF 'loginctl@exe/src_login_sysfs-show.c.o.d' -o 'loginctl@exe/src_login_sysfs-show.c.o' -c ../src/login/sysfs-show.c
error: No files produced.
[911/1834] x86_64-pld-linux-gnux32-gcc -Isystemd-logind@exe -I. -I.. -Isrc/basic -I../src/basic -Isrc/shared -I../src/shared -Isrc/systemd -I../src/systemd -Isrc/journal -I../src/journal -Isrc/resolve -I../src/resolve -Isrc/timesync -I../src/timesync -Isrc/login -I../src/login -Isrc/udev -I../src/udev -Isrc/libudev -I../src/libudev -Isrc/core -I../src/core -I../src/libsystemd/sd-bus -I../src/libsystemd/sd-device -I../src/libsystemd/sd-hwdb -I../src/libsystemd/sd-id128 -I../src/libsystemd/sd-netlink -I../src/libsystemd/sd-network -Isrc/libsystemd-network -I../src/libsystemd-network -I../ -fdiagnostics-color=always -pipe -D_FILE_OFFSET_BITS=64 -std=gnu99 -Wextra -Werror=undef -Wlogical-op -Wmissing-include-dirs -Wold-style-definition -Wpointer-arith -Winit-self -Wdeclaration-after-statement -Wfloat-equal -Wsuggest-attribute=noreturn -Werror=missing-prototypes -Werror=implicit-function-declaration -Werror=missing-declarations -Werror=return-type -Werror=incompatible-pointer-types -Werror=format=2 -Wstrict-prototypes -Wredundant-decls -Wmissing-noreturn -Wshadow -Wendif-labels -Wstrict-aliasing=2 -Wwrite-strings -Werror=overflow -Wdate-time -Wnested-externs -ffast-math -fno-common -fdiagnostics-show-option -fno-strict-aliasing -fvisibility=hidden -fstack-protector -fstack-protector-strong -fPIE --param=ssp-buffer-size=4 -Wno-unused-parameter -Wno-missing-field-initializers -Wno-unused-result -Wno-format-signedness -Wno-error=nonnull -Werror=shadow -ffunction-sections -fdata-sections -include config.h -O2 -fwrapv -Wformat -Werror=format-security -gdwarf-4 -fno-debug-types-section -fvar-tracking-assignments -g2 -Wp,-D_FORTIFY_SOURCE=2 -fstack-protector-strong --param=ssp-buffer-size=4 -fPIC -mtune=generic -march=x86-64 -gdwarf-4 -fno-debug-types-section -fvar-tracking-assignments -g2 -pthread  -MD -MQ 'systemd-logind@exe/src_login_logind.c.o' -MF 'systemd-logind@exe/src_login_logind.c.o.d' -o 'systemd-logind@exe/src_login_logind.c.o' -c ../src/login/logind.c
[912/1834] x86_64-pld-linux-gnux32-gcc  -o systemd-user-sessions 'systemd-user-sessions@exe/src_user-sessions_user-sessions.c.o' -Wl,--no-undefined -Wl,--as-needed -Wl,-z,relro -Wl,-z,now -pie -Wl,--gc-sections -O2 -fwrapv -pipe -Wformat -Werror=format-security -gdwarf-4 -fno-debug-types-section -fvar-tracking-assignments -g2 -Wp,-D_FORTIFY_SOURCE=2 -fstack-protector-strong --param=ssp-buffer-size=4 -fPIC -mtune=generic -march=x86-64 -gdwarf-4 -fno-debug-types-section -fvar-tracking-assignments -g2 -Wl,--as-needed -Wl,--no-copy-dt-needed-entries -Wl,-z,relro -Wl,-z,combreloc -Wl,--start-group src/shared/libsystemd-shared-235.so -Wl,--end-group '-Wl,-rpath,$ORIGIN/src/shared' -Wl,-rpath-link,/tmp/B.snKZS9/BUILD/systemd-235/build/src/shared  
[913/1834] x86_64-pld-linux-gnux32-gcc -Ipam_systemd@sha -I. -I.. -Isrc/basic -I../src/basic -Isrc/shared -I../src/shared -Isrc/systemd -I../src/systemd -Isrc/journal -I../src/journal -Isrc/resolve -I../src/resolve -Isrc/timesync -I../src/timesync -Isrc/login -I../src/login -Isrc/udev -I../src/udev -Isrc/libudev -I../src/libudev -Isrc/core -I../src/core -I../src/libsystemd/sd-bus -I../src/libsystemd/sd-device -I../src/libsystemd/sd-hwdb -I../src/libsystemd/sd-id128 -I../src/libsystemd/sd-netlink -I../src/libsystemd/sd-network -Isrc/libsystemd-network -I../src/libsystemd-network -I../ -fdiagnostics-color=always -pipe -D_FILE_OFFSET_BITS=64 -std=gnu99 -Wextra -Werror=undef -Wlogical-op -Wmissing-include-dirs -Wold-style-definition -Wpointer-arith -Winit-self -Wdeclaration-after-statement -Wfloat-equal -Wsuggest-attribute=noreturn -Werror=missing-prototypes -Werror=implicit-function-declaration -Werror=missing-declarations -Werror=return-type -Werror=incompatible-pointer-types -Werror=format=2 -Wstrict-prototypes -Wredundant-decls -Wmissing-noreturn -Wshadow -Wendif-labels -Wstrict-aliasing=2 -Wwrite-strings -Werror=overflow -Wdate-time -Wnested-externs -ffast-math -fno-common -fdiagnostics-show-option -fno-strict-aliasing -fvisibility=hidden -fstack-protector -fstack-protector-strong -fPIE --param=ssp-buffer-size=4 -Wno-unused-parameter -Wno-missing-field-initializers -Wno-unused-result -Wno-format-signedness -Wno-error=nonnull -Werror=shadow -ffunction-sections -fdata-sections -include config.h -O2 -fwrapv -Wformat -Werror=format-security -gdwarf-4 -fno-debug-types-section -fvar-tracking-assignments -g2 -Wp,-D_FORTIFY_SOURCE=2 -fstack-protector-strong --param=ssp-buffer-size=4 -fPIC -mtune=generic -march=x86-64 -gdwarf-4 -fno-debug-types-section -fvar-tracking-assignments -g2 -fPIC -pthread  -MD -MQ 'pam_systemd@sha/src_login_pam_systemd.c.o' -MF 'pam_systemd@sha/src_login_pam_systemd.c.o.d' -o 'pam_systemd@sha/src_login_pam_systemd.c.o' -c ../src/login/pam_systemd.c
[914/1834] x86_64-pld-linux-gnux32-gcc -Isystemd-system-update-generator@exe -I. -I.. -Isrc/basic -I../src/basic -Isrc/shared -I../src/shared -Isrc/systemd -I../src/systemd -Isrc/journal -I../src/journal -Isrc/resolve -I../src/resolve -Isrc/timesync -I../src/timesync -Isrc/login -I../src/login -Isrc/udev -I../src/udev -Isrc/libudev -I../src/libudev -Isrc/core -I../src/core -I../src/libsystemd/sd-bus -I../src/libsystemd/sd-device -I../src/libsystemd/sd-hwdb -I../src/libsystemd/sd-id128 -I../src/libsystemd/sd-netlink -I../src/libsystemd/sd-network -Isrc/libsystemd-network -I../src/libsystemd-network -I../ -fdiagnostics-color=always -pipe -D_FILE_OFFSET_BITS=64 -std=gnu99 -Wextra -Werror=undef -Wlogical-op -Wmissing-include-dirs -Wold-style-definition -Wpointer-arith -Winit-self -Wdeclaration-after-statement -Wfloat-equal -Wsuggest-attribute=noreturn -Werror=missing-prototypes -Werror=implicit-function-declaration -Werror=missing-declarations -Werror=return-type -Werror=incompatible-pointer-types -Werror=format=2 -Wstrict-prototypes -Wredundant-decls -Wmissing-noreturn -Wshadow -Wendif-labels -Wstrict-aliasing=2 -Wwrite-strings -Werror=overflow -Wdate-time -Wnested-externs -ffast-math -fno-common -fdiagnostics-show-option -fno-strict-aliasing -fvisibility=hidden -fstack-protector -fstack-protector-strong -fPIE --param=ssp-buffer-size=4 -Wno-unused-parameter -Wno-missing-field-initializers -Wno-unused-result -Wno-format-signedness -Wno-error=nonnull -Werror=shadow -ffunction-sections -fdata-sections -include config.h -O2 -fwrapv -Wformat -Werror=format-security -gdwarf-4 -fno-debug-types-section -fvar-tracking-assignments -g2 -Wp,-D_FORTIFY_SOURCE=2 -fstack-protector-strong --param=ssp-buffer-size=4 -fPIC -mtune=generic -march=x86-64 -gdwarf-4 -fno-debug-types-section -fvar-tracking-assignments -g2  -MD -MQ 'systemd-system-update-generator@exe/src_system-update-generator_system-update-generator.c.o' -MF 'systemd-system-update-generator@exe/src_system-update-generator_system-update-generator.c.o.d' -o 'systemd-system-update-generator@exe/src_system-update-generator_system-update-generator.c.o' -c ../src/system-update-generator/system-update-generator.c
[915/1834] x86_64-pld-linux-gnux32-gcc -Isystemd-socket-activate@exe -I. -I.. -Isrc/basic -I../src/basic -Isrc/shared -I../src/shared -Isrc/systemd -I../src/systemd -Isrc/journal -I../src/journal -Isrc/resolve -I../src/resolve -Isrc/timesync -I../src/timesync -Isrc/login -I../src/login -Isrc/udev -I../src/udev -Isrc/libudev -I../src/libudev -Isrc/core -I../src/core -I../src/libsystemd/sd-bus -I../src/libsystemd/sd-device -I../src/libsystemd/sd-hwdb -I../src/libsystemd/sd-id128 -I../src/libsystemd/sd-netlink -I../src/libsystemd/sd-network -Isrc/libsystemd-network -I../src/libsystemd-network -I../ -fdiagnostics-color=always -pipe -D_FILE_OFFSET_BITS=64 -std=gnu99 -Wextra -Werror=undef -Wlogical-op -Wmissing-include-dirs -Wold-style-definition -Wpointer-arith -Winit-self -Wdeclaration-after-statement -Wfloat-equal -Wsuggest-attribute=noreturn -Werror=missing-prototypes -Werror=implicit-function-declaration -Werror=missing-declarations -Werror=return-type -Werror=incompatible-pointer-types -Werror=format=2 -Wstrict-prototypes -Wredundant-decls -Wmissing-noreturn -Wshadow -Wendif-labels -Wstrict-aliasing=2 -Wwrite-strings -Werror=overflow -Wdate-time -Wnested-externs -ffast-math -fno-common -fdiagnostics-show-option -fno-strict-aliasing -fvisibility=hidden -fstack-protector -fstack-protector-strong -fPIE --param=ssp-buffer-size=4 -Wno-unused-parameter -Wno-missing-field-initializers -Wno-unused-result -Wno-format-signedness -Wno-error=nonnull -Werror=shadow -ffunction-sections -fdata-sections -include config.h -O2 -fwrapv -Wformat -Werror=format-security -gdwarf-4 -fno-debug-types-section -fvar-tracking-assignments -g2 -Wp,-D_FORTIFY_SOURCE=2 -fstack-protector-strong --param=ssp-buffer-size=4 -fPIC -mtune=generic -march=x86-64 -gdwarf-4 -fno-debug-types-section -fvar-tracking-assignments -g2 -pthread  -MD -MQ 'systemd-socket-activate@exe/src_activate_activate.c.o' -MF 'systemd-socket-activate@exe/src_activate_activate.c.o.d' -o 'systemd-socket-activate@exe/src_activate_activate.c.o' -c ../src/activate/activate.c
[916/1834] x86_64-pld-linux-gnux32-gcc -Isystemd-resolve@exe -I. -I.. -Isrc/basic -I../src/basic -Isrc/shared -I../src/shared -Isrc/systemd -I../src/systemd -Isrc/journal -I../src/journal -Isrc/resolve -I../src/resolve -Isrc/timesync -I../src/timesync -Isrc/login -I../src/login -Isrc/udev -I../src/udev -Isrc/libudev -I../src/libudev -Isrc/core -I../src/core -I../src/libsystemd/sd-bus -I../src/libsystemd/sd-device -I../src/libsystemd/sd-hwdb -I../src/libsystemd/sd-id128 -I../src/libsystemd/sd-netlink -I../src/libsystemd/sd-network -Isrc/libsystemd-network -I../src/libsystemd-network -I../ -fdiagnostics-color=always -pipe -D_FILE_OFFSET_BITS=64 -std=gnu99 -Wextra -Werror=undef -Wlogical-op -Wmissing-include-dirs -Wold-style-definition -Wpointer-arith -Winit-self -Wdeclaration-after-statement -Wfloat-equal -Wsuggest-attribute=noreturn -Werror=missing-prototypes -Werror=implicit-function-declaration -Werror=missing-declarations -Werror=return-type -Werror=incompatible-pointer-types -Werror=format=2 -Wstrict-prototypes -Wredundant-decls -Wmissing-noreturn -Wshadow -Wendif-labels -Wstrict-aliasing=2 -Wwrite-strings -Werror=overflow -Wdate-time -Wnested-externs -ffast-math -fno-common -fdiagnostics-show-option -fno-strict-aliasing -fvisibility=hidden -fstack-protector -fstack-protector-strong -fPIE --param=ssp-buffer-size=4 -Wno-unused-parameter -Wno-missing-field-initializers -Wno-unused-result -Wno-format-signedness -Wno-error=nonnull -Werror=shadow -ffunction-sections -fdata-sections -include config.h -O2 -fwrapv -Wformat -Werror=format-security -gdwarf-4 -fno-debug-types-section -fvar-tracking-assignments -g2 -Wp,-D_FORTIFY_SOURCE=2 -fstack-protector-strong --param=ssp-buffer-size=4 -fPIC -mtune=generic -march=x86-64 -gdwarf-4 -fno-debug-types-section -fvar-tracking-assignments -g2 -pthread  -MD -MQ 'systemd-resolve@exe/src_resolve_resolve-tool.c.o' -MF 'systemd-resolve@exe/src_resolve_resolve-tool.c.o.d' -o 'systemd-resolve@exe/src_resolve_resolve-tool.c.o' -c ../src/resolve/resolve-tool.c
[917/1834] x86_64-pld-linux-gnux32-gcc  -o systemd-logind 'systemd-logind@exe/meson-generated_.._src_login_logind-gperf.c.o' 'systemd-logind@exe/src_login_logind.c.o' -Wl,--no-undefined -Wl,--as-needed -Wl,-z,relro -Wl,-z,now -pie -Wl,--gc-sections -O2 -fwrapv -pipe -Wformat -Werror=format-security -gdwarf-4 -fno-debug-types-section -fvar-tracking-assignments -g2 -Wp,-D_FORTIFY_SOURCE=2 -fstack-protector-strong --param=ssp-buffer-size=4 -fPIC -mtune=generic -march=x86-64 -gdwarf-4 -fno-debug-types-section -fvar-tracking-assignments -g2 -Wl,--as-needed -Wl,--no-copy-dt-needed-entries -Wl,-z,relro -Wl,-z,combreloc -Wl,--start-group src/login/liblogind-core.a src/shared/libsystemd-shared-235.so -pthread -lacl -Wl,--end-group -lacl '-Wl,-rpath,$ORIGIN/src/shared' -Wl,-rpath-link,/tmp/B.snKZS9/BUILD/systemd-235/build/src/shared  
[918/1834] x86_64-pld-linux-gnux32-gcc -Isystemd-backlight@exe -I. -I.. -Isrc/basic -I../src/basic -Isrc/shared -I../src/shared -Isrc/systemd -I../src/systemd -Isrc/journal -I../src/journal -Isrc/resolve -I../src/resolve -Isrc/timesync -I../src/timesync -Isrc/login -I../src/login -Isrc/udev -I../src/udev -Isrc/libudev -I../src/libudev -Isrc/core -I../src/core -I../src/libsystemd/sd-bus -I../src/libsystemd/sd-device -I../src/libsystemd/sd-hwdb -I../src/libsystemd/sd-id128 -I../src/libsystemd/sd-netlink -I../src/libsystemd/sd-network -Isrc/libsystemd-network -I../src/libsystemd-network -I../ -fdiagnostics-color=always -pipe -D_FILE_OFFSET_BITS=64 -std=gnu99 -Wextra -Werror=undef -Wlogical-op -Wmissing-include-dirs -Wold-style-definition -Wpointer-arith -Winit-self -Wdeclaration-after-statement -Wfloat-equal -Wsuggest-attribute=noreturn -Werror=missing-prototypes -Werror=implicit-function-declaration -Werror=missing-declarations -Werror=return-type -Werror=incompatible-pointer-types -Werror=format=2 -Wstrict-prototypes -Wredundant-decls -Wmissing-noreturn -Wshadow -Wendif-labels -Wstrict-aliasing=2 -Wwrite-strings -Werror=overflow -Wdate-time -Wnested-externs -ffast-math -fno-common -fdiagnostics-show-option -fno-strict-aliasing -fvisibility=hidden -fstack-protector -fstack-protector-strong -fPIE --param=ssp-buffer-size=4 -Wno-unused-parameter -Wno-missing-field-initializers -Wno-unused-result -Wno-format-signedness -Wno-error=nonnull -Werror=shadow -ffunction-sections -fdata-sections -include config.h -O2 -fwrapv -Wformat -Werror=format-security -gdwarf-4 -fno-debug-types-section -fvar-tracking-assignments -g2 -Wp,-D_FORTIFY_SOURCE=2 -fstack-protector-strong --param=ssp-buffer-size=4 -fPIC -mtune=generic -march=x86-64 -gdwarf-4 -fno-debug-types-section -fvar-tracking-assignments -g2  -MD -MQ 'systemd-backlight@exe/src_backlight_backlight.c.o' -MF 'systemd-backlight@exe/src_backlight_backlight.c.o.d' -o 'systemd-backlight@exe/src_backlight_backlight.c.o' -c ../src/backlight/backlight.c
+ chmod -R u+rwX /tmp/B.snKZS9/BUILD
[919/1834] x86_64-pld-linux-gnux32-gcc  -o systemd-system-update-generator 'systemd-system-update-generator@exe/src_system-update-generator_system-update-generator.c.o' -Wl,--no-undefined -Wl,--as-needed -Wl,-z,relro -Wl,-z,now -pie -Wl,--gc-sections -O2 -fwrapv -pipe -Wformat -Werror=format-security -gdwarf-4 -fno-debug-types-section -fvar-tracking-assignments -g2 -Wp,-D_FORTIFY_SOURCE=2 -fstack-protector-strong --param=ssp-buffer-size=4 -fPIC -mtune=generic -march=x86-64 -gdwarf-4 -fno-debug-types-section -fvar-tracking-assignments -g2 -Wl,--as-needed -Wl,--no-copy-dt-needed-entries -Wl,-z,relro -Wl,-z,combreloc -Wl,--start-group src/shared/libsystemd-shared-235.so -Wl,--end-group '-Wl,-rpath,$ORIGIN/src/shared' -Wl,-rpath-link,/tmp/B.snKZS9/BUILD/systemd-235/build/src/shared  
[920/1834] x86_64-pld-linux-gnux32-gcc  -o systemd-socket-activate 'systemd-socket-activate@exe/src_activate_activate.c.o' -Wl,--no-undefined -Wl,--as-needed -Wl,-z,relro -Wl,-z,now -pie -Wl,--gc-sections -O2 -fwrapv -pipe -Wformat -Werror=format-security -gdwarf-4 -fno-debug-types-section -fvar-tracking-assignments -g2 -Wp,-D_FORTIFY_SOURCE=2 -fstack-protector-strong --param=ssp-buffer-size=4 -fPIC -mtune=generic -march=x86-64 -gdwarf-4 -fno-debug-types-section -fvar-tracking-assignments -g2 -Wl,--as-needed -Wl,--no-copy-dt-needed-entries -Wl,-z,relro -Wl,-z,combreloc -Wl,--start-group src/shared/libsystemd-shared-235.so -Wl,--end-group -pthread '-Wl,-rpath,$ORIGIN/src/shared' -Wl,-rpath-link,/tmp/B.snKZS9/BUILD/systemd-235/build/src/shared  
[921/1834] x86_64-pld-linux-gnux32-gcc  -o pam_systemd.so 'pam_systemd@sha/src_login_pam_systemd.c.o' -Wl,--no-undefined -Wl,--as-needed -shared -fPIC -Wl,--start-group -Wl,-soname,pam_systemd.so -Wl,-z,relro -Wl,-z,now -pie -Wl,--gc-sections -O2 -fwrapv -pipe -Wformat -Werror=format-security -gdwarf-4 -fno-debug-types-section -fvar-tracking-assignments -g2 -Wp,-D_FORTIFY_SOURCE=2 -fstack-protector-strong --param=ssp-buffer-size=4 -fPIC -mtune=generic -march=x86-64 -gdwarf-4 -fno-debug-types-section -fvar-tracking-assignments -g2 -Wl,--as-needed -Wl,--no-copy-dt-needed-entries -Wl,-z,relro -Wl,-z,combreloc src/libsystemd/libsystemd.a src/basic/libbasic.a src/shared/libsystemd-shared-235.a -pthread -shared -Wl,--version-script=/tmp/B.snKZS9/BUILD/systemd-235/src/login/pam_systemd.sym -lpam -lpam_misc -lrt -lcap -lblkid -Wl,--end-group -lselinux -lrt -lcap -lacl -lcryptsetup -lgcrypt -lip4tc -lip6tc -lseccomp -lselinux -lidn -llzma -llz4 -lblkid  
[922/1834] x86_64-pld-linux-gnux32-gcc -Isystemd-rfkill@exe -I. -I.. -Isrc/basic -I../src/basic -Isrc/shared -I../src/shared -Isrc/systemd -I../src/systemd -Isrc/journal -I../src/journal -Isrc/resolve -I../src/resolve -Isrc/timesync -I../src/timesync -Isrc/login -I../src/login -Isrc/udev -I../src/udev -Isrc/libudev -I../src/libudev -Isrc/core -I../src/core -I../src/libsystemd/sd-bus -I../src/libsystemd/sd-device -I../src/libsystemd/sd-hwdb -I../src/libsystemd/sd-id128 -I../src/libsystemd/sd-netlink -I../src/libsystemd/sd-network -Isrc/libsystemd-network -I../src/libsystemd-network -I../ -fdiagnostics-color=always -pipe -D_FILE_OFFSET_BITS=64 -std=gnu99 -Wextra -Werror=undef -Wlogical-op -Wmissing-include-dirs -Wold-style-definition -Wpointer-arith -Winit-self -Wdeclaration-after-statement -Wfloat-equal -Wsuggest-attribute=noreturn -Werror=missing-prototypes -Werror=implicit-function-declaration -Werror=missing-declarations -Werror=return-type -Werror=incompatible-pointer-types -Werror=format=2 -Wstrict-prototypes -Wredundant-decls -Wmissing-noreturn -Wshadow -Wendif-labels -Wstrict-aliasing=2 -Wwrite-strings -Werror=overflow -Wdate-time -Wnested-externs -ffast-math -fno-common -fdiagnostics-show-option -fno-strict-aliasing -fvisibility=hidden -fstack-protector -fstack-protector-strong -fPIE --param=ssp-buffer-size=4 -Wno-unused-parameter -Wno-missing-field-initializers -Wno-unused-result -Wno-format-signedness -Wno-error=nonnull -Werror=shadow -ffunction-sections -fdata-sections -include config.h -O2 -fwrapv -Wformat -Werror=format-security -gdwarf-4 -fno-debug-types-section -fvar-tracking-assignments -g2 -Wp,-D_FORTIFY_SOURCE=2 -fstack-protector-strong --param=ssp-buffer-size=4 -fPIC -mtune=generic -march=x86-64 -gdwarf-4 -fno-debug-types-section -fvar-tracking-assignments -g2  -MD -MQ 'systemd-rfkill@exe/src_rfkill_rfkill.c.o' -MF 'systemd-rfkill@exe/src_rfkill_rfkill.c.o.d' -o 'systemd-rfkill@exe/src_rfkill_rfkill.c.o' -c ../src/rfkill/rfkill.c
[923/1834] x86_64-pld-linux-gnux32-gcc -Iloginctl@exe -I. -I.. -Isrc/basic -I../src/basic -Isrc/shared -I../src/shared -Isrc/systemd -I../src/systemd -Isrc/journal -I../src/journal -Isrc/resolve -I../src/resolve -Isrc/timesync -I../src/timesync -Isrc/login -I../src/login -Isrc/udev -I../src/udev -Isrc/libudev -I../src/libudev -Isrc/core -I../src/core -I../src/libsystemd/sd-bus -I../src/libsystemd/sd-device -I../src/libsystemd/sd-hwdb -I../src/libsystemd/sd-id128 -I../src/libsystemd/sd-netlink -I../src/libsystemd/sd-network -Isrc/libsystemd-network -I../src/libsystemd-network -I../ -I/usr/include/lz4 -fdiagnostics-color=always -pipe -D_FILE_OFFSET_BITS=64 -std=gnu99 -Wextra -Werror=undef -Wlogical-op -Wmissing-include-dirs -Wold-style-definition -Wpointer-arith -Winit-self -Wdeclaration-after-statement -Wfloat-equal -Wsuggest-attribute=noreturn -Werror=missing-prototypes -Werror=implicit-function-declaration -Werror=missing-declarations -Werror=return-type -Werror=incompatible-pointer-types -Werror=format=2 -Wstrict-prototypes -Wredundant-decls -Wmissing-noreturn -Wshadow -Wendif-labels -Wstrict-aliasing=2 -Wwrite-strings -Werror=overflow -Wdate-time -Wnested-externs -ffast-math -fno-common -fdiagnostics-show-option -fno-strict-aliasing -fvisibility=hidden -fstack-protector -fstack-protector-strong -fPIE --param=ssp-buffer-size=4 -Wno-unused-parameter -Wno-missing-field-initializers -Wno-unused-result -Wno-format-signedness -Wno-error=nonnull -Werror=shadow -ffunction-sections -fdata-sections -include config.h -O2 -fwrapv -Wformat -Werror=format-security -gdwarf-4 -fno-debug-types-section -fvar-tracking-assignments -g2 -Wp,-D_FORTIFY_SOURCE=2 -fstack-protector-strong --param=ssp-buffer-size=4 -fPIC -mtune=generic -march=x86-64 -gdwarf-4 -fno-debug-types-section -fvar-tracking-assignments -g2 -pthread  -MD -MQ 'loginctl@exe/src_login_loginctl.c.o' -MF 'loginctl@exe/src_login_loginctl.c.o.d' -o 'loginctl@exe/src_login_loginctl.c.o' -c ../src/login/loginctl.c
[924/1834] x86_64-pld-linux-gnux32-gcc -Isystemd-veritysetup@exe -I. -I.. -Isrc/basic -I../src/basic -Isrc/shared -I../src/shared -Isrc/systemd -I../src/systemd -Isrc/journal -I../src/journal -Isrc/resolve -I../src/resolve -Isrc/timesync -I../src/timesync -Isrc/login -I../src/login -Isrc/udev -I../src/udev -Isrc/libudev -I../src/libudev -Isrc/core -I../src/core -I../src/libsystemd/sd-bus -I../src/libsystemd/sd-device -I../src/libsystemd/sd-hwdb -I../src/libsystemd/sd-id128 -I../src/libsystemd/sd-netlink -I../src/libsystemd/sd-network -Isrc/libsystemd-network -I../src/libsystemd-network -I../ -fdiagnostics-color=always -pipe -D_FILE_OFFSET_BITS=64 -std=gnu99 -Wextra -Werror=undef -Wlogical-op -Wmissing-include-dirs -Wold-style-definition -Wpointer-arith -Winit-self -Wdeclaration-after-statement -Wfloat-equal -Wsuggest-attribute=noreturn -Werror=missing-prototypes -Werror=implicit-function-declaration -Werror=missing-declarations -Werror=return-type -Werror=incompatible-pointer-types -Werror=format=2 -Wstrict-prototypes -Wredundant-decls -Wmissing-noreturn -Wshadow -Wendif-labels -Wstrict-aliasing=2 -Wwrite-strings -Werror=overflow -Wdate-time -Wnested-externs -ffast-math -fno-common -fdiagnostics-show-option -fno-strict-aliasing -fvisibility=hidden -fstack-protector -fstack-protector-strong -fPIE --param=ssp-buffer-size=4 -Wno-unused-parameter -Wno-missing-field-initializers -Wno-unused-result -Wno-format-signedness -Wno-error=nonnull -Werror=shadow -ffunction-sections -fdata-sections -include config.h -O2 -fwrapv -Wformat -Werror=format-security -gdwarf-4 -fno-debug-types-section -fvar-tracking-assignments -g2 -Wp,-D_FORTIFY_SOURCE=2 -fstack-protector-strong --param=ssp-buffer-size=4 -fPIC -mtune=generic -march=x86-64 -gdwarf-4 -fno-debug-types-section -fvar-tracking-assignments -g2  -MD -MQ 'systemd-veritysetup@exe/src_veritysetup_veritysetup.c.o' -MF 'systemd-veritysetup@exe/src_veritysetup_veritysetup.c.o.d' -o 'systemd-veritysetup@exe/src_veritysetup_veritysetup.c.o' -c ../src/veritysetup/veritysetup.c
+ rm -rf /tmp/B.snKZS9/tmp /tmp/B.snKZS9/BUILD
[925/1834] x86_64-pld-linux-gnux32-gcc  -o systemd-backlight 'systemd-backlight@exe/src_backlight_backlight.c.o' -Wl,--no-undefined -Wl,--as-needed -Wl,-z,relro -Wl,-z,now -pie -Wl,--gc-sections -O2 -fwrapv -pipe -Wformat -Werror=format-security -gdwarf-4 -fno-debug-types-section -fvar-tracking-assignments -g2 -Wp,-D_FORTIFY_SOURCE=2 -fstack-protector-strong --param=ssp-buffer-size=4 -fPIC -mtune=generic -march=x86-64 -gdwarf-4 -fno-debug-types-section -fvar-tracking-assignments -g2 -Wl,--as-needed -Wl,--no-copy-dt-needed-entries -Wl,-z,relro -Wl,-z,combreloc -Wl,--start-group src/shared/libsystemd-shared-235.so -Wl,--end-group '-Wl,-rpath,$ORIGIN/src/shared' -Wl,-rpath-link,/tmp/B.snKZS9/BUILD/systemd-235/build/src/shared  
[926/1834] x86_64-pld-linux-gnux32-gcc -Isystemd-veritysetup-generator@exe -I. -I.. -Isrc/basic -I../src/basic -Isrc/shared -I../src/shared -Isrc/systemd -I../src/systemd -Isrc/journal -I../src/journal -Isrc/resolve -I../src/resolve -Isrc/timesync -I../src/timesync -Isrc/login -I../src/login -Isrc/udev -I../src/udev -Isrc/libudev -I../src/libudev -Isrc/core -I../src/core -I../src/libsystemd/sd-bus -I../src/libsystemd/sd-device -I../src/libsystemd/sd-hwdb -I../src/libsystemd/sd-id128 -I../src/libsystemd/sd-netlink -I../src/libsystemd/sd-network -Isrc/libsystemd-network -I../src/libsystemd-network -I../ -fdiagnostics-color=always -pipe -D_FILE_OFFSET_BITS=64 -std=gnu99 -Wextra -Werror=undef -Wlogical-op -Wmissing-include-dirs -Wold-style-definition -Wpointer-arith -Winit-self -Wdeclaration-after-statement -Wfloat-equal -Wsuggest-attribute=noreturn -Werror=missing-prototypes -Werror=implicit-function-declaration -Werror=missing-declarations -Werror=return-type -Werror=incompatible-pointer-types -Werror=format=2 -Wstrict-prototypes -Wredundant-decls -Wmissing-noreturn -Wshadow -Wendif-labels -Wstrict-aliasing=2 -Wwrite-strings -Werror=overflow -Wdate-time -Wnested-externs -ffast-math -fno-common -fdiagnostics-show-option -fno-strict-aliasing -fvisibility=hidden -fstack-protector -fstack-protector-strong -fPIE --param=ssp-buffer-size=4 -Wno-unused-parameter -Wno-missing-field-initializers -Wno-unused-result -Wno-format-signedness -Wno-error=nonnull -Werror=shadow -ffunction-sections -fdata-sections -include config.h -O2 -fwrapv -Wformat -Werror=format-security -gdwarf-4 -fno-debug-types-section -fvar-tracking-assignments -g2 -Wp,-D_FORTIFY_SOURCE=2 -fstack-protector-strong --param=ssp-buffer-size=4 -fPIC -mtune=generic -march=x86-64 -gdwarf-4 -fno-debug-types-section -fvar-tracking-assignments -g2  -MD -MQ 'systemd-veritysetup-generator@exe/src_veritysetup_veritysetup-generator.c.o' -MF 'systemd-veritysetup-generator@exe/src_veritysetup_veritysetup-generator.c.o.d' -o 'systemd-veritysetup-generator@exe/src_veritysetup_veritysetup-generator.c.o' -c ../src/veritysetup/veritysetup-generator.c
[927/1834] x86_64-pld-linux-gnux32-gcc  -o systemd-resolve 'systemd-resolve@exe/src_resolve_resolved-dns-dnssec.c.o' 'systemd-resolve@exe/src_resolve_resolved-dns-packet.c.o' 'systemd-resolve@exe/src_resolve_resolved-dns-rr.c.o' 'systemd-resolve@exe/src_resolve_resolved-dns-answer.c.o' 'systemd-resolve@exe/src_resolve_resolved-dns-question.c.o' 'systemd-resolve@exe/src_resolve_dns-type.c.o' 'systemd-resolve@exe/src_resolve_resolve-tool.c.o' 'systemd-resolve@exe/src_shared_gcrypt-util.c.o' -Wl,--no-undefined -Wl,--as-needed -Wl,-z,relro -Wl,-z,now -pie -Wl,--gc-sections -O2 -fwrapv -pipe -Wformat -Werror=format-security -gdwarf-4 -fno-debug-types-section -fvar-tracking-assignments -g2 -Wp,-D_FORTIFY_SOURCE=2 -fstack-protector-strong --param=ssp-buffer-size=4 -fPIC -mtune=generic -march=x86-64 -gdwarf-4 -fno-debug-types-section -fvar-tracking-assignments -g2 -Wl,--as-needed -Wl,--no-copy-dt-needed-entries -Wl,-z,relro -Wl,-z,combreloc -Wl,--start-group src/shared/libsystemd-shared-235.so -pthread -lgcrypt -lgpg-error -lm -lidn -Wl,--end-group '-Wl,-rpath,$ORIGIN/src/shared' -Wl,-rpath-link,/tmp/B.snKZS9/BUILD/systemd-235/build/src/shared  
[928/1834] /usr/bin/xsltproc -o man/sd_get_seats.3 --nonet --xinclude --maxdepth 9000 --stringparam man.output.quietly 1 --stringparam funcsynopsis.style ansi --stringparam man.authors.section.enabled 0 --stringparam man.copyright.section.enabled 0 --stringparam systemd.version 235 --path /tmp/B.snKZS9/BUILD/systemd-235/build/man:/tmp/B.snKZS9/BUILD/systemd-235/man ../man/custom-man.xsl ../man/sd_get_seats.xml
FAILED: man/sd_get_seats.3 man/sd_get_machine_names.3 man/sd_get_sessions.3 man/sd_get_uids.3 
/usr/bin/xsltproc -o man/sd_get_seats.3 --nonet --xinclude --maxdepth 9000 --stringparam man.output.quietly 1 --stringparam funcsynopsis.style ansi --stringparam man.authors.section.enabled 0 --stringparam man.copyright.section.enabled 0 --stringparam systemd.version 235 --path /tmp/B.snKZS9/BUILD/systemd-235/build/man:/tmp/B.snKZS9/BUILD/systemd-235/man ../man/custom-man.xsl ../man/sd_get_seats.xml
warning: failed to load external entity "../man/custom-man.xsl"
cannot parse ../man/custom-man.xsl
[929/1834] x86_64-pld-linux-gnux32-gcc -Isystemd-timedated@exe -I. -I.. -Isrc/basic -I../src/basic -Isrc/shared -I../src/shared -Isrc/systemd -I../src/systemd -Isrc/journal -I../src/journal -Isrc/resolve -I../src/resolve -Isrc/timesync -I../src/timesync -Isrc/login -I../src/login -Isrc/udev -I../src/udev -Isrc/libudev -I../src/libudev -Isrc/core -I../src/core -I../src/libsystemd/sd-bus -I../src/libsystemd/sd-device -I../src/libsystemd/sd-hwdb -I../src/libsystemd/sd-id128 -I../src/libsystemd/sd-netlink -I../src/libsystemd/sd-network -Isrc/libsystemd-network -I../src/libsystemd-network -I../ -fdiagnostics-color=always -pipe -D_FILE_OFFSET_BITS=64 -std=gnu99 -Wextra -Werror=undef -Wlogical-op -Wmissing-include-dirs -Wold-style-definition -Wpointer-arith -Winit-self -Wdeclaration-after-statement -Wfloat-equal -Wsuggest-attribute=noreturn -Werror=missing-prototypes -Werror=implicit-function-declaration -Werror=missing-declarations -Werror=return-type -Werror=incompatible-pointer-types -Werror=format=2 -Wstrict-prototypes -Wredundant-decls -Wmissing-noreturn -Wshadow -Wendif-labels -Wstrict-aliasing=2 -Wwrite-strings -Werror=overflow -Wdate-time -Wnested-externs -ffast-math -fno-common -fdiagnostics-show-option -fno-strict-aliasing -fvisibility=hidden -fstack-protector -fstack-protector-strong -fPIE --param=ssp-buffer-size=4 -Wno-unused-parameter -Wno-missing-field-initializers -Wno-unused-result -Wno-format-signedness -Wno-error=nonnull -Werror=shadow -ffunction-sections -fdata-sections -include config.h -O2 -fwrapv -Wformat -Werror=format-security -gdwarf-4 -fno-debug-types-section -fvar-tracking-assignments -g2 -Wp,-D_FORTIFY_SOURCE=2 -fstack-protector-strong --param=ssp-buffer-size=4 -fPIC -mtune=generic -march=x86-64 -gdwarf-4 -fno-debug-types-section -fvar-tracking-assignments -g2  -MD -MQ 'systemd-timedated@exe/src_timedate_timedated.c.o' -MF 'systemd-timedated@exe/src_timedate_timedated.c.o.d' -o 'systemd-timedated@exe/src_timedate_timedated.c.o' -c ../src/timedate/timedated.c
FAILED: systemd-timedated@exe/src_timedate_timedated.c.o 
x86_64-pld-linux-gnux32-gcc -Isystemd-timedated@exe -I. -I.. -Isrc/basic -I../src/basic -Isrc/shared -I../src/shared -Isrc/systemd -I../src/systemd -Isrc/journal -I../src/journal -Isrc/resolve -I../src/resolve -Isrc/timesync -I../src/timesync -Isrc/login -I../src/login -Isrc/udev -I../src/udev -Isrc/libudev -I../src/libudev -Isrc/core -I../src/core -I../src/libsystemd/sd-bus -I../src/libsystemd/sd-device -I../src/libsystemd/sd-hwdb -I../src/libsystemd/sd-id128 -I../src/libsystemd/sd-netlink -I../src/libsystemd/sd-network -Isrc/libsystemd-network -I../src/libsystemd-network -I../ -fdiagnostics-color=always -pipe -D_FILE_OFFSET_BITS=64 -std=gnu99 -Wextra -Werror=undef -Wlogical-op -Wmissing-include-dirs -Wold-style-definition -Wpointer-arith -Winit-self -Wdeclaration-after-statement -Wfloat-equal -Wsuggest-attribute=noreturn -Werror=missing-prototypes -Werror=implicit-function-declaration -Werror=missing-declarations -Werror=return-type -Werror=incompatible-pointer-types -Werror=format=2 -Wstrict-prototypes -Wredundant-decls -Wmissing-noreturn -Wshadow -Wendif-labels -Wstrict-aliasing=2 -Wwrite-strings -Werror=overflow -Wdate-time -Wnested-externs -ffast-math -fno-common -fdiagnostics-show-option -fno-strict-aliasing -fvisibility=hidden -fstack-protector -fstack-protector-strong -fPIE --param=ssp-buffer-size=4 -Wno-unused-parameter -Wno-missing-field-initializers -Wno-unused-result -Wno-format-signedness -Wno-error=nonnull -Werror=shadow -ffunction-sections -fdata-sections -include config.h -O2 -fwrapv -Wformat -Werror=format-security -gdwarf-4 -fno-debug-types-section -fvar-tracking-assignments -g2 -Wp,-D_FORTIFY_SOURCE=2 -fstack-protector-strong --param=ssp-buffer-size=4 -fPIC -mtune=generic -march=x86-64 -gdwarf-4 -fno-debug-types-section -fvar-tracking-assignments -g2  -MD -MQ 'systemd-timedated@exe/src_timedate_timedated.c.o' -MF 'systemd-timedated@exe/src_timedate_timedated.c.o.d' -o 'systemd-timedated@exe/src_timedate_timedated.c.o' -c ../src/timedate/timedated.c
In file included from ../src/timedate/timedated.c:28:0:
../src/basic/alloc-util.h:27:10: fatal error: macro.h: No such file or directory
compilation terminated.
[930/1834] x86_64-pld-linux-gnux32-gcc  -o systemd-rfkill 'systemd-rfkill@exe/src_rfkill_rfkill.c.o' -Wl,--no-undefined -Wl,--as-needed -Wl,-z,relro -Wl,-z,now -pie -Wl,--gc-sections -O2 -fwrapv -pipe -Wformat -Werror=format-security -gdwarf-4 -fno-debug-types-section -fvar-tracking-assignments -g2 -Wp,-D_FORTIFY_SOURCE=2 -fstack-protector-strong --param=ssp-buffer-size=4 -fPIC -mtune=generic -march=x86-64 -gdwarf-4 -fno-debug-types-section -fvar-tracking-assignments -g2 -Wl,--as-needed -Wl,--no-copy-dt-needed-entries -Wl,-z,relro -Wl,-z,combreloc -Wl,--start-group src/shared/libsystemd-shared-235.so -Wl,--end-group '-Wl,-rpath,$ORIGIN/src/shared' -Wl,-rpath-link,/tmp/B.snKZS9/BUILD/systemd-235/build/src/shared  
[931/1834] x86_64-pld-linux-gnux32-gcc -Isystemd-cryptsetup@exe -I. -I.. -Isrc/basic -I../src/basic -Isrc/shared -I../src/shared -Isrc/systemd -I../src/systemd -Isrc/journal -I../src/journal -Isrc/resolve -I../src/resolve -Isrc/timesync -I../src/timesync -Isrc/login -I../src/login -Isrc/udev -I../src/udev -Isrc/libudev -I../src/libudev -Isrc/core -I../src/core -I../src/libsystemd/sd-bus -I../src/libsystemd/sd-device -I../src/libsystemd/sd-hwdb -I../src/libsystemd/sd-id128 -I../src/libsystemd/sd-netlink -I../src/libsystemd/sd-network -Isrc/libsystemd-network -I../src/libsystemd-network -I../ -fdiagnostics-color=always -pipe -D_FILE_OFFSET_BITS=64 -std=gnu99 -Wextra -Werror=undef -Wlogical-op -Wmissing-include-dirs -Wold-style-definition -Wpointer-arith -Winit-self -Wdeclaration-after-statement -Wfloat-equal -Wsuggest-attribute=noreturn -Werror=missing-prototypes -Werror=implicit-function-declaration -Werror=missing-declarations -Werror=return-type -Werror=incompatible-pointer-types -Werror=format=2 -Wstrict-prototypes -Wredundant-decls -Wmissing-noreturn -Wshadow -Wendif-labels -Wstrict-aliasing=2 -Wwrite-strings -Werror=overflow -Wdate-time -Wnested-externs -ffast-math -fno-common -fdiagnostics-show-option -fno-strict-aliasing -fvisibility=hidden -fstack-protector -fstack-protector-strong -fPIE --param=ssp-buffer-size=4 -Wno-unused-parameter -Wno-missing-field-initializers -Wno-unused-result -Wno-format-signedness -Wno-error=nonnull -Werror=shadow -ffunction-sections -fdata-sections -include config.h -O2 -fwrapv -Wformat -Werror=format-security -gdwarf-4 -fno-debug-types-section -fvar-tracking-assignments -g2 -Wp,-D_FORTIFY_SOURCE=2 -fstack-protector-strong --param=ssp-buffer-size=4 -fPIC -mtune=generic -march=x86-64 -gdwarf-4 -fno-debug-types-section -fvar-tracking-assignments -g2  -MD -MQ 'systemd-cryptsetup@exe/src_cryptsetup_cryptsetup.c.o' -MF 'systemd-cryptsetup@exe/src_cryptsetup_cryptsetup.c.o.d' -o 'systemd-cryptsetup@exe/src_cryptsetup_cryptsetup.c.o' -c ../src/cryptsetup/cryptsetup.c
[932/1834] x86_64-pld-linux-gnux32-gcc -Isystemd-cryptsetup-generator@exe -I. -I.. -Isrc/basic -I../src/basic -Isrc/shared -I../src/shared -Isrc/systemd -I../src/systemd -Isrc/journal -I../src/journal -Isrc/resolve -I../src/resolve -Isrc/timesync -I../src/timesync -Isrc/login -I../src/login -Isrc/udev -I../src/udev -Isrc/libudev -I../src/libudev -Isrc/core -I../src/core -I../src/libsystemd/sd-bus -I../src/libsystemd/sd-device -I../src/libsystemd/sd-hwdb -I../src/libsystemd/sd-id128 -I../src/libsystemd/sd-netlink -I../src/libsystemd/sd-network -Isrc/libsystemd-network -I../src/libsystemd-network -I../ -fdiagnostics-color=always -pipe -D_FILE_OFFSET_BITS=64 -std=gnu99 -Wextra -Werror=undef -Wlogical-op -Wmissing-include-dirs -Wold-style-definition -Wpointer-arith -Winit-self -Wdeclaration-after-statement -Wfloat-equal -Wsuggest-attribute=noreturn -Werror=missing-prototypes -Werror=implicit-function-declaration -Werror=missing-declarations -Werror=return-type -Werror=incompatible-pointer-types -Werror=format=2 -Wstrict-prototypes -Wredundant-decls -Wmissing-noreturn -Wshadow -Wendif-labels -Wstrict-aliasing=2 -Wwrite-strings -Werror=overflow -Wdate-time -Wnested-externs -ffast-math -fno-common -fdiagnostics-show-option -fno-strict-aliasing -fvisibility=hidden -fstack-protector -fstack-protector-strong -fPIE --param=ssp-buffer-size=4 -Wno-unused-parameter -Wno-missing-field-initializers -Wno-unused-result -Wno-format-signedness -Wno-error=nonnull -Werror=shadow -ffunction-sections -fdata-sections -include config.h -O2 -fwrapv -Wformat -Werror=format-security -gdwarf-4 -fno-debug-types-section -fvar-tracking-assignments -g2 -Wp,-D_FORTIFY_SOURCE=2 -fstack-protector-strong --param=ssp-buffer-size=4 -fPIC -mtune=generic -march=x86-64 -gdwarf-4 -fno-debug-types-section -fvar-tracking-assignments -g2  -MD -MQ 'systemd-cryptsetup-generator@exe/src_cryptsetup_cryptsetup-generator.c.o' -MF 'systemd-cryptsetup-generator@exe/src_cryptsetup_cryptsetup-generator.c.o.d' -o 'systemd-cryptsetup-generator@exe/src_cryptsetup_cryptsetup-generator.c.o' -c ../src/cryptsetup/cryptsetup-generator.c
[933/1834] x86_64-pld-linux-gnux32-gcc  -o loginctl 'loginctl@exe/src_login_loginctl.c.o' 'loginctl@exe/src_login_sysfs-show.c.o' -Wl,--no-undefined -Wl,--as-needed -Wl,-z,relro -Wl,-z,now -pie -Wl,--gc-sections -O2 -fwrapv -pipe -Wformat -Werror=format-security -gdwarf-4 -fno-debug-types-section -fvar-tracking-assignments -g2 -Wp,-D_FORTIFY_SOURCE=2 -fstack-protector-strong --param=ssp-buffer-size=4 -fPIC -mtune=generic -march=x86-64 -gdwarf-4 -fno-debug-types-section -fvar-tracking-assignments -g2 -Wl,--as-needed -Wl,--no-copy-dt-needed-entries -Wl,-z,relro -Wl,-z,combreloc -Wl,--start-group src/shared/libsystemd-shared-235.so -pthread -llz4 -llzma -Wl,--end-group '-Wl,-rpath,$ORIGIN/src/shared' -Wl,-rpath-link,/tmp/B.snKZS9/BUILD/systemd-235/build/src/shared  
[934/1834] x86_64-pld-linux-gnux32-gcc  -o systemd-veritysetup-generator 'systemd-veritysetup-generator@exe/src_veritysetup_veritysetup-generator.c.o' -Wl,--no-undefined -Wl,--as-needed -Wl,-z,relro -Wl,-z,now -pie -Wl,--gc-sections -O2 -fwrapv -pipe -Wformat -Werror=format-security -gdwarf-4 -fno-debug-types-section -fvar-tracking-assignments -g2 -Wp,-D_FORTIFY_SOURCE=2 -fstack-protector-strong --param=ssp-buffer-size=4 -fPIC -mtune=generic -march=x86-64 -gdwarf-4 -fno-debug-types-section -fvar-tracking-assignments -g2 -Wl,--as-needed -Wl,--no-copy-dt-needed-entries -Wl,-z,relro -Wl,-z,combreloc -Wl,--start-group src/shared/libsystemd-shared-235.so -lcryptsetup -Wl,--end-group '-Wl,-rpath,$ORIGIN/src/shared' -Wl,-rpath-link,/tmp/B.snKZS9/BUILD/systemd-235/build/src/shared  
[935/1834] x86_64-pld-linux-gnux32-gcc  -o systemd-veritysetup 'systemd-veritysetup@exe/src_veritysetup_veritysetup.c.o' -Wl,--no-undefined -Wl,--as-needed -Wl,-z,relro -Wl,-z,now -pie -Wl,--gc-sections -O2 -fwrapv -pipe -Wformat -Werror=format-security -gdwarf-4 -fno-debug-types-section -fvar-tracking-assignments -g2 -Wp,-D_FORTIFY_SOURCE=2 -fstack-protector-strong --param=ssp-buffer-size=4 -fPIC -mtune=generic -march=x86-64 -gdwarf-4 -fno-debug-types-section -fvar-tracking-assignments -g2 -Wl,--as-needed -Wl,--no-copy-dt-needed-entries -Wl,-z,relro -Wl,-z,combreloc -Wl,--start-group src/shared/libsystemd-shared-235.so -lcryptsetup -Wl,--end-group '-Wl,-rpath,$ORIGIN/src/shared' -Wl,-rpath-link,/tmp/B.snKZS9/BUILD/systemd-235/build/src/shared  
+ rm -rf /tmp/B.snKZS9
Begin-PLD-Builder-Info
Build-Time: user:2.64s sys:2.27s real:145.83s (faults io:0 non-io:110769)

End-PLD-Builder-Info
[Back to list of logs] [View rpm -qa of builder]