FailedOk

th/SRPMS[OK]
th/x32[OK]
th/i686[OK]
th/x86_64[OK]

ac/SRPMS[OK]
ac/i386[OK]
ac/i586[OK]
ac/i686[OK]
ac/alpha[OK]
ac/amd64[OK]
ac/athlon[OK]
ac/ppc[OK]
ac/sparc[OK]
ac/sparc64[OK]

Advanced Search
main()
Powered by PLD Linux
(c) 2002-2017 PLD Team
$Revision: 1.37 $
Powered by quantum bogodynamics.
Your IP: 54.82.81.154

texlive 5534528d-2b79-47a7-9d04-a10f8da0f470

Status:Failed
Source URL:ftp://buildlogs.pld-linux.org/th/x32/FAIL/texlive,5534528d-2b79-47a7-9d04-a10f8da0f470.bz2
text/plain URL:View!
full text:View!
rpm -qa of builder:View!
Date:2017/12/07 09:51:48
Runtime:0:00:45.506348

Toc:

  • error 1
  • Error: pointer size mismatch in cross-build.
  • error 2
  • Error: pointer size mismatch in cross-build.
  • error 3
  • Error: pointer size mismatch in cross-build.
  • error 4
  • error: Bad exit status from /tmp/B.3ql_q2/BUILD/tmp/rpm-tmp.53652 (%build)
  • error 5
  • RPM build errors:
  • error 6
  • error: No files produced.

Content:

Making all in .
make[5]: Entering directory '/tmp/B.3ql_q2/BUILD/texlive-20140525-source/libs/luajit'
ln -s ./LuaJIT-2.0.3/src/lib_math.c lib_math.c
make[5]: Leaving directory '/tmp/B.3ql_q2/BUILD/texlive-20140525-source/libs/luajit'
make[5]: Entering directory '/tmp/B.3ql_q2/BUILD/texlive-20140525-source/libs/luajit'
ln -s ./LuaJIT-2.0.3/src/lib_bit.c lib_bit.c
make[5]: Leaving directory '/tmp/B.3ql_q2/BUILD/texlive-20140525-source/libs/luajit'
make[5]: Entering directory '/tmp/B.3ql_q2/BUILD/texlive-20140525-source/libs/luajit'
ln -s ./LuaJIT-2.0.3/src/lib_base.c lib_base.c
make[5]: Leaving directory '/tmp/B.3ql_q2/BUILD/texlive-20140525-source/libs/luajit'
make[5]: Entering directory '/tmp/B.3ql_q2/BUILD/texlive-20140525-source/libs/luajit'
ln -s ./LuaJIT-2.0.3/src/lib_string.c lib_string.c
make[5]: Leaving directory '/tmp/B.3ql_q2/BUILD/texlive-20140525-source/libs/luajit'
make[5]: Entering directory '/tmp/B.3ql_q2/BUILD/texlive-20140525-source/libs/luajit'
ln -s ./LuaJIT-2.0.3/src/lib_table.c lib_table.c
make[5]: Leaving directory '/tmp/B.3ql_q2/BUILD/texlive-20140525-source/libs/luajit'
make[5]: Entering directory '/tmp/B.3ql_q2/BUILD/texlive-20140525-source/libs/luajit'
ln -s ./LuaJIT-2.0.3/src/lib_io.c lib_io.c
make[5]: Leaving directory '/tmp/B.3ql_q2/BUILD/texlive-20140525-source/libs/luajit'
make[5]: Entering directory '/tmp/B.3ql_q2/BUILD/texlive-20140525-source/libs/luajit'
ln -s ./LuaJIT-2.0.3/src/lib_os.c lib_os.c
make[5]: Leaving directory '/tmp/B.3ql_q2/BUILD/texlive-20140525-source/libs/luajit'
make[5]: Entering directory '/tmp/B.3ql_q2/BUILD/texlive-20140525-source/libs/luajit'
ln -s ./LuaJIT-2.0.3/src/lib_package.c lib_package.c
make[5]: Leaving directory '/tmp/B.3ql_q2/BUILD/texlive-20140525-source/libs/luajit'
make[5]: Entering directory '/tmp/B.3ql_q2/BUILD/texlive-20140525-source/libs/luajit'
ln -s ./LuaJIT-2.0.3/src/lib_debug.c lib_debug.c
make[5]: Leaving directory '/tmp/B.3ql_q2/BUILD/texlive-20140525-source/libs/luajit'
make[5]: Entering directory '/tmp/B.3ql_q2/BUILD/texlive-20140525-source/libs/luajit'
ln -s ./LuaJIT-2.0.3/src/lib_jit.c lib_jit.c
make[5]: Leaving directory '/tmp/B.3ql_q2/BUILD/texlive-20140525-source/libs/luajit'
make[5]: Entering directory '/tmp/B.3ql_q2/BUILD/texlive-20140525-source/libs/luajit'
ln -s ./LuaJIT-2.0.3/src/lib_ffi.c lib_ffi.c
make[5]: Leaving directory '/tmp/B.3ql_q2/BUILD/texlive-20140525-source/libs/luajit'
cd native && /usr/bin/make  buildvm-stamp
make[6]: Entering directory '/tmp/B.3ql_q2/BUILD/texlive-20140525-source/libs/luajit/native'
depbase=`echo ../LuaJIT-2.0.3/src/host/minilua.o | sed 's|[^/]*$|.deps/&|;s|\.o$||'`;\
x86_64-pld-linux-gnux32-gcc -DHAVE_CONFIG_H -I.  -I./../LuaJIT-2.0.3/src -DHAVE_PROTOTYPES -Wall -O2 -fwrapv -pipe -Wformat -Werror=format-security -gdwarf-4 -fno-debug-types-section -fvar-tracking-assignments -g2 -Wp,-D_FORTIFY_SOURCE=2 -fstack-protector-strong --param=ssp-buffer-size=4 -fPIC -mtune=generic -march=x86-64 -gdwarf-4 -fno-debug-types-section -fvar-tracking-assignments -g2  -MT ../LuaJIT-2.0.3/src/host/minilua.o -MD -MP -MF $depbase.Tpo -c -o ../LuaJIT-2.0.3/src/host/minilua.o ../LuaJIT-2.0.3/src/host/minilua.c &&\
mv -f $depbase.Tpo $depbase.Po
make[6]: Leaving directory '/tmp/B.3ql_q2/BUILD/texlive-20140525-source/libs/luajit/native'
make[6]: Entering directory '/tmp/B.3ql_q2/BUILD/texlive-20140525-source/libs/luajit/native'
x86_64-pld-linux-gnux32-gcc -Wall -O2 -fwrapv -pipe -Wformat -Werror=format-security -gdwarf-4 -fno-debug-types-section -fvar-tracking-assignments -g2 -Wp,-D_FORTIFY_SOURCE=2 -fstack-protector-strong --param=ssp-buffer-size=4 -fPIC -mtune=generic -march=x86-64 -gdwarf-4 -fno-debug-types-section -fvar-tracking-assignments -g2   -Wl,--as-needed -Wl,--no-copy-dt-needed-entries -Wl,-z,relro -Wl,-z,combreloc  -o minilua ../LuaJIT-2.0.3/src/host/minilua.o -lm 
make[6]: Leaving directory '/tmp/B.3ql_q2/BUILD/texlive-20140525-source/libs/luajit/native'
make[6]: Entering directory '/tmp/B.3ql_q2/BUILD/texlive-20140525-source/libs/luajit/native'
./minilua ./../LuaJIT-2.0.3/dynasm/dynasm.lua \
  `cat ../dynasm_flags` \
  -o buildvm_arch.h ./../LuaJIT-2.0.3/src/vm_x86.dasc
make[6]: Leaving directory '/tmp/B.3ql_q2/BUILD/texlive-20140525-source/libs/luajit/native'
make[6]: Entering directory '/tmp/B.3ql_q2/BUILD/texlive-20140525-source/libs/luajit/native'
x86_64-pld-linux-gnux32-gcc -DHAVE_CONFIG_H -I.  -I./../LuaJIT-2.0.3/src -DLUAJIT_ENABLE_LUA52COMPAT `cat ../native_flags` -DHAVE_PROTOTYPES -Wall -O2 -fwrapv -pipe -Wformat -Werror=format-security -gdwarf-4 -fno-debug-types-section -fvar-tracking-assignments -g2 -Wp,-D_FORTIFY_SOURCE=2 -fstack-protector-strong --param=ssp-buffer-size=4 -fPIC -mtune=generic -march=x86-64 -gdwarf-4 -fno-debug-types-section -fvar-tracking-assignments -g2  -MT ../LuaJIT-2.0.3/src/host/buildvm-buildvm_asm.o -MD -MP -MF ../LuaJIT-2.0.3/src/host/.deps/buildvm-buildvm_asm.Tpo -c -o ../LuaJIT-2.0.3/src/host/buildvm-buildvm_asm.o `test -f '../LuaJIT-2.0.3/src/host/buildvm_asm.c' || echo './'`../LuaJIT-2.0.3/src/host/buildvm_asm.c
mv -f ../LuaJIT-2.0.3/src/host/.deps/buildvm-buildvm_asm.Tpo ../LuaJIT-2.0.3/src/host/.deps/buildvm-buildvm_asm.Po
make[6]: Leaving directory '/tmp/B.3ql_q2/BUILD/texlive-20140525-source/libs/luajit/native'
make[6]: Entering directory '/tmp/B.3ql_q2/BUILD/texlive-20140525-source/libs/luajit/native'
x86_64-pld-linux-gnux32-gcc -DHAVE_CONFIG_H -I.  -I./../LuaJIT-2.0.3/src -DLUAJIT_ENABLE_LUA52COMPAT `cat ../native_flags` -DHAVE_PROTOTYPES -Wall -O2 -fwrapv -pipe -Wformat -Werror=format-security -gdwarf-4 -fno-debug-types-section -fvar-tracking-assignments -g2 -Wp,-D_FORTIFY_SOURCE=2 -fstack-protector-strong --param=ssp-buffer-size=4 -fPIC -mtune=generic -march=x86-64 -gdwarf-4 -fno-debug-types-section -fvar-tracking-assignments -g2  -MT ../LuaJIT-2.0.3/src/host/buildvm-buildvm_peobj.o -MD -MP -MF ../LuaJIT-2.0.3/src/host/.deps/buildvm-buildvm_peobj.Tpo -c -o ../LuaJIT-2.0.3/src/host/buildvm-buildvm_peobj.o `test -f '../LuaJIT-2.0.3/src/host/buildvm_peobj.c' || echo './'`../LuaJIT-2.0.3/src/host/buildvm_peobj.c
mv -f ../LuaJIT-2.0.3/src/host/.deps/buildvm-buildvm_peobj.Tpo ../LuaJIT-2.0.3/src/host/.deps/buildvm-buildvm_peobj.Po
make[6]: Leaving directory '/tmp/B.3ql_q2/BUILD/texlive-20140525-source/libs/luajit/native'
make[6]: Entering directory '/tmp/B.3ql_q2/BUILD/texlive-20140525-source/libs/luajit/native'
x86_64-pld-linux-gnux32-gcc -DHAVE_CONFIG_H -I.  -I./../LuaJIT-2.0.3/src -DLUAJIT_ENABLE_LUA52COMPAT `cat ../native_flags` -DHAVE_PROTOTYPES -Wall -O2 -fwrapv -pipe -Wformat -Werror=format-security -gdwarf-4 -fno-debug-types-section -fvar-tracking-assignments -g2 -Wp,-D_FORTIFY_SOURCE=2 -fstack-protector-strong --param=ssp-buffer-size=4 -fPIC -mtune=generic -march=x86-64 -gdwarf-4 -fno-debug-types-section -fvar-tracking-assignments -g2  -MT ../LuaJIT-2.0.3/src/host/buildvm-buildvm_fold.o -MD -MP -MF ../LuaJIT-2.0.3/src/host/.deps/buildvm-buildvm_fold.Tpo -c -o ../LuaJIT-2.0.3/src/host/buildvm-buildvm_fold.o `test -f '../LuaJIT-2.0.3/src/host/buildvm_fold.c' || echo './'`../LuaJIT-2.0.3/src/host/buildvm_fold.c
In file included from ../LuaJIT-2.0.3/src/host/buildvm_fold.c:7:0:
./../LuaJIT-2.0.3/src/lj_obj.h: In function 'setlightudV':
./../LuaJIT-2.0.3/src/lj_obj.h:724:12: warning: cast from pointer to integer of different size [-Wpointer-to-int-cast]
   o->u64 = (uint64_t)p | (((uint64_t)0xffff) << 48);
            ^
mv -f ../LuaJIT-2.0.3/src/host/.deps/buildvm-buildvm_fold.Tpo ../LuaJIT-2.0.3/src/host/.deps/buildvm-buildvm_fold.Po
make[6]: Leaving directory '/tmp/B.3ql_q2/BUILD/texlive-20140525-source/libs/luajit/native'
make[6]: Entering directory '/tmp/B.3ql_q2/BUILD/texlive-20140525-source/libs/luajit/native'
x86_64-pld-linux-gnux32-gcc -DHAVE_CONFIG_H -I.  -I./../LuaJIT-2.0.3/src -DLUAJIT_ENABLE_LUA52COMPAT `cat ../native_flags` -DHAVE_PROTOTYPES -Wall -O2 -fwrapv -pipe -Wformat -Werror=format-security -gdwarf-4 -fno-debug-types-section -fvar-tracking-assignments -g2 -Wp,-D_FORTIFY_SOURCE=2 -fstack-protector-strong --param=ssp-buffer-size=4 -fPIC -mtune=generic -march=x86-64 -gdwarf-4 -fno-debug-types-section -fvar-tracking-assignments -g2  -MT ../LuaJIT-2.0.3/src/host/buildvm-buildvm_lib.o -MD -MP -MF ../LuaJIT-2.0.3/src/host/.deps/buildvm-buildvm_lib.Tpo -c -o ../LuaJIT-2.0.3/src/host/buildvm-buildvm_lib.o `test -f '../LuaJIT-2.0.3/src/host/buildvm_lib.c' || echo './'`../LuaJIT-2.0.3/src/host/buildvm_lib.c
In file included from ../LuaJIT-2.0.3/src/host/buildvm_lib.c:7:0:
./../LuaJIT-2.0.3/src/lj_obj.h: In function 'setlightudV':
./../LuaJIT-2.0.3/src/lj_obj.h:724:12: warning: cast from pointer to integer of different size [-Wpointer-to-int-cast]
   o->u64 = (uint64_t)p | (((uint64_t)0xffff) << 48);
            ^
mv -f ../LuaJIT-2.0.3/src/host/.deps/buildvm-buildvm_lib.Tpo ../LuaJIT-2.0.3/src/host/.deps/buildvm-buildvm_lib.Po
make[6]: Leaving directory '/tmp/B.3ql_q2/BUILD/texlive-20140525-source/libs/luajit/native'
make[6]: Entering directory '/tmp/B.3ql_q2/BUILD/texlive-20140525-source/libs/luajit/native'
x86_64-pld-linux-gnux32-gcc -DHAVE_CONFIG_H -I.  -I./../LuaJIT-2.0.3/src -DLUAJIT_ENABLE_LUA52COMPAT `cat ../native_flags` -DHAVE_PROTOTYPES -Wall -O2 -fwrapv -pipe -Wformat -Werror=format-security -gdwarf-4 -fno-debug-types-section -fvar-tracking-assignments -g2 -Wp,-D_FORTIFY_SOURCE=2 -fstack-protector-strong --param=ssp-buffer-size=4 -fPIC -mtune=generic -march=x86-64 -gdwarf-4 -fno-debug-types-section -fvar-tracking-assignments -g2  -MT ../LuaJIT-2.0.3/src/host/buildvm-buildvm.o -MD -MP -MF ../LuaJIT-2.0.3/src/host/.deps/buildvm-buildvm.Tpo -c -o ../LuaJIT-2.0.3/src/host/buildvm-buildvm.o `test -f '../LuaJIT-2.0.3/src/host/buildvm.c' || echo './'`../LuaJIT-2.0.3/src/host/buildvm.c
In file included from ../LuaJIT-2.0.3/src/host/buildvm.c:18:0:
./../LuaJIT-2.0.3/src/lj_obj.h: In function 'setlightudV':
./../LuaJIT-2.0.3/src/lj_obj.h:724:12: warning: cast from pointer to integer of different size [-Wpointer-to-int-cast]
   o->u64 = (uint64_t)p | (((uint64_t)0xffff) << 48);
            ^
In file included from ../LuaJIT-2.0.3/src/host/buildvm.c:59:0:
./../LuaJIT-2.0.3/src/../dynasm/dasm_x86.h: In function 'dasm_put':
./../LuaJIT-2.0.3/src/../dynasm/dasm_x86.h:207:2: warning: this 'if' clause does not guard... [-Wmisleading-indentation]
  if (*p++ == 1 && *p == DASM_DISP) mrm = n; continue;
  ^~
./../LuaJIT-2.0.3/src/../dynasm/dasm_x86.h:207:45: note: ...this statement, but the latter is misleadingly indented as if it were guarded by the 'if'
  if (*p++ == 1 && *p == DASM_DISP) mrm = n; continue;
                                             ^~~~~~~~
mv -f ../LuaJIT-2.0.3/src/host/.deps/buildvm-buildvm.Tpo ../LuaJIT-2.0.3/src/host/.deps/buildvm-buildvm.Po
make[6]: Leaving directory '/tmp/B.3ql_q2/BUILD/texlive-20140525-source/libs/luajit/native'
make[6]: Entering directory '/tmp/B.3ql_q2/BUILD/texlive-20140525-source/libs/luajit/native'
x86_64-pld-linux-gnux32-gcc -Wall -O2 -fwrapv -pipe -Wformat -Werror=format-security -gdwarf-4 -fno-debug-types-section -fvar-tracking-assignments -g2 -Wp,-D_FORTIFY_SOURCE=2 -fstack-protector-strong --param=ssp-buffer-size=4 -fPIC -mtune=generic -march=x86-64 -gdwarf-4 -fno-debug-types-section -fvar-tracking-assignments -g2   -Wl,--as-needed -Wl,--no-copy-dt-needed-entries -Wl,-z,relro -Wl,-z,combreloc  -o buildvm ../LuaJIT-2.0.3/src/host/buildvm-buildvm.o ../LuaJIT-2.0.3/src/host/buildvm-buildvm_asm.o ../LuaJIT-2.0.3/src/host/buildvm-buildvm_fold.o ../LuaJIT-2.0.3/src/host/buildvm-buildvm_lib.o ../LuaJIT-2.0.3/src/host/buildvm-buildvm_peobj.o  
make[6]: Leaving directory '/tmp/B.3ql_q2/BUILD/texlive-20140525-source/libs/luajit/native'
make[6]: Entering directory '/tmp/B.3ql_q2/BUILD/texlive-20140525-source/libs/luajit/native'
echo timestamp >buildvm-stamp
make[6]: Leaving directory '/tmp/B.3ql_q2/BUILD/texlive-20140525-source/libs/luajit/native'
make[5]: Entering directory '/tmp/B.3ql_q2/BUILD/texlive-20140525-source/libs/luajit'
native/buildvm -m bcdef -o lj_bcdef.h lib_base.c lib_math.c lib_bit.c lib_string.c lib_table.c lib_io.c lib_os.c lib_package.c lib_debug.c lib_jit.c lib_ffi.c
Error: pointer size mismatch in cross-build.
Try: make HOST_CC="gcc -m32" CROSS=...

make[5]: *** [Makefile:1649: lj_bcdef.h] Error 1
make[5]: Leaving directory '/tmp/B.3ql_q2/BUILD/texlive-20140525-source/libs/luajit'
make[5]: *** Waiting for unfinished jobs....
make[5]: Entering directory '/tmp/B.3ql_q2/BUILD/texlive-20140525-source/libs/luajit'
native/buildvm -m ffdef -o lj_ffdef.h lib_base.c lib_math.c lib_bit.c lib_string.c lib_table.c lib_io.c lib_os.c lib_package.c lib_debug.c lib_jit.c lib_ffi.c
Error: pointer size mismatch in cross-build.
Try: make HOST_CC="gcc -m32" CROSS=...

make[5]: *** [Makefile:1652: lj_ffdef.h] Error 1
make[5]: Leaving directory '/tmp/B.3ql_q2/BUILD/texlive-20140525-source/libs/luajit'
make[5]: Entering directory '/tmp/B.3ql_q2/BUILD/texlive-20140525-source/libs/luajit'
native/buildvm -m libdef -o lj_libdef.h lib_base.c lib_math.c lib_bit.c lib_string.c lib_table.c lib_io.c lib_os.c lib_package.c lib_debug.c lib_jit.c lib_ffi.c
Error: pointer size mismatch in cross-build.
Try: make HOST_CC="gcc -m32" CROSS=...

make[5]: *** [Makefile:1655: lj_libdef.h] Error 1
make[5]: Leaving directory '/tmp/B.3ql_q2/BUILD/texlive-20140525-source/libs/luajit'
make[4]: *** [Makefile:1052: all-recursive] Error 1
make[3]: *** [Makefile:698: all] Error 2
make[2]: *** [Makefile:875: recurse] Error 1
make[1]: *** [Makefile:455: all-recursive] Error 1
make: *** [Makefile:544: all-recursive] Error 1
error: Bad exit status from /tmp/B.3ql_q2/BUILD/tmp/rpm-tmp.53652 (%build)


RPM build errors:
    Bad exit status from /tmp/B.3ql_q2/BUILD/tmp/rpm-tmp.53652 (%build)
ended at: Thu Dec  7 09:51:47 2017, done in 0:00:45.506348
error: No files produced.
+ chmod -R u+rwX /tmp/B.3ql_q2/BUILD
+ rm -rf /tmp/B.3ql_q2/tmp /tmp/B.3ql_q2/BUILD
+ rm -rf /tmp/B.3ql_q2
Begin-PLD-Builder-Info
Build-Time: user:36.96s sys:8.26s real:61.80s (faults io:0 non-io:3435307)

End-PLD-Builder-Info
[Back to list of logs] [View rpm -qa of builder]