FailedOk

th/SRPMS[OK]
th/x32[OK]
th/i686[OK]
th/x86_64[OK]

ac/SRPMS[OK]
ac/i386[OK]
ac/i586[OK]
ac/i686[OK]
ac/alpha[OK]
ac/amd64[OK]
ac/athlon[OK]
ac/ppc[OK]
ac/sparc[OK]
ac/sparc64[OK]

Advanced Search
main()
Powered by PLD Linux
(c) 2002-2020 PLD Team
$Revision: 1.37 $
Powered by nasi tu byli.
Your IP: 34.229.119.29

thermal-daemon c9a6bd22-b571-4908-bde1-6eaba6edaef2

Status:Failed
Source URL:https://buildlogs.pld-linux.org/pld/th/x32/FAIL/thermal-daemon,c9a6bd22-b571-4908-bde1-6eaba6edaef2.bz2
text/plain URL:View!
rpm -qa of builder:View!
Date:2020/06/29 18:58:55
Runtime:0:00:10.823374

Toc:

  • prep
  • Executing(%prep): /bin/sh -e /tmp/B.U5nJyJ/BUILD/tmp/rpm-tmp.22453
  • build
  • Executing(%build): /bin/sh -e /tmp/B.U5nJyJ/BUILD/tmp/rpm-tmp.22453
  • error 1
  • src/main.cpp:124:31: error: format '%ld' expects argument of type 'long int', but argument 3 has type 'time_t' {aka 'long long int'} [-Werror=format=]
  • error 2
  • src/main.cpp:126:15: error: format '%ld' expects argument of type 'long int', but argument 2 has type 'time_t' {aka 'long long int'} [-Werror=format=]
  • error 3
  • make[2]: *** [Makefile:774: src/thermald-main.o] Error 1
  • error 4
  • make[1]: *** [Makefile:1380: all-recursive] Error 1
  • error 5
  • error: Bad exit status from /tmp/B.U5nJyJ/BUILD/tmp/rpm-tmp.22453 (%build)
  • error 6
  • RPM build errors:
  • error 7
  • error: No files produced.

Content:

request from: atler
checking if we should skip the build
started at: Mon Jun 29 18:58:41 2020
killing old processes on a builder
sending signal 9 to pid -1
Killed
cleaning up /tmp
fetching https://srcbuilder.pld-linux.org/th//srpms/c9a6bd22-b571-4908-bde1-6eaba6edaef2/thermal-daemon-2.2-1.src.rpm
fetched 447558 bytes, 882.4 K/s
installing srpm: thermal-daemon-2.2-1.src.rpm
+ install -d /tmp/B.U5nJyJ/BUILD /tmp/B.U5nJyJ/RPMS
+ LC_ALL=en_US.UTF-8
+ rpm -qp --changelog thermal-daemon-2.2-1.src.rpm
* Mon Jun 29 2020 PLD Linux Team <feedback@pld-linux.org>
- For complete changelog see: http://git.pld-linux.org/?p=packages/thermal-daemon.git;a=log;h=master
* Mon Jun 29 2020 Jan Palus <atler@pld-linux.org> 22c6fe9
- package sample config * Mon Jun 29 2020 Jan Palus <atler@pld-linux.org> 307266a
- up to 2.2 * Thu Dec 26 2019 Jan Palus <atler@pld-linux.org> a453041
- up to 1.9.1 + rpm -Uhv --nodeps --define '_topdir /tmp/B.U5nJyJ' --define '_specdir %{_topdir}' --define '_sourcedir %{_specdir}' --define '_rpmdir %{_topdir}/RPMS' --define '_builddir %{_topdir}/BUILD' thermal-daemon-2.2-1.src.rpm Preparing... ################################################## thermal-daemon ################################################## + rm -f thermal-daemon-2.2-1.src.rpm + install -m 700 -d /tmp/B.U5nJyJ/BUILD/tmp + TMPDIR=/tmp/B.U5nJyJ/BUILD/tmp + exec nice -n 0 rpmbuild -bp --short-circuit --nodeps --define '_topdir /tmp/B.U5nJyJ' --define '_specdir %{_topdir}' --define '_sourcedir %{_specdir}' --define '_rpmdir %{_topdir}/RPMS' --define '_builddir %{_topdir}/BUILD' --target x32-pld-linux --define 'prep exit 0' /tmp/B.U5nJyJ/thermal-daemon.spec Building target platforms: x32-pld-linux checking BuildConflict-ing packages no BuildConflicts found checking BR rpm: Building target platforms: x32-pld-linux no BR needed building RPM using: set -ex; : build-id: c9a6bd22-b571-4908-bde1-6eaba6edaef2; TMPDIR=/tmp/B.U5nJyJ/BUILD/tmp exec nice -n 0 rpmbuild -bb --define '_smp_mflags -j9' --define '_make_opts -Otarget' --define '_pld_builder 1' --define '_topdir /tmp/B.U5nJyJ' --define '_specdir %{_topdir}' --define '_sourcedir %{_specdir}' --define '_rpmdir %{_topdir}/RPMS' --define '_builddir %{_topdir}/BUILD' --target x32-pld-linux /tmp/B.U5nJyJ/thermal-daemon.spec + : build-id: c9a6bd22-b571-4908-bde1-6eaba6edaef2 + TMPDIR=/tmp/B.U5nJyJ/BUILD/tmp + exec nice -n 0 rpmbuild -bb --define '_smp_mflags -j9' --define '_make_opts -Otarget' --define '_pld_builder 1' --define '_topdir /tmp/B.U5nJyJ' --define '_specdir %{_topdir}' --define '_sourcedir %{_specdir}' --define '_rpmdir %{_topdir}/RPMS' --define '_builddir %{_topdir}/BUILD' --target x32-pld-linux /tmp/B.U5nJyJ/thermal-daemon.spec Building target platforms: x32-pld-linux Executing(%prep): /bin/sh -e /tmp/B.U5nJyJ/BUILD/tmp/rpm-tmp.22453 + umask 022 + cd /tmp/B.U5nJyJ/BUILD + cd /tmp/B.U5nJyJ/BUILD + rm -rf thermal_daemon-2.2 + /bin/gzip -dc /tmp/B.U5nJyJ/thermal-daemon-2.2.tar.gz + /bin/tar -xf - + STATUS=0 + '[' 0 -ne 0 ']' + cd thermal_daemon-2.2 + /bin/id -u + '[' 1000 '=' 0 ']' + /bin/id -u + '[' 1000 '=' 0 ']' + /bin/chmod -Rf a+rX,u+w,g-w,o-w . + exit 0 Executing(%build): /bin/sh -e /tmp/B.U5nJyJ/BUILD/tmp/rpm-tmp.22453 HOME=/home/users/builder PATH=/home/users/builder/GNUstep/Tools:/bin:/usr/bin:/usr/local/bin TMPDIR=/tmp/B.U5nJyJ/BUILD/tmp + umask 022 + cd /tmp/B.U5nJyJ/BUILD + cd thermal_daemon-2.2 + install -d build-aux + aclocal + autoconf + autoheader + automake -a -c -f --foreign configure.ac:56: installing 'build-aux/compile' configure.ac:13: installing 'build-aux/install-sh' configure.ac:13: installing 'build-aux/missing' Makefile.am: installing 'build-aux/depcomp' + ./configure 'LDFLAGS=-Wl,--as-needed -Wl,--no-copy-dt-needed-entries -Wl,-z,relro -Wl,-z,combreloc ' 'CFLAGS=-O2 -fwrapv -pipe -Wformat -Werror=format-security -gdwarf-4 -fno-debug-types-section -fvar-tracking-assignments -g2 -Wp,-D_FORTIFY_SOURCE=2 -fstack-protector-strong --param=ssp-buffer-size=4 -Werror=trampolines -fPIC -mtune=generic -march=x86-64 -gdwarf-4 -fno-debug-types-section -fvar-tracking-assignments -g2 ' 'CXXFLAGS=-O2 -fwrapv -pipe -Wformat -Werror=format-security -gdwarf-4 -fno-debug-types-section -fvar-tracking-assignments -g2 -Wp,-D_FORTIFY_SOURCE=2 -fstack-protector-strong --param=ssp-buffer-size=4 -Werror=trampolines -fPIC -mtune=generic -march=x86-64 -gdwarf-4 -fno-debug-types-section -fvar-tracking-assignments -g2 ' 'FFLAGS=-O2 -fwrapv -pipe -Wformat -Werror=format-security -gdwarf-4 -fno-debug-types-section -fvar-tracking-assignments -g2 -Wp,-D_FORTIFY_SOURCE=2 -fstack-protector-strong --param=ssp-buffer-size=4 -Werror=trampolines -fPIC -mtune=generic -march=x86-64 -gdwarf-4 -fno-debug-types-section -fvar-tracking-assignments -g2 ' 'FCFLAGS=-O2 -fwrapv -pipe -Wformat -Werror=format-security -gdwarf-4 -fno-debug-types-section -fvar-tracking-assignments -g2 -Wp,-D_FORTIFY_SOURCE=2 -fstack-protector-strong --param=ssp-buffer-size=4 -Werror=trampolines -fPIC -mtune=generic -march=x86-64 -gdwarf-4 -fno-debug-types-section -fvar-tracking-assignments -g2 ' 'CPPFLAGS=' 'CC=x86_64-pld-linux-gnux32-gcc' 'CXX=x86_64-pld-linux-gnux32-g++' '--host=x86_64-pld-linux-gnux32' '--build=x86_64-pld-linux-gnux32' '--prefix=/usr' '--exec-prefix=/usr' '--bindir=/usr/bin' '--sbindir=/usr/sbin' '--sysconfdir=/etc' '--datadir=/usr/share' '--includedir=/usr/include' '--libdir=/usr/libx32' '--libexecdir=/usr/libexec' '--localstatedir=/var' '--sharedstatedir=/var/lib' '--mandir=/usr/share/man' '--infodir=/usr/share/info' '--x-libraries=/usr/libx32' checking for a BSD-compatible install... /usr/bin/install -c checking whether build environment is sane... yes checking for a thread-safe mkdir -p... /bin/mkdir -p checking for mawk... mawk checking whether make sets $(MAKE)... yes checking whether make supports nested variables... yes checking whether to enable maintainer-specific portions of Makefiles... yes checking for x86_64-pld-linux-gnux32-pkg-config... /usr/bin/x86_64-pld-linux-gnux32-pkg-config checking pkg-config is at least version 0.9.0... yes System paths: prefix: /usr exec_prefix: /usr systemdunitdir: /lib/systemd/system tdbinary: /usr/sbin/thermald tdconfdir: /etc/thermald tdrundir: /var/run/thermald checking whether make supports the include directive... yes (GNU style) checking for x86_64-pld-linux-gnux32-gcc... x86_64-pld-linux-gnux32-gcc checking whether the C compiler works... yes checking for C compiler default output file name... a.out checking for suffix of executables... checking whether we are cross compiling... no checking for suffix of object files... o checking whether we are using the GNU C compiler... yes checking whether x86_64-pld-linux-gnux32-gcc accepts -g... yes checking for x86_64-pld-linux-gnux32-gcc option to accept ISO C89... none needed checking whether x86_64-pld-linux-gnux32-gcc understands -c and -o together... yes checking dependency style of x86_64-pld-linux-gnux32-gcc... gcc3 checking for dbus_glib_global_set_disable_legacy_property_access in -ldbus-glib-1... yes checking for dbus-1 >= 1.1 dbus-glib-1 >= 0.94... yes checking for gio-unix-2.0 >= 2.22 gmodule-2.0... yes checking for libxml-2.0 >= 2.4... yes checking for x86_64-pld-linux-gnux32-gcc... (cached) x86_64-pld-linux-gnux32-gcc checking whether we are using the GNU C compiler... (cached) yes checking whether x86_64-pld-linux-gnux32-gcc accepts -g... (cached) yes checking for x86_64-pld-linux-gnux32-gcc option to accept ISO C89... (cached) none needed checking whether x86_64-pld-linux-gnux32-gcc understands -c and -o together... (cached) yes checking dependency style of x86_64-pld-linux-gnux32-gcc... (cached) gcc3 checking how to run the C preprocessor... x86_64-pld-linux-gnux32-gcc -E checking whether we are using the GNU C++ compiler... yes checking whether x86_64-pld-linux-gnux32-g++ accepts -g... yes checking dependency style of x86_64-pld-linux-gnux32-g++... gcc3 checking for an ANSI C-conforming const... yes checking for inline... inline checking for grep that handles long lines and -e... /bin/grep checking for egrep... /bin/grep -E checking for ANSI C header files... yes checking for sys/types.h... yes checking for sys/stat.h... yes checking for stdlib.h... yes checking for string.h... yes checking for memory.h... yes checking for strings.h... yes checking for inttypes.h... yes checking for stdint.h... yes checking for unistd.h... yes checking for size_t... yes checking whether C compiler accepts -Werror -Wall... yes checking whether C compiler accepts -Werror -Wclobbered... yes checking whether C compiler accepts -Werror -Wempty-body... yes checking whether C compiler accepts -Werror -Werror... yes checking whether C compiler accepts -Werror -Wformat... yes checking whether C compiler accepts -Werror -Wignored-qualifiers... yes checking whether C compiler accepts -Werror -Wmissing-field-initializers... yes checking whether C compiler accepts -Werror -Wreorder... no checking whether C compiler accepts -Werror -Wreturn-type... yes checking whether C compiler accepts -Werror -Wsign-compare... yes checking whether C compiler accepts -Werror -Wtype-limits... yes checking whether C compiler accepts -Werror -Wuninitialized... yes checking whether C compiler accepts -Werror -Wunused-but-set-variable... yes checking that generated files are newer than configure... done configure: creating ./config.status config.status: creating Makefile config.status: creating data/Makefile config.status: creating config.h config.status: executing depfiles commands + /usr/bin/make -Otarget -j9 dbus-binding-tool --prefix=thd_dbus_interface --mode=glib-server --output=thd_dbus_interface.h src/thd_dbus_interface.xml WARNING: Using --header and --body at the same time is deprecated; use --body --prototypes instead INFO: Reading /tmp/B.U5nJyJ/BUILD/tmp/dbus-binding-tool-c-marshallers.2TE3M0... /usr/bin/make all-recursive Making all in data make[2]: Entering directory '/tmp/B.U5nJyJ/BUILD/thermal_daemon-2.2/data' sed -e 's|@bindir[@]|/usr/bin|g' -e 's|@sbindir[@]|/usr/sbin|g' -e 's|@sysconfdir[@]|/etc|g' -e 's|@localstatedir[@]|/var|g' org.freedesktop.thermald.service.in >org.freedesktop.thermald.service make[2]: Leaving directory '/tmp/B.U5nJyJ/BUILD/thermal_daemon-2.2/data' make[2]: Entering directory '/tmp/B.U5nJyJ/BUILD/thermal_daemon-2.2/data' sed -e 's|@bindir[@]|/usr/bin|g' -e 's|@sbindir[@]|/usr/sbin|g' -e 's|@sysconfdir[@]|/etc|g' -e 's|@localstatedir[@]|/var|g' thermald.service.in >thermald.service make[2]: Leaving directory '/tmp/B.U5nJyJ/BUILD/thermal_daemon-2.2/data' make[2]: Entering directory '/tmp/B.U5nJyJ/BUILD/thermal_daemon-2.2' x86_64-pld-linux-gnux32-g++ -DHAVE_CONFIG_H -I. -I./src -DTDLOCALEDIR=\"/usr/share/locale\" -DGLIB_SUPPORT -I/usr/include/dbus-1.0 -I/usr/libx32/dbus-1.0/include -I/usr/include/glib-2.0 -I/usr/libx32/glib-2.0/include -DGLIB_VERSION_MIN_REQUIRED=GLIB_VERSION_2_26 -I/usr/include/libxml2 -DTDRUNDIR=\"/var/run/thermald\" -DTDCONFDIR=\"/etc/thermald\" -O2 -fwrapv -pipe -Wformat -Werror=format-security -gdwarf-4 -fno-debug-types-section -fvar-tracking-assignments -g2 -Wp,-D_FORTIFY_SOURCE=2 -fstack-protector-strong --param=ssp-buffer-size=4 -Werror=trampolines -fPIC -mtune=generic -march=x86-64 -gdwarf-4 -fno-debug-types-section -fvar-tracking-assignments -g2 -Wall -Wclobbered -Wempty-body -Werror -Wformat -Wignored-qualifiers -Wmissing-field-initializers -Wreturn-type -Wsign-compare -Wtype-limits -Wuninitialized -Wunused-but-set-variable -I src -O2 -fwrapv -pipe -Wformat -Werror=format-security -gdwarf-4 -fno-debug-types-section -fvar-tracking-assignments -g2 -Wp,-D_FORTIFY_SOURCE=2 -fstack-protector-strong --param=ssp-buffer-size=4 -Werror=trampolines -fPIC -mtune=generic -march=x86-64 -gdwarf-4 -fno-debug-types-section -fvar-tracking-assignments -g2 -Wall -Wclobbered -Wempty-body -Werror -Wformat -Wignored-qualifiers -Wmissing-field-initializers -Wreturn-type -Wsign-compare -Wtype-limits -Wuninitialized -Wunused-but-set-variable -MT src/thermald-thd_sys_fs.o -MD -MP -MF src/.deps/thermald-thd_sys_fs.Tpo -c -o src/thermald-thd_sys_fs.o `test -f 'src/thd_sys_fs.cpp' || echo './'`src/thd_sys_fs.cpp mv -f src/.deps/thermald-thd_sys_fs.Tpo src/.deps/thermald-thd_sys_fs.Po make[2]: Leaving directory '/tmp/B.U5nJyJ/BUILD/thermal_daemon-2.2' make[2]: Entering directory '/tmp/B.U5nJyJ/BUILD/thermal_daemon-2.2' x86_64-pld-linux-gnux32-g++ -DHAVE_CONFIG_H -I. -I./src -DTDLOCALEDIR=\"/usr/share/locale\" -DGLIB_SUPPORT -I/usr/include/dbus-1.0 -I/usr/libx32/dbus-1.0/include -I/usr/include/glib-2.0 -I/usr/libx32/glib-2.0/include -DGLIB_VERSION_MIN_REQUIRED=GLIB_VERSION_2_26 -I/usr/include/libxml2 -DTDRUNDIR=\"/var/run/thermald\" -DTDCONFDIR=\"/etc/thermald\" -O2 -fwrapv -pipe -Wformat -Werror=format-security -gdwarf-4 -fno-debug-types-section -fvar-tracking-assignments -g2 -Wp,-D_FORTIFY_SOURCE=2 -fstack-protector-strong --param=ssp-buffer-size=4 -Werror=trampolines -fPIC -mtune=generic -march=x86-64 -gdwarf-4 -fno-debug-types-section -fvar-tracking-assignments -g2 -Wall -Wclobbered -Wempty-body -Werror -Wformat -Wignored-qualifiers -Wmissing-field-initializers -Wreturn-type -Wsign-compare -Wtype-limits -Wuninitialized -Wunused-but-set-variable -I src -O2 -fwrapv -pipe -Wformat -Werror=format-security -gdwarf-4 -fno-debug-types-section -fvar-tracking-assignments -g2 -Wp,-D_FORTIFY_SOURCE=2 -fstack-protector-strong --param=ssp-buffer-size=4 -Werror=trampolines -fPIC -mtune=generic -march=x86-64 -gdwarf-4 -fno-debug-types-section -fvar-tracking-assignments -g2 -Wall -Wclobbered -Wempty-body -Werror -Wformat -Wignored-qualifiers -Wmissing-field-initializers -Wreturn-type -Wsign-compare -Wtype-limits -Wuninitialized -Wunused-but-set-variable -MT src/thermald-main.o -MD -MP -MF src/.deps/thermald-main.Tpo -c -o src/thermald-main.o `test -f 'src/main.cpp' || echo './'`src/main.cpp src/main.cpp: In function 'void thd_logger(const gchar*, GLogLevelFlags, const gchar*, gpointer)': src/main.cpp:124:31: error: format '%ld' expects argument of type 'long int', but argument 3 has type 'time_t' {aka 'long long int'} [-Werror=format=] 124 | syslog(syslog_priority, "[%ld]%s%s", seconds, prefix, message); | ~~^ ~~~~~~~ | | | | long int time_t {aka long long int} | %lld src/main.cpp:126:15: error: format '%ld' expects argument of type 'long int', but argument 2 has type 'time_t' {aka 'long long int'} [-Werror=format=] 126 | g_print("[%ld]%s%s", seconds, prefix, message); | ~~^ ~~~~~~~ | | | | long int time_t {aka long long int} | %lld cc1plus: all warnings being treated as errors make[2]: *** [Makefile:774: src/thermald-main.o] Error 1 make[2]: Leaving directory '/tmp/B.U5nJyJ/BUILD/thermal_daemon-2.2' make[2]: *** Waiting for unfinished jobs.... make[2]: Entering directory '/tmp/B.U5nJyJ/BUILD/thermal_daemon-2.2' x86_64-pld-linux-gnux32-g++ -DHAVE_CONFIG_H -I. -I./src -DTDLOCALEDIR=\"/usr/share/locale\" -DGLIB_SUPPORT -I/usr/include/dbus-1.0 -I/usr/libx32/dbus-1.0/include -I/usr/include/glib-2.0 -I/usr/libx32/glib-2.0/include -DGLIB_VERSION_MIN_REQUIRED=GLIB_VERSION_2_26 -I/usr/include/libxml2 -DTDRUNDIR=\"/var/run/thermald\" -DTDCONFDIR=\"/etc/thermald\" -O2 -fwrapv -pipe -Wformat -Werror=format-security -gdwarf-4 -fno-debug-types-section -fvar-tracking-assignments -g2 -Wp,-D_FORTIFY_SOURCE=2 -fstack-protector-strong --param=ssp-buffer-size=4 -Werror=trampolines -fPIC -mtune=generic -march=x86-64 -gdwarf-4 -fno-debug-types-section -fvar-tracking-assignments -g2 -Wall -Wclobbered -Wempty-body -Werror -Wformat -Wignored-qualifiers -Wmissing-field-initializers -Wreturn-type -Wsign-compare -Wtype-limits -Wuninitialized -Wunused-but-set-variable -I src -O2 -fwrapv -pipe -Wformat -Werror=format-security -gdwarf-4 -fno-debug-types-section -fvar-tracking-assignments -g2 -Wp,-D_FORTIFY_SOURCE=2 -fstack-protector-strong --param=ssp-buffer-size=4 -Werror=trampolines -fPIC -mtune=generic -march=x86-64 -gdwarf-4 -fno-debug-types-section -fvar-tracking-assignments -g2 -Wall -Wclobbered -Wempty-body -Werror -Wformat -Wignored-qualifiers -Wmissing-field-initializers -Wreturn-type -Wsign-compare -Wtype-limits -Wuninitialized -Wunused-but-set-variable -MT src/thermald-thd_cdev.o -MD -MP -MF src/.deps/thermald-thd_cdev.Tpo -c -o src/thermald-thd_cdev.o `test -f 'src/thd_cdev.cpp' || echo './'`src/thd_cdev.cpp mv -f src/.deps/thermald-thd_cdev.Tpo src/.deps/thermald-thd_cdev.Po make[2]: Leaving directory '/tmp/B.U5nJyJ/BUILD/thermal_daemon-2.2' make[2]: Entering directory '/tmp/B.U5nJyJ/BUILD/thermal_daemon-2.2' x86_64-pld-linux-gnux32-g++ -DHAVE_CONFIG_H -I. -I./src -DTDLOCALEDIR=\"/usr/share/locale\" -DGLIB_SUPPORT -I/usr/include/dbus-1.0 -I/usr/libx32/dbus-1.0/include -I/usr/include/glib-2.0 -I/usr/libx32/glib-2.0/include -DGLIB_VERSION_MIN_REQUIRED=GLIB_VERSION_2_26 -I/usr/include/libxml2 -DTDRUNDIR=\"/var/run/thermald\" -DTDCONFDIR=\"/etc/thermald\" -O2 -fwrapv -pipe -Wformat -Werror=format-security -gdwarf-4 -fno-debug-types-section -fvar-tracking-assignments -g2 -Wp,-D_FORTIFY_SOURCE=2 -fstack-protector-strong --param=ssp-buffer-size=4 -Werror=trampolines -fPIC -mtune=generic -march=x86-64 -gdwarf-4 -fno-debug-types-section -fvar-tracking-assignments -g2 -Wall -Wclobbered -Wempty-body -Werror -Wformat -Wignored-qualifiers -Wmissing-field-initializers -Wreturn-type -Wsign-compare -Wtype-limits -Wuninitialized -Wunused-but-set-variable -I src -O2 -fwrapv -pipe -Wformat -Werror=format-security -gdwarf-4 -fno-debug-types-section -fvar-tracking-assignments -g2 -Wp,-D_FORTIFY_SOURCE=2 -fstack-protector-strong --param=ssp-buffer-size=4 -Werror=trampolines -fPIC -mtune=generic -march=x86-64 -gdwarf-4 -fno-debug-types-section -fvar-tracking-assignments -g2 -Wall -Wclobbered -Wempty-body -Werror -Wformat -Wignored-qualifiers -Wmissing-field-initializers -Wreturn-type -Wsign-compare -Wtype-limits -Wuninitialized -Wunused-but-set-variable -MT src/thermald-thd_cdev_therm_sys_fs.o -MD -MP -MF src/.deps/thermald-thd_cdev_therm_sys_fs.Tpo -c -o src/thermald-thd_cdev_therm_sys_fs.o `test -f 'src/thd_cdev_therm_sys_fs.cpp' || echo './'`src/thd_cdev_therm_sys_fs.cpp mv -f src/.deps/thermald-thd_cdev_therm_sys_fs.Tpo src/.deps/thermald-thd_cdev_therm_sys_fs.Po make[2]: Leaving directory '/tmp/B.U5nJyJ/BUILD/thermal_daemon-2.2' make[2]: Entering directory '/tmp/B.U5nJyJ/BUILD/thermal_daemon-2.2' x86_64-pld-linux-gnux32-g++ -DHAVE_CONFIG_H -I. -I./src -DTDLOCALEDIR=\"/usr/share/locale\" -DGLIB_SUPPORT -I/usr/include/dbus-1.0 -I/usr/libx32/dbus-1.0/include -I/usr/include/glib-2.0 -I/usr/libx32/glib-2.0/include -DGLIB_VERSION_MIN_REQUIRED=GLIB_VERSION_2_26 -I/usr/include/libxml2 -DTDRUNDIR=\"/var/run/thermald\" -DTDCONFDIR=\"/etc/thermald\" -O2 -fwrapv -pipe -Wformat -Werror=format-security -gdwarf-4 -fno-debug-types-section -fvar-tracking-assignments -g2 -Wp,-D_FORTIFY_SOURCE=2 -fstack-protector-strong --param=ssp-buffer-size=4 -Werror=trampolines -fPIC -mtune=generic -march=x86-64 -gdwarf-4 -fno-debug-types-section -fvar-tracking-assignments -g2 -Wall -Wclobbered -Wempty-body -Werror -Wformat -Wignored-qualifiers -Wmissing-field-initializers -Wreturn-type -Wsign-compare -Wtype-limits -Wuninitialized -Wunused-but-set-variable -I src -O2 -fwrapv -pipe -Wformat -Werror=format-security -gdwarf-4 -fno-debug-types-section -fvar-tracking-assignments -g2 -Wp,-D_FORTIFY_SOURCE=2 -fstack-protector-strong --param=ssp-buffer-size=4 -Werror=trampolines -fPIC -mtune=generic -march=x86-64 -gdwarf-4 -fno-debug-types-section -fvar-tracking-assignments -g2 -Wall -Wclobbered -Wempty-body -Werror -Wformat -Wignored-qualifiers -Wmissing-field-initializers -Wreturn-type -Wsign-compare -Wtype-limits -Wuninitialized -Wunused-but-set-variable -MT src/thermald-thd_trip_point.o -MD -MP -MF src/.deps/thermald-thd_trip_point.Tpo -c -o src/thermald-thd_trip_point.o `test -f 'src/thd_trip_point.cpp' || echo './'`src/thd_trip_point.cpp mv -f src/.deps/thermald-thd_trip_point.Tpo src/.deps/thermald-thd_trip_point.Po make[2]: Leaving directory '/tmp/B.U5nJyJ/BUILD/thermal_daemon-2.2' make[2]: Entering directory '/tmp/B.U5nJyJ/BUILD/thermal_daemon-2.2' x86_64-pld-linux-gnux32-g++ -DHAVE_CONFIG_H -I. -I./src -DTDLOCALEDIR=\"/usr/share/locale\" -DGLIB_SUPPORT -I/usr/include/dbus-1.0 -I/usr/libx32/dbus-1.0/include -I/usr/include/glib-2.0 -I/usr/libx32/glib-2.0/include -DGLIB_VERSION_MIN_REQUIRED=GLIB_VERSION_2_26 -I/usr/include/libxml2 -DTDRUNDIR=\"/var/run/thermald\" -DTDCONFDIR=\"/etc/thermald\" -O2 -fwrapv -pipe -Wformat -Werror=format-security -gdwarf-4 -fno-debug-types-section -fvar-tracking-assignments -g2 -Wp,-D_FORTIFY_SOURCE=2 -fstack-protector-strong --param=ssp-buffer-size=4 -Werror=trampolines -fPIC -mtune=generic -march=x86-64 -gdwarf-4 -fno-debug-types-section -fvar-tracking-assignments -g2 -Wall -Wclobbered -Wempty-body -Werror -Wformat -Wignored-qualifiers -Wmissing-field-initializers -Wreturn-type -Wsign-compare -Wtype-limits -Wuninitialized -Wunused-but-set-variable -I src -O2 -fwrapv -pipe -Wformat -Werror=format-security -gdwarf-4 -fno-debug-types-section -fvar-tracking-assignments -g2 -Wp,-D_FORTIFY_SOURCE=2 -fstack-protector-strong --param=ssp-buffer-size=4 -Werror=trampolines -fPIC -mtune=generic -march=x86-64 -gdwarf-4 -fno-debug-types-section -fvar-tracking-assignments -g2 -Wall -Wclobbered -Wempty-body -Werror -Wformat -Wignored-qualifiers -Wmissing-field-initializers -Wreturn-type -Wsign-compare -Wtype-limits -Wuninitialized -Wunused-but-set-variable -MT src/thermald-thd_dbus_interface.o -MD -MP -MF src/.deps/thermald-thd_dbus_interface.Tpo -c -o src/thermald-thd_dbus_interface.o `test -f 'src/thd_dbus_interface.cpp' || echo './'`src/thd_dbus_interface.cpp mv -f src/.deps/thermald-thd_dbus_interface.Tpo src/.deps/thermald-thd_dbus_interface.Po make[2]: Leaving directory '/tmp/B.U5nJyJ/BUILD/thermal_daemon-2.2' make[2]: Entering directory '/tmp/B.U5nJyJ/BUILD/thermal_daemon-2.2' x86_64-pld-linux-gnux32-g++ -DHAVE_CONFIG_H -I. -I./src -DTDLOCALEDIR=\"/usr/share/locale\" -DGLIB_SUPPORT -I/usr/include/dbus-1.0 -I/usr/libx32/dbus-1.0/include -I/usr/include/glib-2.0 -I/usr/libx32/glib-2.0/include -DGLIB_VERSION_MIN_REQUIRED=GLIB_VERSION_2_26 -I/usr/include/libxml2 -DTDRUNDIR=\"/var/run/thermald\" -DTDCONFDIR=\"/etc/thermald\" -O2 -fwrapv -pipe -Wformat -Werror=format-security -gdwarf-4 -fno-debug-types-section -fvar-tracking-assignments -g2 -Wp,-D_FORTIFY_SOURCE=2 -fstack-protector-strong --param=ssp-buffer-size=4 -Werror=trampolines -fPIC -mtune=generic -march=x86-64 -gdwarf-4 -fno-debug-types-section -fvar-tracking-assignments -g2 -Wall -Wclobbered -Wempty-body -Werror -Wformat -Wignored-qualifiers -Wmissing-field-initializers -Wreturn-type -Wsign-compare -Wtype-limits -Wuninitialized -Wunused-but-set-variable -I src -O2 -fwrapv -pipe -Wformat -Werror=format-security -gdwarf-4 -fno-debug-types-section -fvar-tracking-assignments -g2 -Wp,-D_FORTIFY_SOURCE=2 -fstack-protector-strong --param=ssp-buffer-size=4 -Werror=trampolines -fPIC -mtune=generic -march=x86-64 -gdwarf-4 -fno-debug-types-section -fvar-tracking-assignments -g2 -Wall -Wclobbered -Wempty-body -Werror -Wformat -Wignored-qualifiers -Wmissing-field-initializers -Wreturn-type -Wsign-compare -Wtype-limits -Wuninitialized -Wunused-but-set-variable -MT src/thermald-thd_zone.o -MD -MP -MF src/.deps/thermald-thd_zone.Tpo -c -o src/thermald-thd_zone.o `test -f 'src/thd_zone.cpp' || echo './'`src/thd_zone.cpp mv -f src/.deps/thermald-thd_zone.Tpo src/.deps/thermald-thd_zone.Po make[2]: Leaving directory '/tmp/B.U5nJyJ/BUILD/thermal_daemon-2.2' make[2]: Entering directory '/tmp/B.U5nJyJ/BUILD/thermal_daemon-2.2' x86_64-pld-linux-gnux32-g++ -DHAVE_CONFIG_H -I. -I./src -DTDLOCALEDIR=\"/usr/share/locale\" -DGLIB_SUPPORT -I/usr/include/dbus-1.0 -I/usr/libx32/dbus-1.0/include -I/usr/include/glib-2.0 -I/usr/libx32/glib-2.0/include -DGLIB_VERSION_MIN_REQUIRED=GLIB_VERSION_2_26 -I/usr/include/libxml2 -DTDRUNDIR=\"/var/run/thermald\" -DTDCONFDIR=\"/etc/thermald\" -O2 -fwrapv -pipe -Wformat -Werror=format-security -gdwarf-4 -fno-debug-types-section -fvar-tracking-assignments -g2 -Wp,-D_FORTIFY_SOURCE=2 -fstack-protector-strong --param=ssp-buffer-size=4 -Werror=trampolines -fPIC -mtune=generic -march=x86-64 -gdwarf-4 -fno-debug-types-section -fvar-tracking-assignments -g2 -Wall -Wclobbered -Wempty-body -Werror -Wformat -Wignored-qualifiers -Wmissing-field-initializers -Wreturn-type -Wsign-compare -Wtype-limits -Wuninitialized -Wunused-but-set-variable -I src -O2 -fwrapv -pipe -Wformat -Werror=format-security -gdwarf-4 -fno-debug-types-section -fvar-tracking-assignments -g2 -Wp,-D_FORTIFY_SOURCE=2 -fstack-protector-strong --param=ssp-buffer-size=4 -Werror=trampolines -fPIC -mtune=generic -march=x86-64 -gdwarf-4 -fno-debug-types-section -fvar-tracking-assignments -g2 -Wall -Wclobbered -Wempty-body -Werror -Wformat -Wignored-qualifiers -Wmissing-field-initializers -Wreturn-type -Wsign-compare -Wtype-limits -Wuninitialized -Wunused-but-set-variable -MT src/thermald-thd_zone_cpu.o -MD -MP -MF src/.deps/thermald-thd_zone_cpu.Tpo -c -o src/thermald-thd_zone_cpu.o `test -f 'src/thd_zone_cpu.cpp' || echo './'`src/thd_zone_cpu.cpp mv -f src/.deps/thermald-thd_zone_cpu.Tpo src/.deps/thermald-thd_zone_cpu.Po make[2]: Leaving directory '/tmp/B.U5nJyJ/BUILD/thermal_daemon-2.2' make[2]: Entering directory '/tmp/B.U5nJyJ/BUILD/thermal_daemon-2.2' x86_64-pld-linux-gnux32-g++ -DHAVE_CONFIG_H -I. -I./src -DTDLOCALEDIR=\"/usr/share/locale\" -DGLIB_SUPPORT -I/usr/include/dbus-1.0 -I/usr/libx32/dbus-1.0/include -I/usr/include/glib-2.0 -I/usr/libx32/glib-2.0/include -DGLIB_VERSION_MIN_REQUIRED=GLIB_VERSION_2_26 -I/usr/include/libxml2 -DTDRUNDIR=\"/var/run/thermald\" -DTDCONFDIR=\"/etc/thermald\" -O2 -fwrapv -pipe -Wformat -Werror=format-security -gdwarf-4 -fno-debug-types-section -fvar-tracking-assignments -g2 -Wp,-D_FORTIFY_SOURCE=2 -fstack-protector-strong --param=ssp-buffer-size=4 -Werror=trampolines -fPIC -mtune=generic -march=x86-64 -gdwarf-4 -fno-debug-types-section -fvar-tracking-assignments -g2 -Wall -Wclobbered -Wempty-body -Werror -Wformat -Wignored-qualifiers -Wmissing-field-initializers -Wreturn-type -Wsign-compare -Wtype-limits -Wuninitialized -Wunused-but-set-variable -I src -O2 -fwrapv -pipe -Wformat -Werror=format-security -gdwarf-4 -fno-debug-types-section -fvar-tracking-assignments -g2 -Wp,-D_FORTIFY_SOURCE=2 -fstack-protector-strong --param=ssp-buffer-size=4 -Werror=trampolines -fPIC -mtune=generic -march=x86-64 -gdwarf-4 -fno-debug-types-section -fvar-tracking-assignments -g2 -Wall -Wclobbered -Wempty-body -Werror -Wformat -Wignored-qualifiers -Wmissing-field-initializers -Wreturn-type -Wsign-compare -Wtype-limits -Wuninitialized -Wunused-but-set-variable -MT src/thermald-thd_engine_default.o -MD -MP -MF src/.deps/thermald-thd_engine_default.Tpo -c -o src/thermald-thd_engine_default.o `test -f 'src/thd_engine_default.cpp' || echo './'`src/thd_engine_default.cpp mv -f src/.deps/thermald-thd_engine_default.Tpo src/.deps/thermald-thd_engine_default.Po make[2]: Leaving directory '/tmp/B.U5nJyJ/BUILD/thermal_daemon-2.2' make[2]: Entering directory '/tmp/B.U5nJyJ/BUILD/thermal_daemon-2.2' x86_64-pld-linux-gnux32-g++ -DHAVE_CONFIG_H -I. -I./src -DTDLOCALEDIR=\"/usr/share/locale\" -DGLIB_SUPPORT -I/usr/include/dbus-1.0 -I/usr/libx32/dbus-1.0/include -I/usr/include/glib-2.0 -I/usr/libx32/glib-2.0/include -DGLIB_VERSION_MIN_REQUIRED=GLIB_VERSION_2_26 -I/usr/include/libxml2 -DTDRUNDIR=\"/var/run/thermald\" -DTDCONFDIR=\"/etc/thermald\" -O2 -fwrapv -pipe -Wformat -Werror=format-security -gdwarf-4 -fno-debug-types-section -fvar-tracking-assignments -g2 -Wp,-D_FORTIFY_SOURCE=2 -fstack-protector-strong --param=ssp-buffer-size=4 -Werror=trampolines -fPIC -mtune=generic -march=x86-64 -gdwarf-4 -fno-debug-types-section -fvar-tracking-assignments -g2 -Wall -Wclobbered -Wempty-body -Werror -Wformat -Wignored-qualifiers -Wmissing-field-initializers -Wreturn-type -Wsign-compare -Wtype-limits -Wuninitialized -Wunused-but-set-variable -I src -O2 -fwrapv -pipe -Wformat -Werror=format-security -gdwarf-4 -fno-debug-types-section -fvar-tracking-assignments -g2 -Wp,-D_FORTIFY_SOURCE=2 -fstack-protector-strong --param=ssp-buffer-size=4 -Werror=trampolines -fPIC -mtune=generic -march=x86-64 -gdwarf-4 -fno-debug-types-section -fvar-tracking-assignments -g2 -Wall -Wclobbered -Wempty-body -Werror -Wformat -Wignored-qualifiers -Wmissing-field-initializers -Wreturn-type -Wsign-compare -Wtype-limits -Wuninitialized -Wunused-but-set-variable -MT src/thermald-thd_engine.o -MD -MP -MF src/.deps/thermald-thd_engine.Tpo -c -o src/thermald-thd_engine.o `test -f 'src/thd_engine.cpp' || echo './'`src/thd_engine.cpp mv -f src/.deps/thermald-thd_engine.Tpo src/.deps/thermald-thd_engine.Po make[2]: Leaving directory '/tmp/B.U5nJyJ/BUILD/thermal_daemon-2.2' make[1]: *** [Makefile:1380: all-recursive] Error 1 make: *** [Makefile:527: all] Error 2 error: Bad exit status from /tmp/B.U5nJyJ/BUILD/tmp/rpm-tmp.22453 (%build) RPM build errors: Bad exit status from /tmp/B.U5nJyJ/BUILD/tmp/rpm-tmp.22453 (%build) ended at: Mon Jun 29 18:58:55 2020, done in 0:00:10.823374 error: No files produced. + chmod -R u+rwX /tmp/B.U5nJyJ/BUILD + rm -rf /tmp/B.U5nJyJ/tmp /tmp/B.U5nJyJ/BUILD + rm -rf /tmp/B.U5nJyJ Begin-PLD-Builder-Info Build-Time: user:24.75s sys:1.87s real:13.54s (faults io:1 non-io:574063) End-PLD-Builder-Info
[Back to list of logs] [View rpm -qa of builder]