FailedOk

th/SRPMS[OK]
th/x32[OK]
th/i686[OK]
th/x86_64[OK]

ac/SRPMS[OK]
ac/i386[OK]
ac/i586[OK]
ac/i686[OK]
ac/alpha[OK]
ac/amd64[OK]
ac/athlon[OK]
ac/ppc[OK]
ac/sparc[OK]
ac/sparc64[OK]

Advanced Search
main()
Powered by PLD Linux
(c) 2002-2017 PLD Team
$Revision: 1.37 $
Powered by /dev/null.
Your IP: 54.160.245.121

thunderbird 774257b9-6598-49e9-b7d4-ae6242ea236c

Status:Failed
Source URL:ftp://buildlogs.pld-linux.org/th/x32/FAIL/thunderbird,774257b9-6598-49e9-b7d4-ae6242ea236c.bz2
text/plain URL:View!
full text:View!
rpm -qa of builder:View!
Date:2017/10/11 10:08:56
Runtime:0:00:31.471359

Toc:

  • error 1
  • ImportError: No module named pkgutil
  • error 2
  • OSError: Command /tmp/B.BuheZx/BUILD/...ualenv/bin/python2.7 - setuptools pip wheel failed with error code 1
  • error 3
  • error: Bad exit status from /tmp/B.BuheZx/BUILD/tmp/rpm-tmp.42992 (%build)
  • error 4
  • RPM build errors:
  • error 5
  • error: No files produced.

Content:

+ unpack -qq /tmp/B.BuheZx/sq.xpi
+ typeset 'args=-qq' 'file=/tmp/B.BuheZx/sq.xpi'
+ cp -p /tmp/B.BuheZx/sq.xpi .
+ STATUS=0 
+ '[' 0 -ne 0 ']'
+ unpack -qq /tmp/B.BuheZx/sr.xpi
+ typeset 'args=-qq' 'file=/tmp/B.BuheZx/sr.xpi'
+ cp -p /tmp/B.BuheZx/sr.xpi .
+ STATUS=0 
+ '[' 0 -ne 0 ']'
+ unpack -qq /tmp/B.BuheZx/sv-SE.xpi
+ typeset 'args=-qq' 'file=/tmp/B.BuheZx/sv-SE.xpi'
+ cp -p /tmp/B.BuheZx/sv-SE.xpi .
+ STATUS=0 
+ '[' 0 -ne 0 ']'
+ unpack -qq /tmp/B.BuheZx/ta-LK.xpi
+ typeset 'args=-qq' 'file=/tmp/B.BuheZx/ta-LK.xpi'
+ cp -p /tmp/B.BuheZx/ta-LK.xpi .
+ STATUS=0 
+ '[' 0 -ne 0 ']'
+ unpack -qq /tmp/B.BuheZx/tr.xpi
+ typeset 'args=-qq' 'file=/tmp/B.BuheZx/tr.xpi'
+ cp -p /tmp/B.BuheZx/tr.xpi .
+ STATUS=0 
+ '[' 0 -ne 0 ']'
+ unpack -qq /tmp/B.BuheZx/uk.xpi
+ typeset 'args=-qq' 'file=/tmp/B.BuheZx/uk.xpi'
+ cp -p /tmp/B.BuheZx/uk.xpi .
+ STATUS=0 
+ '[' 0 -ne 0 ']'
+ unpack -qq /tmp/B.BuheZx/vi.xpi
+ typeset 'args=-qq' 'file=/tmp/B.BuheZx/vi.xpi'
+ cp -p /tmp/B.BuheZx/vi.xpi .
+ STATUS=0 
+ '[' 0 -ne 0 ']'
+ unpack -qq /tmp/B.BuheZx/zh-CN.xpi
+ typeset 'args=-qq' 'file=/tmp/B.BuheZx/zh-CN.xpi'
+ cp -p /tmp/B.BuheZx/zh-CN.xpi .
+ STATUS=0 
+ '[' 0 -ne 0 ']'
+ unpack -qq /tmp/B.BuheZx/zh-TW.xpi
+ typeset 'args=-qq' 'file=/tmp/B.BuheZx/zh-TW.xpi'
+ cp -p /tmp/B.BuheZx/zh-TW.xpi .
+ STATUS=0 
+ '[' 0 -ne 0 ']'
+ /bin/id -u
+ '[' 1000 '=' 0 ']'
+ /bin/id -u
+ '[' 1000 '=' 0 ']'
+ /bin/chmod -Rf a+rX,u+w,g-w,o-w .
+ echo 'Patch #0 (prefs.patch):'
Patch #0 (prefs.patch):
+ '[' -f /tmp/B.BuheZx/prefs.patch ']'
+ /bin/cat /tmp/B.BuheZx/prefs.patch
+ /usr/bin/patch -s -p1
+ echo 'Patch #1 (no-subshell.patch):'
Patch #1 (no-subshell.patch):
+ '[' -f /tmp/B.BuheZx/no-subshell.patch ']'
+ /bin/cat /tmp/B.BuheZx/no-subshell.patch
+ /usr/bin/patch -s -p1
+ echo 'Patch #2 (enable-addons.patch):'
Patch #2 (enable-addons.patch):
+ '[' -f /tmp/B.BuheZx/enable-addons.patch ']'
+ /bin/cat /tmp/B.BuheZx/enable-addons.patch
+ /usr/bin/patch -s -p1
+ echo 'Patch #3 (mozilla-1245783.patch):'
Patch #3 (mozilla-1245783.patch):
+ '[' -f /tmp/B.BuheZx/mozilla-1245783.patch ']'
+ /bin/cat /tmp/B.BuheZx/mozilla-1245783.patch
+ /usr/bin/patch -s -p1
+ exit 0
Executing(%build): /bin/sh -e /tmp/B.BuheZx/BUILD/tmp/rpm-tmp.42992
HOME=/home/users/builder
PATH=/home/users/builder/GNUstep/Tools:/usr/local/bin:/usr/bin:/bin
TMPDIR=/tmp/B.BuheZx/BUILD/tmp
+ umask 022
+ cd /tmp/B.BuheZx/BUILD
+ cd thunderbird-52.4.0
+ <<EOF 
+ >.mozconfig 
+ cat
+ mkdir -p /tmp/B.BuheZx/BUILD/thunderbird-52.4.0/obj-x32/config
+ ln -sf /tmp/B.BuheZx/BUILD/thunderbird-52.4.0/mozilla/config/android-common.mk /tmp/B.BuheZx/BUILD/thunderbird-52.4.0/mozilla/config/baseconfig.mk /tmp/B.BuheZx/BUILD/thunderbird-52.4.0/mozilla/config/config.mk /tmp/B.BuheZx/BUILD/thunderbird-52.4.0/mozilla/config/recurse.mk /tmp/B.BuheZx/BUILD/thunderbird-52.4.0/mozilla/config/rules.mk /tmp/B.BuheZx/BUILD/thunderbird-52.4.0/mozilla/config/static-checking-config.mk /tmp/B.BuheZx/BUILD/thunderbird-52.4.0/mozilla/config/version.mk /tmp/B.BuheZx/BUILD/thunderbird-52.4.0/obj-x32/config
+ /usr/bin/make -Otarget -j9 -j1 -f client.mk build 'AUTOCONF=/usr/bin/autoconf2_13' 'MOZ_MAKE_FLAGS=-j9'
mkdir -p '/tmp/B.BuheZx/BUILD/thunderbird-52.4.0/obj-x32/'
> /tmp/B.BuheZx/BUILD/thunderbird-52.4.0/obj-x32/.mozconfig.mk
Adding client.mk options from /tmp/B.BuheZx/BUILD/thunderbird-52.4.0/.mozconfig:
    MOZ_OBJDIR=/tmp/B.BuheZx/BUILD/thunderbird-52.4.0/obj-x32
    FOUND_MOZCONFIG := /tmp/B.BuheZx/BUILD/thunderbird-52.4.0/.mozconfig
make[1]: Entering directory '/tmp/B.BuheZx/BUILD/thunderbird-52.4.0'
cd /tmp/B.BuheZx/BUILD/thunderbird-52.4.0/obj-x32
/tmp/B.BuheZx/BUILD/thunderbird-52.4.0/configure
Creating Python environment
New python executable in /tmp/B.BuheZx/BUILD/thunderbird-52.4.0/obj-x32/_virtualenv/bin/python2.7
Also creating executable in /tmp/B.BuheZx/BUILD/thunderbird-52.4.0/obj-x32/_virtualenv/bin/python
Installing setuptools, pip, wheel...
  Complete output from command /tmp/B.BuheZx/BUILD/...ualenv/bin/python2.7 - setuptools pip wheel:
  Traceback (most recent call last):
  File "<stdin>", line 3, in <module>
ImportError: No module named pkgutil
----------------------------------------
...Installing setuptools, pip, wheel...done.
Traceback (most recent call last):
  File "/tmp/B.BuheZx/BUILD/thunderbird-52.4.0/mozilla/python/virtualenv/virtualenv.py", line 2325, in <module>
    main()
  File "/tmp/B.BuheZx/BUILD/thunderbird-52.4.0/mozilla/python/virtualenv/virtualenv.py", line 711, in main
    symlink=options.symlink and hasattr(os, 'symlink')) # MOZ: Make sure we don't use symlink when we don't have it
  File "/tmp/B.BuheZx/BUILD/thunderbird-52.4.0/mozilla/python/virtualenv/virtualenv.py", line 944, in create_environment
    download=download,
  File "/tmp/B.BuheZx/BUILD/thunderbird-52.4.0/mozilla/python/virtualenv/virtualenv.py", line 900, in install_wheel
    call_subprocess(cmd, show_stdout=False, extra_env=env, stdin=SCRIPT)
  File "/tmp/B.BuheZx/BUILD/thunderbird-52.4.0/mozilla/python/virtualenv/virtualenv.py", line 795, in call_subprocess
    % (cmd_desc, proc.returncode))
OSError: Command /tmp/B.BuheZx/BUILD/...ualenv/bin/python2.7 - setuptools pip wheel failed with error code 1
Traceback (most recent call last):
  File "/tmp/B.BuheZx/BUILD/thunderbird-52.4.0/configure.py", line 32, in <module>
    sys.exit(main(sys.argv))
  File "/tmp/B.BuheZx/BUILD/thunderbird-52.4.0/configure.py", line 24, in main
    sandbox.run(os.path.join(os.path.dirname(__file__), 'moz.configure'))
  File "/tmp/B.BuheZx/BUILD/thunderbird-52.4.0/mozilla/python/mozbuild/mozbuild/configure/__init__.py", line 334, in run
    self.include_file(path)
  File "/tmp/B.BuheZx/BUILD/thunderbird-52.4.0/mozilla/python/mozbuild/mozbuild/configure/__init__.py", line 325, in include_file
    exec_(code, self)
  File "/tmp/B.BuheZx/BUILD/thunderbird-52.4.0/mozilla/python/mozbuild/mozbuild/util.py", line 59, in exec_
    exec(object, globals, locals)
  File "/tmp/B.BuheZx/BUILD/thunderbird-52.4.0/moz.configure", line 7, in <module>
    include('mozilla/moz.configure')
  File "/tmp/B.BuheZx/BUILD/thunderbird-52.4.0/mozilla/python/mozbuild/mozbuild/configure/__init__.py", line 627, in include_impl
    self.include_file(what)
  File "/tmp/B.BuheZx/BUILD/thunderbird-52.4.0/mozilla/python/mozbuild/mozbuild/configure/__init__.py", line 325, in include_file
    exec_(code, self)
  File "/tmp/B.BuheZx/BUILD/thunderbird-52.4.0/mozilla/python/mozbuild/mozbuild/util.py", line 59, in exec_
    exec(object, globals, locals)
  File "/tmp/B.BuheZx/BUILD/thunderbird-52.4.0/mozilla/moz.configure", line 7, in <module>
    include('build/moz.configure/init.configure')
  File "/tmp/B.BuheZx/BUILD/thunderbird-52.4.0/mozilla/python/mozbuild/mozbuild/configure/__init__.py", line 627, in include_impl
    self.include_file(what)
  File "/tmp/B.BuheZx/BUILD/thunderbird-52.4.0/mozilla/python/mozbuild/mozbuild/configure/__init__.py", line 325, in include_file
    exec_(code, self)
  File "/tmp/B.BuheZx/BUILD/thunderbird-52.4.0/mozilla/python/mozbuild/mozbuild/util.py", line 59, in exec_
    exec(object, globals, locals)
  File "/tmp/B.BuheZx/BUILD/thunderbird-52.4.0/mozilla/build/moz.configure/init.configure", line 153, in <module>
    @imports('distutils.sysconfig')
  File "/tmp/B.BuheZx/BUILD/thunderbird-52.4.0/mozilla/python/mozbuild/mozbuild/configure/__init__.py", line 610, in decorator
    depends = DependsFunction(self, func, dependencies, when=when)
  File "/tmp/B.BuheZx/BUILD/thunderbird-52.4.0/mozilla/python/mozbuild/mozbuild/configure/__init__.py", line 69, in __init__
    sandbox._value_for(self)
  File "/tmp/B.BuheZx/BUILD/thunderbird-52.4.0/mozilla/python/mozbuild/mozbuild/configure/__init__.py", line 406, in _value_for
    return self._value_for_depends(obj, need_help_dependency)
  File "/tmp/B.BuheZx/BUILD/thunderbird-52.4.0/mozilla/python/mozbuild/mozbuild/util.py", line 925, in method_call
    cache[args] = self.func(instance, *args)
  File "/tmp/B.BuheZx/BUILD/thunderbird-52.4.0/mozilla/python/mozbuild/mozbuild/configure/__init__.py", line 416, in _value_for_depends
    return obj.result
  File "/tmp/B.BuheZx/BUILD/thunderbird-52.4.0/mozilla/python/mozbuild/mozbuild/util.py", line 943, in __get__
    setattr(instance, name, self.func(instance))
  File "/tmp/B.BuheZx/BUILD/thunderbird-52.4.0/mozilla/python/mozbuild/mozbuild/configure/__init__.py", line 90, in result
    return self.func(*resolved_args)
  File "/tmp/B.BuheZx/BUILD/thunderbird-52.4.0/mozilla/python/mozbuild/mozbuild/configure/__init__.py", line 932, in wrapped
    return new_func(*args, **kwargs)
  File "/tmp/B.BuheZx/BUILD/thunderbird-52.4.0/mozilla/build/moz.configure/init.configure", line 200, in virtualenv_python
    manager.build(python)
  File "/tmp/B.BuheZx/BUILD/thunderbird-52.4.0/mozilla/python/mozbuild/mozbuild/virtualenv.py", line 439, in build
    self.create(python)
  File "/tmp/B.BuheZx/BUILD/thunderbird-52.4.0/mozilla/python/mozbuild/mozbuild/virtualenv.py", line 203, in create
    'Failed to create virtualenv: %s' % self.virtualenv_root)
Exception: Failed to create virtualenv: /tmp/B.BuheZx/BUILD/thunderbird-52.4.0/obj-x32/_virtualenv
*** Fix above errors and then restart with\
               "/usr/bin/make -f client.mk build"
make[1]: *** [/tmp/B.BuheZx/BUILD/thunderbird-52.4.0/client.mk:362: configure] Error 1
make[1]: Leaving directory '/tmp/B.BuheZx/BUILD/thunderbird-52.4.0'
make: *** [client.mk:374: /tmp/B.BuheZx/BUILD/thunderbird-52.4.0/obj-x32/Makefile] Error 2
error: Bad exit status from /tmp/B.BuheZx/BUILD/tmp/rpm-tmp.42992 (%build)


RPM build errors:
    Bad exit status from /tmp/B.BuheZx/BUILD/tmp/rpm-tmp.42992 (%build)
ended at: Wed Oct 11 10:08:30 2017, done in 0:00:31.471359
error: No files produced.
+ chmod -R u+rwX /tmp/B.BuheZx/BUILD
+ rm -rf /tmp/B.BuheZx/tmp /tmp/B.BuheZx/BUILD
+ rm -rf /tmp/B.BuheZx
Begin-PLD-Builder-Info
Build-Time: user:24.30s sys:18.64s real:70.50s (faults io:0 non-io:136919)

End-PLD-Builder-Info
[Back to list of logs] [View rpm -qa of builder]