FailedOk

th/SRPMS[OK]
th/x32[OK]
th/i686[OK]
th/x86_64[OK]

ac/SRPMS[OK]
ac/i386[OK]
ac/i586[OK]
ac/i686[OK]
ac/alpha[OK]
ac/amd64[OK]
ac/athlon[OK]
ac/ppc[OK]
ac/sparc[OK]
ac/sparc64[OK]

Advanced Search
main()
Powered by PLD Linux
(c) 2002-2018 PLD Team
$Revision: 1.37 $
Powered by X.
Your IP: 54.198.111.185

thunderbird ed954cc0-3049-4288-9f02-ead7e592afea

Status:Failed
Source URL:ftp://buildlogs.pld-linux.org/th/x32/FAIL/thunderbird,ed954cc0-3049-4288-9f02-ead7e592afea.bz2
text/plain URL:View!
rpm -qa of builder:View!
Date:2018/07/09 11:46:07
Runtime:0:00:31.143971

Toc:

  • error 1
  • rpm: error: Failed build dependencies:
  • error 2
  • rpm: error: Failed build dependencies:
  • prep
  • Executing(%prep): /bin/sh -e /tmp/B.vKtRPT/BUILD/tmp/rpm-tmp.98368
  • build
  • Executing(%build): /bin/sh -e /tmp/B.vKtRPT/BUILD/tmp/rpm-tmp.69924
  • error 3
  • ImportError: No module named pkgutil
  • error 4
  • OSError: Command /tmp/B.vKtRPT/BUILD/...ualenv/bin/python2.7 - setuptools pip wheel failed with error code 1
  • error 5
  • make[1]: *** [/tmp/B.vKtRPT/BUILD/thunderbird-52.9.0/client.mk:362: configure] Error 1
  • error 6
  • error: Bad exit status from /tmp/B.vKtRPT/BUILD/tmp/rpm-tmp.69924 (%build)
  • error 7
  • RPM build errors:
  • error 8
  • error: No files produced.

Content:

request from: atler
checking if we should skip the build
started at: Mon Jul  9 11:42:57 2018
killing old processes on a builder
sending signal 9 to pid -1
Killed
cleaning up /tmp
fetching https://srcbuilder.pld-linux.org/th//srpms/ed954cc0-3049-4288-9f02-ead7e592afea/thunderbird-52.9.0-1.src.rpm
fetched 260749629 bytes, 4004.2 K/s
installing srpm: thunderbird-52.9.0-1.src.rpm
+ install -d /tmp/B.vKtRPT/BUILD /tmp/B.vKtRPT/RPMS
+ LC_ALL=en_US.UTF-8
+ rpm -qp --changelog thunderbird-52.9.0-1.src.rpm
* Mon Jul 09 2018 PLD Linux Team <feedback@pld-linux.org>
- For complete changelog see: http://git.pld-linux.org/?p=packages/thunderbird.git;a=log;h=master
* Sun Jul 08 2018 Jan Palus <atler@pld-linux.org> cbd6e25
- up to 52.9.0 * Mon May 21 2018 Jan Palus <atler@pld-linux.org> 7223f7d
- up to 52.8.0 * Sat Mar 24 2018 Jan Palus <atler@pld-linux.org> dc32328
- up to 52.7.0 * Fri Jan 26 2018 Jan Palus <atler@pld-linux.org> 2df7bde
- up to 52.6.0 * Thu Jan 11 2018 Jan Palus <atler@pld-linux.org> 857cb07
- drop -Os workaround -- it's causing "widget issue" with gcc7 * Sat Dec 23 2017 Jan Palus <atler@pld-linux.org> eabb3d4
- up to 52.5.2 * Sat Nov 25 2017 Jan Palus <atler@pld-linux.org> 486f35e
- bug 1245783 seems to be fixed already so drop patch with workaround * Sat Nov 25 2017 Jan Palus <atler@pld-linux.org> 4a50b06
- up to 52.5.0 * Wed Oct 11 2017 Jan Palus <atler@pld-linux.org> f8f1581
- freshen md5 of translations * Wed Oct 11 2017 Jan Palus <atler@pld-linux.org> b1e82eb
- up to 52.4.0 * Mon Sep 18 2017 Jan Palus <atler@pld-linux.org> 0e1c396
- patch to fix font rendering with skia backend and ft 2.8.1; rel 4 * Sun Sep 03 2017 Jan Rękorajski <baggins@pld-linux.org> 5f03503
- fix libdir -> datadir move for extensions dir - rel 3 * Sun Sep 03 2017 Jan Rękorajski <baggins@pld-linux.org> 20e4357
- rel 2 * Sat Sep 02 2017 Jan Rękorajski <baggins@pld-linux.org> b24ace7
- merge translations into main package * Mon Aug 21 2017 Jan Palus <atler@pld-linux.org> a22a585
- conditional BR for clang * Sun Aug 20 2017 Jan Rękorajski <baggins@pld-linux.org> 293b589
- use clang by default * Sat Aug 19 2017 Jan Palus <atler@pld-linux.org> 5b9c8e4
- BR: libatomic-devel * Sat Aug 19 2017 Jan Rękorajski <baggins@pld-linux.org> e9df532
- fix clang build * Sat Aug 19 2017 Jan Rękorajski <baggins@pld-linux.org> 19f2dc4
- added clang bcond * Thu Aug 17 2017 Jan Palus <atler@pld-linux.org> 962f00c
- up to 52.3.0 (unusable if built with gcc7) + rpm -Uhv --nodeps --define '_topdir /tmp/B.vKtRPT' --define '_specdir %{_topdir}' --define '_sourcedir %{_specdir}' --define '_rpmdir %{_topdir}/RPMS' --define '_builddir %{_topdir}/BUILD' thunderbird-52.9.0-1.src.rpm Preparing... ################################################## thunderbird ################################################## + rm -f thunderbird-52.9.0-1.src.rpm + install -m 700 -d /tmp/B.vKtRPT/BUILD/tmp + TMPDIR=/tmp/B.vKtRPT/BUILD/tmp + exec nice -n 0 rpmbuild -bp --short-circuit --nodeps --define '_topdir /tmp/B.vKtRPT' --define '_specdir %{_topdir}' --define '_sourcedir %{_specdir}' --define '_rpmdir %{_topdir}/RPMS' --define '_builddir %{_topdir}/BUILD' --target x32-pld-linux --define 'prep exit 0' /tmp/B.vKtRPT/thunderbird.spec Building target platforms: x32-pld-linux checking BuildConflict-ing packages no BuildConflicts found checking BR rpm: error: Failed build dependencies: rpm: virtualenv is needed by thunderbird-52.9.0-1.src rpm: Building target platforms: x32-pld-linux updating poldek cache... ready is up to date Retrieving th::packages.ndir.md... th is up to date Retrieving th::packages.ndir.md... th is up to date Retrieving th-ready::packages.ndir.md... th-ready is up to date Retrieving th-ready::packages.ndir.md... th-ready is up to date Retrieving th-test::packages.ndir.md... Retrieving th-test::packages.ndir.diff.toc.gz... Retrieving diff::packages.ndir.2018.07.08-21.23.02.gz... Retrieving diff::packages.ndir.dscr.2018.07.08-21.23.02.gz... Loading [pndir]th-test... Applying packages.ndir.2018.07.08-21.23.02.gz... Retrieving diff::packages.ndir.2018.07.08-22.42.02.gz... ..............................done Retrieving diff::packages.ndir.dscr.2018.07.08-22.42.02.gz... Applying packages.ndir.2018.07.08-22.42.02.gz... Retrieving diff::packages.ndir.2018.07.08-22.53.01.gz... Retrieving diff::packages.ndir.dscr.2018.07.08-22.53.01.gz... Applying packages.ndir.2018.07.08-22.53.01.gz... Retrieving diff::packages.ndir.2018.07.08-23.05.02.gz... Retrieving diff::packages.ndir.dscr.2018.07.08-23.05.02.gz... Applying packages.ndir.2018.07.08-23.05.02.gz... Retrieving diff::packages.ndir.2018.07.08-23.17.01.gz... Applying packages.ndir.2018.07.08-23.17.01.gz... Retrieving diff::packages.ndir.2018.07.08-23.24.14.gz... Retrieving diff::packages.ndir.dscr.2018.07.08-23.24.14.gz... Applying packages.ndir.2018.07.08-23.24.14.gz... Retrieving diff::packages.ndir.2018.07.08-23.38.01.gz... Applying packages.ndir.2018.07.08-23.38.01.gz... Retrieving diff::packages.ndir.2018.07.08-23.41.13.gz... ..............................done Retrieving diff::packages.ndir.dscr.2018.07.08-23.41.13.gz... Applying packages.ndir.2018.07.08-23.41.13.gz... Retrieving diff::packages.ndir.2018.07.09-08.33.01.gz... ..............................done Retrieving diff::packages.ndir.dscr.2018.07.09-08.33.01.gz... Applying packages.ndir.2018.07.09-08.33.01.gz... Retrieving diff::packages.ndir.2018.07.09-08.38.01.gz... ..............................done Retrieving diff::packages.ndir.dscr.2018.07.09-08.38.01.gz... Applying packages.ndir.2018.07.09-08.38.01.gz... Retrieving diff::packages.ndir.2018.07.09-08.45.01.gz... Retrieving diff::packages.ndir.dscr.2018.07.09-08.45.01.gz... Applying packages.ndir.2018.07.09-08.45.01.gz... Writing /root/tmp/poldek-cache-root/[...]/packages.ndir.gz... Retrieving th-test::packages.ndir.md... Retrieving th-test::packages.ndir.diff.toc.gz... ..............................done Retrieving diff::packages.ndir.2018.07.08-22.09.01.gz... ..............................done Retrieving diff::packages.ndir.dscr.2018.07.08-22.09.01.gz... Loading [pndir]th-test... Applying packages.ndir.2018.07.08-22.09.01.gz... Retrieving diff::packages.ndir.2018.07.08-22.12.01.gz... ..............................done Retrieving diff::packages.ndir.dscr.2018.07.08-22.12.01.gz... Applying packages.ndir.2018.07.08-22.12.01.gz... Retrieving diff::packages.ndir.2018.07.08-22.23.01.gz... ..............................done Retrieving diff::packages.ndir.dscr.2018.07.08-22.23.01.gz... ..............................done Applying packages.ndir.2018.07.08-22.23.01.gz... Retrieving diff::packages.ndir.2018.07.08-22.50.01.gz... ..............................done Retrieving diff::packages.ndir.dscr.2018.07.08-22.50.01.gz... Applying packages.ndir.2018.07.08-22.50.01.gz... Retrieving diff::packages.ndir.2018.07.08-23.14.02.gz... ..............................done Retrieving diff::packages.ndir.dscr.2018.07.08-23.14.02.gz... Applying packages.ndir.2018.07.08-23.14.02.gz... Retrieving diff::packages.ndir.2018.07.08-23.16.01.gz... ..............................done Retrieving diff::packages.ndir.dscr.2018.07.08-23.16.01.gz... Applying packages.ndir.2018.07.08-23.16.01.gz... Retrieving diff::packages.ndir.2018.07.08-23.22.01.gz... Applying packages.ndir.2018.07.08-23.22.01.gz... Retrieving diff::packages.ndir.2018.07.08-23.24.14.gz... ..............................done Retrieving diff::packages.ndir.dscr.2018.07.08-23.24.14.gz... ..............................done Applying packages.ndir.2018.07.08-23.24.14.gz... Retrieving diff::packages.ndir.2018.07.08-23.31.01.gz... ..............................done Retrieving diff::packages.ndir.dscr.2018.07.08-23.31.01.gz... Applying packages.ndir.2018.07.08-23.31.01.gz... Retrieving diff::packages.ndir.2018.07.08-23.36.01.gz... ..............................done Retrieving diff::packages.ndir.dscr.2018.07.08-23.36.01.gz... Applying packages.ndir.2018.07.08-23.36.01.gz... Retrieving diff::packages.ndir.2018.07.08-23.41.01.gz... Applying packages.ndir.2018.07.08-23.41.01.gz... Retrieving diff::packages.ndir.2018.07.08-23.41.13.gz... Retrieving diff::packages.ndir.dscr.2018.07.08-23.41.13.gz... Applying packages.ndir.2018.07.08-23.41.13.gz... Retrieving diff::packages.ndir.2018.07.08-23.42.01.gz... Retrieving diff::packages.ndir.dscr.2018.07.08-23.42.01.gz... Applying packages.ndir.2018.07.08-23.42.01.gz... Retrieving diff::packages.ndir.2018.07.08-23.55.01.gz... ..............................done Retrieving diff::packages.ndir.dscr.2018.07.08-23.55.01.gz... Applying packages.ndir.2018.07.08-23.55.01.gz... Retrieving diff::packages.ndir.2018.07.08-23.58.01.gz... ..............................done Retrieving diff::packages.ndir.dscr.2018.07.08-23.58.01.gz... Applying packages.ndir.2018.07.08-23.58.01.gz... Retrieving diff::packages.ndir.2018.07.09-00.03.01.gz... ..............................done Retrieving diff::packages.ndir.dscr.2018.07.09-00.03.01.gz... ..............................done Applying packages.ndir.2018.07.09-00.03.01.gz... Retrieving diff::packages.ndir.2018.07.09-00.14.01.gz... ..............................done Retrieving diff::packages.ndir.dscr.2018.07.09-00.14.01.gz... Applying packages.ndir.2018.07.09-00.14.01.gz... Retrieving diff::packages.ndir.2018.07.09-00.15.02.gz... ..............................done Retrieving diff::packages.ndir.dscr.2018.07.09-00.15.02.gz... Applying packages.ndir.2018.07.09-00.15.02.gz... Retrieving diff::packages.ndir.2018.07.09-05.41.01.gz... ..............................done Retrieving diff::packages.ndir.dscr.2018.07.09-05.41.01.gz... ..............................done Applying packages.ndir.2018.07.09-05.41.01.gz... Retrieving diff::packages.ndir.2018.07.09-08.36.01.gz... ..............................done Retrieving diff::packages.ndir.dscr.2018.07.09-08.36.01.gz... ..............................done Applying packages.ndir.2018.07.09-08.36.01.gz... Retrieving diff::packages.ndir.2018.07.09-08.45.01.gz... ..............................done Retrieving diff::packages.ndir.dscr.2018.07.09-08.45.01.gz... ..............................done Applying packages.ndir.2018.07.09-08.45.01.gz... Writing /root/tmp/poldek-cache-root/[...]/packages.ndir.gz... checking conflicting packages in BRed packages poldek: Loading [pndir]ready... poldek: Loading [pndir]th-test... poldek: Loading [pndir]th-test... poldek: Loading [pndir]th-ready... poldek: Loading [pndir]th-ready... poldek: Loading [pndir]th... poldek: Loading [pndir]th... poldek: 28834 packages read poldek: Removed 5439 duplicate packages from available set poldek: Processing dependencies... poldek: There are 1 package to install: poldek: I virtualenv-15.1.0-2.noarch poldek: This operation will use 400.0B of disk space. poldek: Need to get 4.7KB of archives (4.7KB to download). poldek: poldek: Retrieving th-test::virtualenv-15.1.0-2.noarch.rpm... poldek: ..............................done poldek: Executing pm-command.sh --upgrade -vh --test --root / --define _check_dirname_deps 1... poldek: Preparing... ################################################## no conflicts found checking BR rpm: error: Failed build dependencies: rpm: virtualenv is needed by thunderbird-52.9.0-1.src rpm: Building target platforms: x32-pld-linux installing BR: virtualenv + poldek --noask --caplookup -Q -v '--ignore=hhvm-*' '--ignore=php4-*' '--ignore=php52-*' '--ignore=php54-*' '--ignore=php55-*' '--ignore=php56-*' '--ignore=php70-*' '--ignore=php71-*' '--ignore=php72-*' --upgrade virtualenv Loading [pndir]ready... Loading [pndir]th-test... Loading [pndir]th-test... Loading [pndir]th-ready... Loading [pndir]th-ready... Loading [pndir]th... Loading [pndir]th... 28834 packages read Removed 5439 duplicate packages from available set Processing dependencies... There are 1 package to install: I virtualenv-15.1.0-2.noarch This operation will use 400.0B of disk space. Need to get 4.7KB of archives. Executing pm-command.sh --upgrade -vh --root / --define _check_dirname_deps 1... Preparing... ################################################## virtualenv ################################################## building RPM using: set -ex; : build-id: ed954cc0-3049-4288-9f02-ead7e592afea; TMPDIR=/tmp/B.vKtRPT/BUILD/tmp exec nice -n 0 rpmbuild -bb --define '_smp_mflags -j9' --define '_make_opts -Otarget' --define '_pld_builder 1' --define '_topdir /tmp/B.vKtRPT' --define '_specdir %{_topdir}' --define '_sourcedir %{_specdir}' --define '_rpmdir %{_topdir}/RPMS' --define '_builddir %{_topdir}/BUILD' --target x32-pld-linux /tmp/B.vKtRPT/thunderbird.spec + : build-id: ed954cc0-3049-4288-9f02-ead7e592afea + TMPDIR=/tmp/B.vKtRPT/BUILD/tmp + exec nice -n 0 rpmbuild -bb --define '_smp_mflags -j9' --define '_make_opts -Otarget' --define '_pld_builder 1' --define '_topdir /tmp/B.vKtRPT' --define '_specdir %{_topdir}' --define '_sourcedir %{_specdir}' --define '_rpmdir %{_topdir}/RPMS' --define '_builddir %{_topdir}/BUILD' --target x32-pld-linux /tmp/B.vKtRPT/thunderbird.spec Building target platforms: x32-pld-linux Executing(%prep): /bin/sh -e /tmp/B.vKtRPT/BUILD/tmp/rpm-tmp.98368 + umask 022 + cd /tmp/B.vKtRPT/BUILD + cd /tmp/B.vKtRPT/BUILD + rm -rf thunderbird-52.9.0 + /usr/bin/xz -dc /tmp/B.vKtRPT/thunderbird-52.9.0.source.tar.xz + /bin/tar -xf - + STATUS=0 + '[' 0 -ne 0 ']' + cd thunderbird-52.9.0 + unpack -qq /tmp/B.vKtRPT/ar.xpi + typeset 'args=-qq' 'file=/tmp/B.vKtRPT/ar.xpi' + cp -p /tmp/B.vKtRPT/ar.xpi . + STATUS=0 + '[' 0 -ne 0 ']' + unpack -qq /tmp/B.vKtRPT/ast.xpi + typeset 'args=-qq' 'file=/tmp/B.vKtRPT/ast.xpi' + cp -p /tmp/B.vKtRPT/ast.xpi . + STATUS=0 + '[' 0 -ne 0 ']' + unpack -qq /tmp/B.vKtRPT/be.xpi + typeset 'args=-qq' 'file=/tmp/B.vKtRPT/be.xpi' + cp -p /tmp/B.vKtRPT/be.xpi . + STATUS=0 + '[' 0 -ne 0 ']' + unpack -qq /tmp/B.vKtRPT/bg.xpi + typeset 'args=-qq' 'file=/tmp/B.vKtRPT/bg.xpi' + cp -p /tmp/B.vKtRPT/bg.xpi . + STATUS=0 + '[' 0 -ne 0 ']' + unpack -qq /tmp/B.vKtRPT/bn-BD.xpi + typeset 'args=-qq' 'file=/tmp/B.vKtRPT/bn-BD.xpi' + cp -p /tmp/B.vKtRPT/bn-BD.xpi . + STATUS=0 + '[' 0 -ne 0 ']' + unpack -qq /tmp/B.vKtRPT/br.xpi + typeset 'args=-qq' 'file=/tmp/B.vKtRPT/br.xpi' + cp -p /tmp/B.vKtRPT/br.xpi . + STATUS=0 + '[' 0 -ne 0 ']' + unpack -qq /tmp/B.vKtRPT/ca.xpi + typeset 'args=-qq' 'file=/tmp/B.vKtRPT/ca.xpi' + cp -p /tmp/B.vKtRPT/ca.xpi . + STATUS=0 + '[' 0 -ne 0 ']' + unpack -qq /tmp/B.vKtRPT/cs.xpi + typeset 'args=-qq' 'file=/tmp/B.vKtRPT/cs.xpi' + cp -p /tmp/B.vKtRPT/cs.xpi . + STATUS=0 + '[' 0 -ne 0 ']' + unpack -qq /tmp/B.vKtRPT/da.xpi + typeset 'args=-qq' 'file=/tmp/B.vKtRPT/da.xpi' + cp -p /tmp/B.vKtRPT/da.xpi . + STATUS=0 + '[' 0 -ne 0 ']' + unpack -qq /tmp/B.vKtRPT/de.xpi + typeset 'args=-qq' 'file=/tmp/B.vKtRPT/de.xpi' + cp -p /tmp/B.vKtRPT/de.xpi . + STATUS=0 + '[' 0 -ne 0 ']' + unpack -qq /tmp/B.vKtRPT/dsb.xpi + typeset 'args=-qq' 'file=/tmp/B.vKtRPT/dsb.xpi' + cp -p /tmp/B.vKtRPT/dsb.xpi . + STATUS=0 + '[' 0 -ne 0 ']' + unpack -qq /tmp/B.vKtRPT/el.xpi + typeset 'args=-qq' 'file=/tmp/B.vKtRPT/el.xpi' + cp -p /tmp/B.vKtRPT/el.xpi . + STATUS=0 + '[' 0 -ne 0 ']' + unpack -qq /tmp/B.vKtRPT/en-GB.xpi + typeset 'args=-qq' 'file=/tmp/B.vKtRPT/en-GB.xpi' + cp -p /tmp/B.vKtRPT/en-GB.xpi . + STATUS=0 + '[' 0 -ne 0 ']' + unpack -qq /tmp/B.vKtRPT/en-US.xpi + typeset 'args=-qq' 'file=/tmp/B.vKtRPT/en-US.xpi' + cp -p /tmp/B.vKtRPT/en-US.xpi . + STATUS=0 + '[' 0 -ne 0 ']' + unpack -qq /tmp/B.vKtRPT/es-AR.xpi + typeset 'args=-qq' 'file=/tmp/B.vKtRPT/es-AR.xpi' + cp -p /tmp/B.vKtRPT/es-AR.xpi . + STATUS=0 + '[' 0 -ne 0 ']' + unpack -qq /tmp/B.vKtRPT/es-ES.xpi + typeset 'args=-qq' 'file=/tmp/B.vKtRPT/es-ES.xpi' + cp -p /tmp/B.vKtRPT/es-ES.xpi . + STATUS=0 + '[' 0 -ne 0 ']' + unpack -qq /tmp/B.vKtRPT/et.xpi + typeset 'args=-qq' 'file=/tmp/B.vKtRPT/et.xpi' + cp -p /tmp/B.vKtRPT/et.xpi . + STATUS=0 + '[' 0 -ne 0 ']' + unpack -qq /tmp/B.vKtRPT/eu.xpi + typeset 'args=-qq' 'file=/tmp/B.vKtRPT/eu.xpi' + cp -p /tmp/B.vKtRPT/eu.xpi . + STATUS=0 + '[' 0 -ne 0 ']' + unpack -qq /tmp/B.vKtRPT/fi.xpi + typeset 'args=-qq' 'file=/tmp/B.vKtRPT/fi.xpi' + cp -p /tmp/B.vKtRPT/fi.xpi . + STATUS=0 + '[' 0 -ne 0 ']' + unpack -qq /tmp/B.vKtRPT/fr.xpi + typeset 'args=-qq' 'file=/tmp/B.vKtRPT/fr.xpi' + cp -p /tmp/B.vKtRPT/fr.xpi . + STATUS=0 + '[' 0 -ne 0 ']' + unpack -qq /tmp/B.vKtRPT/fy-NL.xpi + typeset 'args=-qq' 'file=/tmp/B.vKtRPT/fy-NL.xpi' + cp -p /tmp/B.vKtRPT/fy-NL.xpi . + STATUS=0 + '[' 0 -ne 0 ']' + unpack -qq /tmp/B.vKtRPT/ga-IE.xpi + typeset 'args=-qq' 'file=/tmp/B.vKtRPT/ga-IE.xpi' + cp -p /tmp/B.vKtRPT/ga-IE.xpi . + STATUS=0 + '[' 0 -ne 0 ']' + unpack -qq /tmp/B.vKtRPT/gd.xpi + typeset 'args=-qq' 'file=/tmp/B.vKtRPT/gd.xpi' + cp -p /tmp/B.vKtRPT/gd.xpi . + STATUS=0 + '[' 0 -ne 0 ']' + unpack -qq /tmp/B.vKtRPT/gl.xpi + typeset 'args=-qq' 'file=/tmp/B.vKtRPT/gl.xpi' + cp -p /tmp/B.vKtRPT/gl.xpi . + STATUS=0 + '[' 0 -ne 0 ']' + unpack -qq /tmp/B.vKtRPT/he.xpi + typeset 'args=-qq' 'file=/tmp/B.vKtRPT/he.xpi' + cp -p /tmp/B.vKtRPT/he.xpi . + STATUS=0 + '[' 0 -ne 0 ']' + unpack -qq /tmp/B.vKtRPT/hr.xpi + typeset 'args=-qq' 'file=/tmp/B.vKtRPT/hr.xpi' + cp -p /tmp/B.vKtRPT/hr.xpi . + STATUS=0 + '[' 0 -ne 0 ']' + unpack -qq /tmp/B.vKtRPT/hsb.xpi + typeset 'args=-qq' 'file=/tmp/B.vKtRPT/hsb.xpi' + cp -p /tmp/B.vKtRPT/hsb.xpi . + STATUS=0 + '[' 0 -ne 0 ']' + unpack -qq /tmp/B.vKtRPT/hu.xpi + typeset 'args=-qq' 'file=/tmp/B.vKtRPT/hu.xpi' + cp -p /tmp/B.vKtRPT/hu.xpi . + STATUS=0 + '[' 0 -ne 0 ']' + unpack -qq /tmp/B.vKtRPT/hy-AM.xpi + typeset 'args=-qq' 'file=/tmp/B.vKtRPT/hy-AM.xpi' + cp -p /tmp/B.vKtRPT/hy-AM.xpi . + STATUS=0 + '[' 0 -ne 0 ']' + unpack -qq /tmp/B.vKtRPT/id.xpi + typeset 'args=-qq' 'file=/tmp/B.vKtRPT/id.xpi' + cp -p /tmp/B.vKtRPT/id.xpi . + STATUS=0 + '[' 0 -ne 0 ']' + unpack -qq /tmp/B.vKtRPT/is.xpi + typeset 'args=-qq' 'file=/tmp/B.vKtRPT/is.xpi' + cp -p /tmp/B.vKtRPT/is.xpi . + STATUS=0 + '[' 0 -ne 0 ']' + unpack -qq /tmp/B.vKtRPT/it.xpi + typeset 'args=-qq' 'file=/tmp/B.vKtRPT/it.xpi' + cp -p /tmp/B.vKtRPT/it.xpi . + STATUS=0 + '[' 0 -ne 0 ']' + unpack -qq /tmp/B.vKtRPT/ja.xpi + typeset 'args=-qq' 'file=/tmp/B.vKtRPT/ja.xpi' + cp -p /tmp/B.vKtRPT/ja.xpi . + STATUS=0 + '[' 0 -ne 0 ']' + unpack -qq /tmp/B.vKtRPT/kab.xpi + typeset 'args=-qq' 'file=/tmp/B.vKtRPT/kab.xpi' + cp -p /tmp/B.vKtRPT/kab.xpi . + STATUS=0 + '[' 0 -ne 0 ']' + unpack -qq /tmp/B.vKtRPT/ko.xpi + typeset 'args=-qq' 'file=/tmp/B.vKtRPT/ko.xpi' + cp -p /tmp/B.vKtRPT/ko.xpi . + STATUS=0 + '[' 0 -ne 0 ']' + unpack -qq /tmp/B.vKtRPT/lt.xpi + typeset 'args=-qq' 'file=/tmp/B.vKtRPT/lt.xpi' + cp -p /tmp/B.vKtRPT/lt.xpi . + STATUS=0 + '[' 0 -ne 0 ']' + unpack -qq /tmp/B.vKtRPT/nb-NO.xpi + typeset 'args=-qq' 'file=/tmp/B.vKtRPT/nb-NO.xpi' + cp -p /tmp/B.vKtRPT/nb-NO.xpi . + STATUS=0 + '[' 0 -ne 0 ']' + unpack -qq /tmp/B.vKtRPT/nl.xpi + typeset 'args=-qq' 'file=/tmp/B.vKtRPT/nl.xpi' + cp -p /tmp/B.vKtRPT/nl.xpi . + STATUS=0 + '[' 0 -ne 0 ']' + unpack -qq /tmp/B.vKtRPT/nn-NO.xpi + typeset 'args=-qq' 'file=/tmp/B.vKtRPT/nn-NO.xpi' + cp -p /tmp/B.vKtRPT/nn-NO.xpi . + STATUS=0 + '[' 0 -ne 0 ']' + unpack -qq /tmp/B.vKtRPT/pa-IN.xpi + typeset 'args=-qq' 'file=/tmp/B.vKtRPT/pa-IN.xpi' + cp -p /tmp/B.vKtRPT/pa-IN.xpi . + STATUS=0 + '[' 0 -ne 0 ']' + unpack -qq /tmp/B.vKtRPT/pl.xpi + typeset 'args=-qq' 'file=/tmp/B.vKtRPT/pl.xpi' + cp -p /tmp/B.vKtRPT/pl.xpi . + STATUS=0 + '[' 0 -ne 0 ']' + unpack -qq /tmp/B.vKtRPT/pt-BR.xpi + typeset 'args=-qq' 'file=/tmp/B.vKtRPT/pt-BR.xpi' + cp -p /tmp/B.vKtRPT/pt-BR.xpi . + STATUS=0 + '[' 0 -ne 0 ']' + unpack -qq /tmp/B.vKtRPT/pt-PT.xpi + typeset 'args=-qq' 'file=/tmp/B.vKtRPT/pt-PT.xpi' + cp -p /tmp/B.vKtRPT/pt-PT.xpi . + STATUS=0 + '[' 0 -ne 0 ']' + unpack -qq /tmp/B.vKtRPT/rm.xpi + typeset 'args=-qq' 'file=/tmp/B.vKtRPT/rm.xpi' + cp -p /tmp/B.vKtRPT/rm.xpi . + STATUS=0 + '[' 0 -ne 0 ']' + unpack -qq /tmp/B.vKtRPT/ro.xpi + typeset 'args=-qq' 'file=/tmp/B.vKtRPT/ro.xpi' + cp -p /tmp/B.vKtRPT/ro.xpi . + STATUS=0 + '[' 0 -ne 0 ']' + unpack -qq /tmp/B.vKtRPT/ru.xpi + typeset 'args=-qq' 'file=/tmp/B.vKtRPT/ru.xpi' + cp -p /tmp/B.vKtRPT/ru.xpi . + STATUS=0 + '[' 0 -ne 0 ']' + unpack -qq /tmp/B.vKtRPT/si.xpi + typeset 'args=-qq' 'file=/tmp/B.vKtRPT/si.xpi' + cp -p /tmp/B.vKtRPT/si.xpi . + STATUS=0 + '[' 0 -ne 0 ']' + unpack -qq /tmp/B.vKtRPT/sk.xpi + typeset 'args=-qq' 'file=/tmp/B.vKtRPT/sk.xpi' + cp -p /tmp/B.vKtRPT/sk.xpi . + STATUS=0 + '[' 0 -ne 0 ']' + unpack -qq /tmp/B.vKtRPT/sl.xpi + typeset 'args=-qq' 'file=/tmp/B.vKtRPT/sl.xpi' + cp -p /tmp/B.vKtRPT/sl.xpi . + STATUS=0 + '[' 0 -ne 0 ']' + unpack -qq /tmp/B.vKtRPT/sq.xpi + typeset 'args=-qq' 'file=/tmp/B.vKtRPT/sq.xpi' + cp -p /tmp/B.vKtRPT/sq.xpi . + STATUS=0 + '[' 0 -ne 0 ']' + unpack -qq /tmp/B.vKtRPT/sr.xpi + typeset 'args=-qq' 'file=/tmp/B.vKtRPT/sr.xpi' + cp -p /tmp/B.vKtRPT/sr.xpi . + STATUS=0 + '[' 0 -ne 0 ']' + unpack -qq /tmp/B.vKtRPT/sv-SE.xpi + typeset 'args=-qq' 'file=/tmp/B.vKtRPT/sv-SE.xpi' + cp -p /tmp/B.vKtRPT/sv-SE.xpi . + STATUS=0 + '[' 0 -ne 0 ']' + unpack -qq /tmp/B.vKtRPT/ta-LK.xpi + typeset 'args=-qq' 'file=/tmp/B.vKtRPT/ta-LK.xpi' + cp -p /tmp/B.vKtRPT/ta-LK.xpi . + STATUS=0 + '[' 0 -ne 0 ']' + unpack -qq /tmp/B.vKtRPT/tr.xpi + typeset 'args=-qq' 'file=/tmp/B.vKtRPT/tr.xpi' + cp -p /tmp/B.vKtRPT/tr.xpi . + STATUS=0 + '[' 0 -ne 0 ']' + unpack -qq /tmp/B.vKtRPT/uk.xpi + typeset 'args=-qq' 'file=/tmp/B.vKtRPT/uk.xpi' + cp -p /tmp/B.vKtRPT/uk.xpi . + STATUS=0 + '[' 0 -ne 0 ']' + unpack -qq /tmp/B.vKtRPT/vi.xpi + typeset 'args=-qq' 'file=/tmp/B.vKtRPT/vi.xpi' + cp -p /tmp/B.vKtRPT/vi.xpi . + STATUS=0 + '[' 0 -ne 0 ']' + unpack -qq /tmp/B.vKtRPT/zh-CN.xpi + typeset 'args=-qq' 'file=/tmp/B.vKtRPT/zh-CN.xpi' + cp -p /tmp/B.vKtRPT/zh-CN.xpi . + STATUS=0 + '[' 0 -ne 0 ']' + unpack -qq /tmp/B.vKtRPT/zh-TW.xpi + typeset 'args=-qq' 'file=/tmp/B.vKtRPT/zh-TW.xpi' + cp -p /tmp/B.vKtRPT/zh-TW.xpi . + STATUS=0 + '[' 0 -ne 0 ']' + /bin/id -u + '[' 1000 '=' 0 ']' + /bin/id -u + '[' 1000 '=' 0 ']' + /bin/chmod -Rf a+rX,u+w,g-w,o-w . + echo 'Patch #0 (prefs.patch):' Patch #0 (prefs.patch): + '[' -f /tmp/B.vKtRPT/prefs.patch ']' + /bin/cat /tmp/B.vKtRPT/prefs.patch + /usr/bin/patch -s -p1 + echo 'Patch #1 (no-subshell.patch):' Patch #1 (no-subshell.patch): + '[' -f /tmp/B.vKtRPT/no-subshell.patch ']' + /bin/cat /tmp/B.vKtRPT/no-subshell.patch + /usr/bin/patch -s -p1 + echo 'Patch #2 (enable-addons.patch):' Patch #2 (enable-addons.patch): + '[' -f /tmp/B.vKtRPT/enable-addons.patch ']' + /bin/cat /tmp/B.vKtRPT/enable-addons.patch + /usr/bin/patch -s -p1 + exit 0 Executing(%build): /bin/sh -e /tmp/B.vKtRPT/BUILD/tmp/rpm-tmp.69924 HOME=/home/users/builder PATH=/home/users/builder/GNUstep/Tools:/usr/local/bin:/usr/bin:/bin TMPDIR=/tmp/B.vKtRPT/BUILD/tmp + umask 022 + cd /tmp/B.vKtRPT/BUILD + cd thunderbird-52.9.0 + <<EOF + >.mozconfig + cat + mkdir -p /tmp/B.vKtRPT/BUILD/thunderbird-52.9.0/obj-x32/config + ln -sf /tmp/B.vKtRPT/BUILD/thunderbird-52.9.0/mozilla/config/android-common.mk /tmp/B.vKtRPT/BUILD/thunderbird-52.9.0/mozilla/config/baseconfig.mk /tmp/B.vKtRPT/BUILD/thunderbird-52.9.0/mozilla/config/config.mk /tmp/B.vKtRPT/BUILD/thunderbird-52.9.0/mozilla/config/recurse.mk /tmp/B.vKtRPT/BUILD/thunderbird-52.9.0/mozilla/config/rules.mk /tmp/B.vKtRPT/BUILD/thunderbird-52.9.0/mozilla/config/static-checking-config.mk /tmp/B.vKtRPT/BUILD/thunderbird-52.9.0/mozilla/config/version.mk /tmp/B.vKtRPT/BUILD/thunderbird-52.9.0/obj-x32/config + /usr/bin/make -Otarget -j9 -j1 -f client.mk build 'AUTOCONF=/usr/bin/autoconf2_13' 'MOZ_MAKE_FLAGS=-j9' mkdir -p '/tmp/B.vKtRPT/BUILD/thunderbird-52.9.0/obj-x32/' > /tmp/B.vKtRPT/BUILD/thunderbird-52.9.0/obj-x32/.mozconfig.mk Adding client.mk options from /tmp/B.vKtRPT/BUILD/thunderbird-52.9.0/.mozconfig: MOZ_OBJDIR=/tmp/B.vKtRPT/BUILD/thunderbird-52.9.0/obj-x32 FOUND_MOZCONFIG := /tmp/B.vKtRPT/BUILD/thunderbird-52.9.0/.mozconfig make[1]: Entering directory '/tmp/B.vKtRPT/BUILD/thunderbird-52.9.0' cd /tmp/B.vKtRPT/BUILD/thunderbird-52.9.0/obj-x32 /tmp/B.vKtRPT/BUILD/thunderbird-52.9.0/configure Creating Python environment New python executable in /tmp/B.vKtRPT/BUILD/thunderbird-52.9.0/obj-x32/_virtualenv/bin/python2.7 Also creating executable in /tmp/B.vKtRPT/BUILD/thunderbird-52.9.0/obj-x32/_virtualenv/bin/python Installing setuptools, pip, wheel... Complete output from command /tmp/B.vKtRPT/BUILD/...ualenv/bin/python2.7 - setuptools pip wheel: Traceback (most recent call last): File "<stdin>", line 3, in <module> ImportError: No module named pkgutil ---------------------------------------- ...Installing setuptools, pip, wheel...done. Traceback (most recent call last): File "/tmp/B.vKtRPT/BUILD/thunderbird-52.9.0/mozilla/python/virtualenv/virtualenv.py", line 2325, in <module> main() File "/tmp/B.vKtRPT/BUILD/thunderbird-52.9.0/mozilla/python/virtualenv/virtualenv.py", line 711, in main symlink=options.symlink and hasattr(os, 'symlink')) # MOZ: Make sure we don't use symlink when we don't have it File "/tmp/B.vKtRPT/BUILD/thunderbird-52.9.0/mozilla/python/virtualenv/virtualenv.py", line 944, in create_environment download=download, File "/tmp/B.vKtRPT/BUILD/thunderbird-52.9.0/mozilla/python/virtualenv/virtualenv.py", line 900, in install_wheel call_subprocess(cmd, show_stdout=False, extra_env=env, stdin=SCRIPT) File "/tmp/B.vKtRPT/BUILD/thunderbird-52.9.0/mozilla/python/virtualenv/virtualenv.py", line 795, in call_subprocess % (cmd_desc, proc.returncode)) OSError: Command /tmp/B.vKtRPT/BUILD/...ualenv/bin/python2.7 - setuptools pip wheel failed with error code 1 Traceback (most recent call last): File "/tmp/B.vKtRPT/BUILD/thunderbird-52.9.0/configure.py", line 32, in <module> sys.exit(main(sys.argv)) File "/tmp/B.vKtRPT/BUILD/thunderbird-52.9.0/configure.py", line 24, in main sandbox.run(os.path.join(os.path.dirname(__file__), 'moz.configure')) File "/tmp/B.vKtRPT/BUILD/thunderbird-52.9.0/mozilla/python/mozbuild/mozbuild/configure/__init__.py", line 334, in run self.include_file(path) File "/tmp/B.vKtRPT/BUILD/thunderbird-52.9.0/mozilla/python/mozbuild/mozbuild/configure/__init__.py", line 325, in include_file exec_(code, self) File "/tmp/B.vKtRPT/BUILD/thunderbird-52.9.0/mozilla/python/mozbuild/mozbuild/util.py", line 59, in exec_ exec(object, globals, locals) File "/tmp/B.vKtRPT/BUILD/thunderbird-52.9.0/moz.configure", line 7, in <module> include('mozilla/moz.configure') File "/tmp/B.vKtRPT/BUILD/thunderbird-52.9.0/mozilla/python/mozbuild/mozbuild/configure/__init__.py", line 627, in include_impl self.include_file(what) File "/tmp/B.vKtRPT/BUILD/thunderbird-52.9.0/mozilla/python/mozbuild/mozbuild/configure/__init__.py", line 325, in include_file exec_(code, self) File "/tmp/B.vKtRPT/BUILD/thunderbird-52.9.0/mozilla/python/mozbuild/mozbuild/util.py", line 59, in exec_ exec(object, globals, locals) File "/tmp/B.vKtRPT/BUILD/thunderbird-52.9.0/mozilla/moz.configure", line 7, in <module> include('build/moz.configure/init.configure') File "/tmp/B.vKtRPT/BUILD/thunderbird-52.9.0/mozilla/python/mozbuild/mozbuild/configure/__init__.py", line 627, in include_impl self.include_file(what) File "/tmp/B.vKtRPT/BUILD/thunderbird-52.9.0/mozilla/python/mozbuild/mozbuild/configure/__init__.py", line 325, in include_file exec_(code, self) File "/tmp/B.vKtRPT/BUILD/thunderbird-52.9.0/mozilla/python/mozbuild/mozbuild/util.py", line 59, in exec_ exec(object, globals, locals) File "/tmp/B.vKtRPT/BUILD/thunderbird-52.9.0/mozilla/build/moz.configure/init.configure", line 153, in <module> @imports('distutils.sysconfig') File "/tmp/B.vKtRPT/BUILD/thunderbird-52.9.0/mozilla/python/mozbuild/mozbuild/configure/__init__.py", line 610, in decorator depends = DependsFunction(self, func, dependencies, when=when) File "/tmp/B.vKtRPT/BUILD/thunderbird-52.9.0/mozilla/python/mozbuild/mozbuild/configure/__init__.py", line 69, in __init__ sandbox._value_for(self) File "/tmp/B.vKtRPT/BUILD/thunderbird-52.9.0/mozilla/python/mozbuild/mozbuild/configure/__init__.py", line 406, in _value_for return self._value_for_depends(obj, need_help_dependency) File "/tmp/B.vKtRPT/BUILD/thunderbird-52.9.0/mozilla/python/mozbuild/mozbuild/util.py", line 925, in method_call cache[args] = self.func(instance, *args) File "/tmp/B.vKtRPT/BUILD/thunderbird-52.9.0/mozilla/python/mozbuild/mozbuild/configure/__init__.py", line 416, in _value_for_depends return obj.result File "/tmp/B.vKtRPT/BUILD/thunderbird-52.9.0/mozilla/python/mozbuild/mozbuild/util.py", line 943, in __get__ setattr(instance, name, self.func(instance)) File "/tmp/B.vKtRPT/BUILD/thunderbird-52.9.0/mozilla/python/mozbuild/mozbuild/configure/__init__.py", line 90, in result return self.func(*resolved_args) File "/tmp/B.vKtRPT/BUILD/thunderbird-52.9.0/mozilla/python/mozbuild/mozbuild/configure/__init__.py", line 932, in wrapped return new_func(*args, **kwargs) File "/tmp/B.vKtRPT/BUILD/thunderbird-52.9.0/mozilla/build/moz.configure/init.configure", line 200, in virtualenv_python manager.build(python) File "/tmp/B.vKtRPT/BUILD/thunderbird-52.9.0/mozilla/python/mozbuild/mozbuild/virtualenv.py", line 439, in build self.create(python) File "/tmp/B.vKtRPT/BUILD/thunderbird-52.9.0/mozilla/python/mozbuild/mozbuild/virtualenv.py", line 203, in create 'Failed to create virtualenv: %s' % self.virtualenv_root) Exception: Failed to create virtualenv: /tmp/B.vKtRPT/BUILD/thunderbird-52.9.0/obj-x32/_virtualenv *** Fix above errors and then restart with\ "/usr/bin/make -f client.mk build" make[1]: *** [/tmp/B.vKtRPT/BUILD/thunderbird-52.9.0/client.mk:362: configure] Error 1 make[1]: Leaving directory '/tmp/B.vKtRPT/BUILD/thunderbird-52.9.0' make: *** [client.mk:374: /tmp/B.vKtRPT/BUILD/thunderbird-52.9.0/obj-x32/Makefile] Error 2 error: Bad exit status from /tmp/B.vKtRPT/BUILD/tmp/rpm-tmp.69924 (%build) RPM build errors: Bad exit status from /tmp/B.vKtRPT/BUILD/tmp/rpm-tmp.69924 (%build) ended at: Mon Jul 9 11:45:09 2018, done in 0:00:31.143971 error: No files produced. + chmod -R u+rwX /tmp/B.vKtRPT/BUILD + rm -rf /tmp/B.vKtRPT/tmp /tmp/B.vKtRPT/BUILD + rm -rf /tmp/B.vKtRPT Begin-PLD-Builder-Info Build-Time: user:37.67s sys:28.15s real:190.12s (faults io:0 non-io:334672) End-PLD-Builder-Info
[Back to list of logs] [View rpm -qa of builder]