FailedOk

th/SRPMS[OK]
th/x32[OK]
th/i686[OK]
th/x86_64[OK]

ac/SRPMS[OK]
ac/i386[OK]
ac/i586[OK]
ac/i686[OK]
ac/alpha[OK]
ac/amd64[OK]
ac/athlon[OK]
ac/ppc[OK]
ac/sparc[OK]
ac/sparc64[OK]

Advanced Search
main()
Powered by PLD Linux
(c) 2002-2019 PLD Team
$Revision: 1.37 $
Powered by KDE.
Your IP: 34.204.203.142

umlinux-tools 0f69332c-d4bc-446a-8d74-78ac60d82a3b

Status:Failed
Source URL:ftp://buildlogs.pld-linux.org/th/x32/FAIL/umlinux-tools,0f69332c-d4bc-446a-8d74-78ac60d82a3b.bz2
text/plain URL:View!
rpm -qa of builder:View!
Date:2019/10/19 14:41:56
Runtime:0:00:01.605467

Toc:

  • prep
  • Executing(%prep): /bin/sh -e /tmp/B.ZkteBE/BUILD/tmp/rpm-tmp.75215
  • build
  • Executing(%build): /bin/sh -e /tmp/B.ZkteBE/BUILD/tmp/rpm-tmp.75215
  • error 1
  • /tmp/B.ZkteBE/BUILD/tools-20070815/uml_net/host.c:215: undefined reference to `makedev'
  • error 2
  • collect2: error: ld returned 1 exit status
  • error 3
  • make[1]: *** [Makefile:18: uml_net] Error 1
  • error 4
  • error: Bad exit status from /tmp/B.ZkteBE/BUILD/tmp/rpm-tmp.75215 (%build)
  • error 5
  • RPM build errors:
  • error 6
  • error: No files produced.

Content:

request from: baggins
checking if we should skip the build
started at: Sat Oct 19 14:41:52 2019
killing old processes on a builder
sending signal 9 to pid -1
Killed
cleaning up /tmp
fetching https://srcbuilder.pld-linux.org/th//srpms/0f69332c-d4bc-446a-8d74-78ac60d82a3b/umlinux-tools-20070815-5.src.rpm
fetched 61332 bytes, 216.2 K/s
installing srpm: umlinux-tools-20070815-5.src.rpm
+ install -d /tmp/B.ZkteBE/BUILD /tmp/B.ZkteBE/RPMS
+ LC_ALL=en_US.UTF-8
+ rpm -qp --changelog umlinux-tools-20070815-5.src.rpm
* Sat Oct 19 2019 PLD Linux Team <feedback@pld-linux.org>
- For complete changelog see: http://git.pld-linux.org/?p=packages/umlinux-tools.git;a=log;h=master
* Thu Oct 17 2019 Arkadiusz Miƛkiewicz <arekm@maven.pl> aed3fb4
- release 5 (by relup.sh) + rpm -Uhv --nodeps --define '_topdir /tmp/B.ZkteBE' --define '_specdir %{_topdir}' --define '_sourcedir %{_specdir}' --define '_rpmdir %{_topdir}/RPMS' --define '_builddir %{_topdir}/BUILD' umlinux-tools-20070815-5.src.rpm Preparing... ################################################## umlinux-tools ################################################## + rm -f umlinux-tools-20070815-5.src.rpm + install -m 700 -d /tmp/B.ZkteBE/BUILD/tmp + TMPDIR=/tmp/B.ZkteBE/BUILD/tmp + exec nice -n 0 rpmbuild -bp --short-circuit --nodeps --define '_topdir /tmp/B.ZkteBE' --define '_specdir %{_topdir}' --define '_sourcedir %{_specdir}' --define '_rpmdir %{_topdir}/RPMS' --define '_builddir %{_topdir}/BUILD' --target x32-pld-linux --define 'prep exit 0' /tmp/B.ZkteBE/umlinux-tools.spec Building target platforms: x32-pld-linux checking BuildConflict-ing packages no BuildConflicts found checking BR rpm: Building target platforms: x32-pld-linux no BR needed building RPM using: set -ex; : build-id: 0f69332c-d4bc-446a-8d74-78ac60d82a3b; TMPDIR=/tmp/B.ZkteBE/BUILD/tmp exec nice -n 0 rpmbuild -bb --define '_smp_mflags -j9' --define '_make_opts -Otarget' --define '_pld_builder 1' --define '_topdir /tmp/B.ZkteBE' --define '_specdir %{_topdir}' --define '_sourcedir %{_specdir}' --define '_rpmdir %{_topdir}/RPMS' --define '_builddir %{_topdir}/BUILD' --target x32-pld-linux /tmp/B.ZkteBE/umlinux-tools.spec + : build-id: 0f69332c-d4bc-446a-8d74-78ac60d82a3b + TMPDIR=/tmp/B.ZkteBE/BUILD/tmp + exec nice -n 0 rpmbuild -bb --define '_smp_mflags -j9' --define '_make_opts -Otarget' --define '_pld_builder 1' --define '_topdir /tmp/B.ZkteBE' --define '_specdir %{_topdir}' --define '_sourcedir %{_specdir}' --define '_rpmdir %{_topdir}/RPMS' --define '_builddir %{_topdir}/BUILD' --target x32-pld-linux /tmp/B.ZkteBE/umlinux-tools.spec Building target platforms: x32-pld-linux Executing(%prep): /bin/sh -e /tmp/B.ZkteBE/BUILD/tmp/rpm-tmp.75215 + umask 022 + cd /tmp/B.ZkteBE/BUILD + cd /tmp/B.ZkteBE/BUILD + rm -rf tools-20070815 + /usr/bin/bzip2 -dc /tmp/B.ZkteBE/uml_utilities_20070815.tar.bz2 + /bin/tar -xf - + STATUS=0 + '[' 0 -ne 0 ']' + cd tools-20070815 + /bin/id -u + '[' 1000 '=' 0 ']' + /bin/id -u + '[' 1000 '=' 0 ']' + /bin/chmod -Rf a+rX,u+w,g-w,o-w . + echo 'Patch #0 (umlinux-tools-Makefile.patch):' Patch #0 (umlinux-tools-Makefile.patch): + '[' -f /tmp/B.ZkteBE/umlinux-tools-Makefile.patch ']' + /bin/cat /tmp/B.ZkteBE/umlinux-tools-Makefile.patch + /usr/bin/patch -s -p1 + echo 'Patch #1 (no-hardcoded-libdir.patch):' Patch #1 (no-hardcoded-libdir.patch): + '[' -f /tmp/B.ZkteBE/no-hardcoded-libdir.patch ']' + /bin/cat /tmp/B.ZkteBE/no-hardcoded-libdir.patch + /usr/bin/patch -s -p1 + exit 0 Executing(%build): /bin/sh -e /tmp/B.ZkteBE/BUILD/tmp/rpm-tmp.75215 HOME=/home/users/builder PATH=/home/users/builder/GNUstep/Tools:/usr/local/bin:/usr/bin:/bin TMPDIR=/tmp/B.ZkteBE/BUILD/tmp + umask 022 + cd /tmp/B.ZkteBE/BUILD + cd tools-20070815 + /usr/bin/make -Otarget -j9 'CC=x86_64-pld-linux-gnux32-gcc' 'CFLAGS=-O2 -fwrapv -pipe -Wformat -Werror=format-security -gdwarf-4 -fno-debug-types-section -fvar-tracking-assignments -g2 -Wp,-D_FORTIFY_SOURCE=2 -fstack-protector-strong --param=ssp-buffer-size=4 -Werror=trampolines -fPIC -mtune=generic -march=x86-64 -gdwarf-4 -fno-debug-types-section -fvar-tracking-assignments -g2 -Wall' 'LDFLAGS=-Wl,--as-needed -Wl,--no-copy-dt-needed-entries -Wl,-z,relro -Wl,-z,combreloc ' 'LIB_DIR=/usr/libx32/uml' set -e ; for dir in lib jail jailtest humfsify mconsole moo port-helper tunctl uml_net uml_switch watchdog umlfs; do /usr/bin/make -C $dir all; done make[1]: Entering directory '/tmp/B.ZkteBE/BUILD/tools-20070815/lib' x86_64-pld-linux-gnux32-gcc -O2 -fwrapv -pipe -Wformat -Werror=format-security -gdwarf-4 -fno-debug-types-section -fvar-tracking-assignments -g2 -Wp,-D_FORTIFY_SOURCE=2 -fstack-protector-strong --param=ssp-buffer-size=4 -Werror=trampolines -fPIC -mtune=generic -march=x86-64 -gdwarf-4 -fno-debug-types-section -fvar-tracking-assignments -g2 -Wall -c -o rights.o rights.c make[1]: Leaving directory '/tmp/B.ZkteBE/BUILD/tools-20070815/lib' make[1]: Entering directory '/tmp/B.ZkteBE/BUILD/tools-20070815/lib' ar r libuml.a rights.o ar: creating libuml.a make[1]: Leaving directory '/tmp/B.ZkteBE/BUILD/tools-20070815/lib' make[1]: Entering directory '/tmp/B.ZkteBE/BUILD/tools-20070815/jail' x86_64-pld-linux-gnux32-gcc -O2 -fwrapv -pipe -Wformat -Werror=format-security -gdwarf-4 -fno-debug-types-section -fvar-tracking-assignments -g2 -Wp,-D_FORTIFY_SOURCE=2 -fstack-protector-strong --param=ssp-buffer-size=4 -Werror=trampolines -fPIC -mtune=generic -march=x86-64 -gdwarf-4 -fno-debug-types-section -fvar-tracking-assignments -g2 -Wall -c -o jail_uml.o jail_uml.c make[1]: Leaving directory '/tmp/B.ZkteBE/BUILD/tools-20070815/jail' make[1]: Entering directory '/tmp/B.ZkteBE/BUILD/tools-20070815/jail' x86_64-pld-linux-gnux32-gcc -O2 -fwrapv -pipe -Wformat -Werror=format-security -gdwarf-4 -fno-debug-types-section -fvar-tracking-assignments -g2 -Wp,-D_FORTIFY_SOURCE=2 -fstack-protector-strong --param=ssp-buffer-size=4 -Werror=trampolines -fPIC -mtune=generic -march=x86-64 -gdwarf-4 -fno-debug-types-section -fvar-tracking-assignments -g2 -Wall -o jail_uml jail_uml.o make[1]: Leaving directory '/tmp/B.ZkteBE/BUILD/tools-20070815/jail' make[1]: Entering directory '/tmp/B.ZkteBE/BUILD/tools-20070815/jailtest' x86_64-pld-linux-gnux32-gcc -O2 -fwrapv -pipe -Wformat -Werror=format-security -gdwarf-4 -fno-debug-types-section -fvar-tracking-assignments -g2 -Wp,-D_FORTIFY_SOURCE=2 -fstack-protector-strong --param=ssp-buffer-size=4 -Werror=trampolines -fPIC -mtune=generic -march=x86-64 -gdwarf-4 -fno-debug-types-section -fvar-tracking-assignments -g2 -Wall -c -o jailtest.o jailtest.c make[1]: Leaving directory '/tmp/B.ZkteBE/BUILD/tools-20070815/jailtest' make[1]: Entering directory '/tmp/B.ZkteBE/BUILD/tools-20070815/jailtest' x86_64-pld-linux-gnux32-gcc -O2 -fwrapv -pipe -Wformat -Werror=format-security -gdwarf-4 -fno-debug-types-section -fvar-tracking-assignments -g2 -Wp,-D_FORTIFY_SOURCE=2 -fstack-protector-strong --param=ssp-buffer-size=4 -Werror=trampolines -fPIC -mtune=generic -march=x86-64 -gdwarf-4 -fno-debug-types-section -fvar-tracking-assignments -g2 -Wall -o jailtest jailtest.o make[1]: Leaving directory '/tmp/B.ZkteBE/BUILD/tools-20070815/jailtest' make[1]: Nothing to be done for 'all'. make[1]: Entering directory '/tmp/B.ZkteBE/BUILD/tools-20070815/mconsole' x86_64-pld-linux-gnux32-gcc -O2 -fwrapv -pipe -Wformat -Werror=format-security -gdwarf-4 -fno-debug-types-section -fvar-tracking-assignments -g2 -Wp,-D_FORTIFY_SOURCE=2 -fstack-protector-strong --param=ssp-buffer-size=4 -Werror=trampolines -fPIC -mtune=generic -march=x86-64 -gdwarf-4 -fno-debug-types-section -fvar-tracking-assignments -g2 -Wall -c -o uml_mconsole.o uml_mconsole.c uml_mconsole.c: In function 'do_switch': uml_mconsole.c:72:3: warning: ignoring return value of 'fread', declared with attribute warn_unused_result [-Wunused-result] 72 | fread(&pid[++x], sizeof(char), 1, fp); | ^~~~~~~~~~~~~~~~~~~~~~~~~~~~~~~~~~~~~ uml_mconsole.c: In function 'absolutize': uml_mconsole.c:176:3: warning: ignoring return value of 'chdir', declared with attribute warn_unused_result [-Wunused-result] 176 | chdir(save_cwd); | ^~~~~~~~~~~~~~~ In file included from /usr/include/string.h:494, from /usr/include/sys/un.h:37, from uml_mconsole.c:37: In function 'strncpy', inlined from 'do_switch' at uml_mconsole.c:60:2: /usr/include/bits/string_fortified.h:106:10: warning: '__builtin_strncpy' specified bound 108 equals destination size [-Wstringop-truncation] 106 | return __builtin___strncpy_chk (__dest, __src, __len, __bos (__dest)); | ^~~~~~~~~~~~~~~~~~~~~~~~~~~~~~~~~~~~~~~~~~~~~~~~~~~~~~~~~~~~~~ In function 'strncpy', inlined from 'do_switch' at uml_mconsole.c:61:2: /usr/include/bits/string_fortified.h:106:10: warning: '__builtin_strncpy' specified bound 11 equals destination size [-Wstringop-truncation] 106 | return __builtin___strncpy_chk (__dest, __src, __len, __bos (__dest)); | ^~~~~~~~~~~~~~~~~~~~~~~~~~~~~~~~~~~~~~~~~~~~~~~~~~~~~~~~~~~~~~ uml_mconsole.c: In function 'switch_common': uml_mconsole.c:92:38: warning: '/mconsole' directive output may be truncated writing 9 bytes into a region of size between 0 and 4096 [-Wformat-truncation=] 92 | snprintf(file, sizeof(file), "%s/%s/mconsole", dir, name); | ^~~~~~~~~ In file included from /usr/include/stdio.h:867, from uml_mconsole.c:26: /usr/include/bits/stdio2.h:67:10: note: '__builtin___snprintf_chk' output 11 or more bytes (assuming 4107) into a destination of size 4097 67 | return __builtin___snprintf_chk (__s, __n, __USE_FORTIFY_LEVEL - 1, | ^~~~~~~~~~~~~~~~~~~~~~~~~~~~~~~~~~~~~~~~~~~~~~~~~~~~~~~~~~~~ 68 | __bos (__s), __fmt, __va_arg_pack ()); | ~~~~~~~~~~~~~~~~~~~~~~~~~~~~~~~~~~~~~ make[1]: Leaving directory '/tmp/B.ZkteBE/BUILD/tools-20070815/mconsole' make[1]: Entering directory '/tmp/B.ZkteBE/BUILD/tools-20070815/mconsole' x86_64-pld-linux-gnux32-gcc -O2 -fwrapv -pipe -Wformat -Werror=format-security -gdwarf-4 -fno-debug-types-section -fvar-tracking-assignments -g2 -Wp,-D_FORTIFY_SOURCE=2 -fstack-protector-strong --param=ssp-buffer-size=4 -Werror=trampolines -fPIC -mtune=generic -march=x86-64 -gdwarf-4 -fno-debug-types-section -fvar-tracking-assignments -g2 -Wall -o uml_mconsole uml_mconsole.o -Wl,--as-needed -Wl,--no-copy-dt-needed-entries -Wl,-z,relro -Wl,-z,combreloc ../lib/libuml.a -lreadline -lncurses make[1]: Leaving directory '/tmp/B.ZkteBE/BUILD/tools-20070815/mconsole' make[1]: Entering directory '/tmp/B.ZkteBE/BUILD/tools-20070815/moo' x86_64-pld-linux-gnux32-gcc -O2 -fwrapv -pipe -Wformat -Werror=format-security -gdwarf-4 -fno-debug-types-section -fvar-tracking-assignments -g2 -Wp,-D_FORTIFY_SOURCE=2 -fstack-protector-strong --param=ssp-buffer-size=4 -Werror=trampolines -fPIC -mtune=generic -march=x86-64 -gdwarf-4 -fno-debug-types-section -fvar-tracking-assignments -g2 -Wall -D_FILE_OFFSET_BITS=64 -D_LARGEFILE64_SOURCE -D_GNU_SOURCE -c -o uml_mkcow.o uml_mkcow.c make[1]: Leaving directory '/tmp/B.ZkteBE/BUILD/tools-20070815/moo' make[1]: Entering directory '/tmp/B.ZkteBE/BUILD/tools-20070815/moo' x86_64-pld-linux-gnux32-gcc -O2 -fwrapv -pipe -Wformat -Werror=format-security -gdwarf-4 -fno-debug-types-section -fvar-tracking-assignments -g2 -Wp,-D_FORTIFY_SOURCE=2 -fstack-protector-strong --param=ssp-buffer-size=4 -Werror=trampolines -fPIC -mtune=generic -march=x86-64 -gdwarf-4 -fno-debug-types-section -fvar-tracking-assignments -g2 -Wall -D_FILE_OFFSET_BITS=64 -D_LARGEFILE64_SOURCE -D_GNU_SOURCE -c -o uml_moo.o uml_moo.c uml_moo.c: In function 'create_backing_file': uml_moo.c:68:22: warning: pointer targets in passing argument 7 of 'read_cow_header' differ in signedness [-Wpointer-sign] 68 | &mtime, &size, &sectorsize, &alignment, | ^~~~~~~~~~~ | | | unsigned int * In file included from uml_moo.c:19: cow.h:24:29: note: expected 'int *' but argument is of type 'unsigned int *' 24 | __u64 *size_out, int *sectorsize_out, | ~~~~~^~~~~~~~~~~~~~ uml_moo.c:89:37: warning: format '%ld' expects argument of type 'long int', but argument 3 has type 'time_t' {aka 'long long int'} [-Wformat=] 89 | fprintf(stderr,"mtime mismatch (%ld vs %ld) of COW " | ~~^ | | | long int | %lld 90 | "header vs backing file \"%s\"\n", mtime, buf.st_mtime, | ~~~~~ | | | time_t {aka long long int} uml_moo.c:89:44: warning: format '%ld' expects argument of type 'long int', but argument 4 has type '__time_t' {aka 'long long int'} [-Wformat=] 89 | fprintf(stderr,"mtime mismatch (%ld vs %ld) of COW " | ~~^ | | | long int | %lld make[1]: Leaving directory '/tmp/B.ZkteBE/BUILD/tools-20070815/moo' make[1]: Entering directory '/tmp/B.ZkteBE/BUILD/tools-20070815/moo' x86_64-pld-linux-gnux32-gcc -O2 -fwrapv -pipe -Wformat -Werror=format-security -gdwarf-4 -fno-debug-types-section -fvar-tracking-assignments -g2 -Wp,-D_FORTIFY_SOURCE=2 -fstack-protector-strong --param=ssp-buffer-size=4 -Werror=trampolines -fPIC -mtune=generic -march=x86-64 -gdwarf-4 -fno-debug-types-section -fvar-tracking-assignments -g2 -Wall -D_FILE_OFFSET_BITS=64 -D_LARGEFILE64_SOURCE -D_GNU_SOURCE -c -o cow.o cow.c cow.c: In function 'absolutize': cow.c:182:2: warning: ignoring return value of 'chdir', declared with attribute warn_unused_result [-Wunused-result] 182 | chdir(save_cwd); | ^~~~~~~~~~~~~~~ make[1]: Leaving directory '/tmp/B.ZkteBE/BUILD/tools-20070815/moo' make[1]: Entering directory '/tmp/B.ZkteBE/BUILD/tools-20070815/moo' x86_64-pld-linux-gnux32-gcc -O2 -fwrapv -pipe -Wformat -Werror=format-security -gdwarf-4 -fno-debug-types-section -fvar-tracking-assignments -g2 -Wp,-D_FORTIFY_SOURCE=2 -fstack-protector-strong --param=ssp-buffer-size=4 -Werror=trampolines -fPIC -mtune=generic -march=x86-64 -gdwarf-4 -fno-debug-types-section -fvar-tracking-assignments -g2 -Wall -D_FILE_OFFSET_BITS=64 -D_LARGEFILE64_SOURCE -D_GNU_SOURCE -o uml_moo uml_moo.o cow.o make[1]: Leaving directory '/tmp/B.ZkteBE/BUILD/tools-20070815/moo' make[1]: Entering directory '/tmp/B.ZkteBE/BUILD/tools-20070815/moo' x86_64-pld-linux-gnux32-gcc -O2 -fwrapv -pipe -Wformat -Werror=format-security -gdwarf-4 -fno-debug-types-section -fvar-tracking-assignments -g2 -Wp,-D_FORTIFY_SOURCE=2 -fstack-protector-strong --param=ssp-buffer-size=4 -Werror=trampolines -fPIC -mtune=generic -march=x86-64 -gdwarf-4 -fno-debug-types-section -fvar-tracking-assignments -g2 -Wall -D_FILE_OFFSET_BITS=64 -D_LARGEFILE64_SOURCE -D_GNU_SOURCE -o uml_mkcow uml_mkcow.o cow.o make[1]: Leaving directory '/tmp/B.ZkteBE/BUILD/tools-20070815/moo' make[1]: Entering directory '/tmp/B.ZkteBE/BUILD/tools-20070815/port-helper' x86_64-pld-linux-gnux32-gcc -O2 -fwrapv -pipe -Wformat -Werror=format-security -gdwarf-4 -fno-debug-types-section -fvar-tracking-assignments -g2 -Wp,-D_FORTIFY_SOURCE=2 -fstack-protector-strong --param=ssp-buffer-size=4 -Werror=trampolines -fPIC -mtune=generic -march=x86-64 -gdwarf-4 -fno-debug-types-section -fvar-tracking-assignments -g2 -Wall -c -o port-helper.o port-helper.c make[1]: Leaving directory '/tmp/B.ZkteBE/BUILD/tools-20070815/port-helper' make[1]: Entering directory '/tmp/B.ZkteBE/BUILD/tools-20070815/port-helper' x86_64-pld-linux-gnux32-gcc -O2 -fwrapv -pipe -Wformat -Werror=format-security -gdwarf-4 -fno-debug-types-section -fvar-tracking-assignments -g2 -Wp,-D_FORTIFY_SOURCE=2 -fstack-protector-strong --param=ssp-buffer-size=4 -Werror=trampolines -fPIC -mtune=generic -march=x86-64 -gdwarf-4 -fno-debug-types-section -fvar-tracking-assignments -g2 -Wall -o port-helper port-helper.o ../lib/libuml.a make[1]: Leaving directory '/tmp/B.ZkteBE/BUILD/tools-20070815/port-helper' make[1]: Entering directory '/tmp/B.ZkteBE/BUILD/tools-20070815/tunctl' x86_64-pld-linux-gnux32-gcc -O2 -fwrapv -pipe -Wformat -Werror=format-security -gdwarf-4 -fno-debug-types-section -fvar-tracking-assignments -g2 -Wp,-D_FORTIFY_SOURCE=2 -fstack-protector-strong --param=ssp-buffer-size=4 -Werror=trampolines -fPIC -mtune=generic -march=x86-64 -gdwarf-4 -fno-debug-types-section -fvar-tracking-assignments -g2 -Wall -c -o tunctl.o tunctl.c make[1]: Leaving directory '/tmp/B.ZkteBE/BUILD/tools-20070815/tunctl' make[1]: Entering directory '/tmp/B.ZkteBE/BUILD/tools-20070815/tunctl' x86_64-pld-linux-gnux32-gcc -O2 -fwrapv -pipe -Wformat -Werror=format-security -gdwarf-4 -fno-debug-types-section -fvar-tracking-assignments -g2 -Wp,-D_FORTIFY_SOURCE=2 -fstack-protector-strong --param=ssp-buffer-size=4 -Werror=trampolines -fPIC -mtune=generic -march=x86-64 -gdwarf-4 -fno-debug-types-section -fvar-tracking-assignments -g2 -Wall -o tunctl tunctl.o make[1]: Leaving directory '/tmp/B.ZkteBE/BUILD/tools-20070815/tunctl' make[1]: Entering directory '/tmp/B.ZkteBE/BUILD/tools-20070815/uml_net' x86_64-pld-linux-gnux32-gcc -O2 -fwrapv -pipe -Wformat -Werror=format-security -gdwarf-4 -fno-debug-types-section -fvar-tracking-assignments -g2 -Wp,-D_FORTIFY_SOURCE=2 -fstack-protector-strong --param=ssp-buffer-size=4 -Werror=trampolines -fPIC -mtune=generic -march=x86-64 -gdwarf-4 -fno-debug-types-section -fvar-tracking-assignments -g2 -Wall -DTUNTAP -c -o output.o output.c make[1]: Leaving directory '/tmp/B.ZkteBE/BUILD/tools-20070815/uml_net' make[1]: Entering directory '/tmp/B.ZkteBE/BUILD/tools-20070815/uml_net' x86_64-pld-linux-gnux32-gcc -O2 -fwrapv -pipe -Wformat -Werror=format-security -gdwarf-4 -fno-debug-types-section -fvar-tracking-assignments -g2 -Wp,-D_FORTIFY_SOURCE=2 -fstack-protector-strong --param=ssp-buffer-size=4 -Werror=trampolines -fPIC -mtune=generic -march=x86-64 -gdwarf-4 -fno-debug-types-section -fvar-tracking-assignments -g2 -Wall -DTUNTAP -c -o uml_net.o uml_net.c make[1]: Leaving directory '/tmp/B.ZkteBE/BUILD/tools-20070815/uml_net' make[1]: Entering directory '/tmp/B.ZkteBE/BUILD/tools-20070815/uml_net' x86_64-pld-linux-gnux32-gcc -O2 -fwrapv -pipe -Wformat -Werror=format-security -gdwarf-4 -fno-debug-types-section -fvar-tracking-assignments -g2 -Wp,-D_FORTIFY_SOURCE=2 -fstack-protector-strong --param=ssp-buffer-size=4 -Werror=trampolines -fPIC -mtune=generic -march=x86-64 -gdwarf-4 -fno-debug-types-section -fvar-tracking-assignments -g2 -Wall -DTUNTAP -c -o slip.o slip.c slip.c: In function 'slip_up.constprop': slip.c:35:49: warning: '%d' directive output may be truncated writing between 1 and 10 bytes into a region of size 5 [-Wformat-truncation=] 35 | snprintf(slip_name, sizeof(slip_name) - 1, "sl%d", n); | ^~ slip.c:35:46: note: directive argument in the range [0, 2147483647] 35 | snprintf(slip_name, sizeof(slip_name) - 1, "sl%d", n); | ^~~~~~ In file included from /usr/include/stdio.h:867, from slip.c:6: /usr/include/bits/stdio2.h:67:10: note: '__builtin___snprintf_chk' output between 4 and 13 bytes into a destination of size 7 67 | return __builtin___snprintf_chk (__s, __n, __USE_FORTIFY_LEVEL - 1, | ^~~~~~~~~~~~~~~~~~~~~~~~~~~~~~~~~~~~~~~~~~~~~~~~~~~~~~~~~~~~ 68 | __bos (__s), __fmt, __va_arg_pack ()); | ~~~~~~~~~~~~~~~~~~~~~~~~~~~~~~~~~~~~~ make[1]: Leaving directory '/tmp/B.ZkteBE/BUILD/tools-20070815/uml_net' make[1]: Entering directory '/tmp/B.ZkteBE/BUILD/tools-20070815/uml_net' x86_64-pld-linux-gnux32-gcc -O2 -fwrapv -pipe -Wformat -Werror=format-security -gdwarf-4 -fno-debug-types-section -fvar-tracking-assignments -g2 -Wp,-D_FORTIFY_SOURCE=2 -fstack-protector-strong --param=ssp-buffer-size=4 -Werror=trampolines -fPIC -mtune=generic -march=x86-64 -gdwarf-4 -fno-debug-types-section -fvar-tracking-assignments -g2 -Wall -DTUNTAP -c -o tuntap.o tuntap.c make[1]: Leaving directory '/tmp/B.ZkteBE/BUILD/tools-20070815/uml_net' make[1]: Entering directory '/tmp/B.ZkteBE/BUILD/tools-20070815/uml_net' x86_64-pld-linux-gnux32-gcc -O2 -fwrapv -pipe -Wformat -Werror=format-security -gdwarf-4 -fno-debug-types-section -fvar-tracking-assignments -g2 -Wp,-D_FORTIFY_SOURCE=2 -fstack-protector-strong --param=ssp-buffer-size=4 -Werror=trampolines -fPIC -mtune=generic -march=x86-64 -gdwarf-4 -fno-debug-types-section -fvar-tracking-assignments -g2 -Wall -DTUNTAP -c -o host.o host.c host.c: In function 'mk_node': host.c:215:51: warning: implicit declaration of function 'makedev' [-Wimplicit-function-declaration] 215 | return(mknod(devname, S_IFCHR|S_IREAD|S_IWRITE, makedev(major, minor))); | ^~~~~~~ host.c: In function 'local_net_do': host.c:94:64: warning: '%s' directive writing up to 1023 bytes into a region of size between 973 and 983 [-Wformat-overflow=] 94 | sprintf(out, "Didn't parse /proc/net/route, got %d\n on '%s'", n, buf); | ^~ ~~~ In file included from /usr/include/stdio.h:867, from host.c:5: /usr/include/bits/stdio2.h:36:10: note: '__builtin___sprintf_chk' output between 43 and 1076 bytes into a destination of size 1024 36 | return __builtin___sprintf_chk (__s, __USE_FORTIFY_LEVEL - 1, | ^~~~~~~~~~~~~~~~~~~~~~~~~~~~~~~~~~~~~~~~~~~~~~~~~~~~~~ 37 | __bos (__s), __fmt, __va_arg_pack ()); | ~~~~~~~~~~~~~~~~~~~~~~~~~~~~~~~~~~~~~ host.c: In function 'route_and_arp': host.c:130:53: warning: '__builtin___snprintf_chk' output may be truncated before the last format character [-Wformat-truncation=] 130 | "echo 1 > /proc/sys/net/ipv4/conf/%.9s/proxy_arp", dev); | ^ In file included from /usr/include/stdio.h:867, from host.c:5: /usr/include/bits/stdio2.h:67:10: note: '__builtin___snprintf_chk' output between 44 and 53 bytes into a destination of size 52 67 | return __builtin___snprintf_chk (__s, __n, __USE_FORTIFY_LEVEL - 1, | ^~~~~~~~~~~~~~~~~~~~~~~~~~~~~~~~~~~~~~~~~~~~~~~~~~~~~~~~~~~~ 68 | __bos (__s), __fmt, __va_arg_pack ()); | ~~~~~~~~~~~~~~~~~~~~~~~~~~~~~~~~~~~~~ host.c: In function 'no_route_and_arp': host.c:152:53: warning: '__builtin___snprintf_chk' output may be truncated before the last format character [-Wformat-truncation=] 152 | "echo 0 > /proc/sys/net/ipv4/conf/%.9s/proxy_arp", dev); | ^ In file included from /usr/include/stdio.h:867, from host.c:5: /usr/include/bits/stdio2.h:67:10: note: '__builtin___snprintf_chk' output between 44 and 53 bytes into a destination of size 52 67 | return __builtin___snprintf_chk (__s, __n, __USE_FORTIFY_LEVEL - 1, | ^~~~~~~~~~~~~~~~~~~~~~~~~~~~~~~~~~~~~~~~~~~~~~~~~~~~~~~~~~~~ 68 | __bos (__s), __fmt, __va_arg_pack ()); | ~~~~~~~~~~~~~~~~~~~~~~~~~~~~~~~~~~~~~ make[1]: Leaving directory '/tmp/B.ZkteBE/BUILD/tools-20070815/uml_net' make[1]: Entering directory '/tmp/B.ZkteBE/BUILD/tools-20070815/uml_net' x86_64-pld-linux-gnux32-gcc -O2 -fwrapv -pipe -Wformat -Werror=format-security -gdwarf-4 -fno-debug-types-section -fvar-tracking-assignments -g2 -Wp,-D_FORTIFY_SOURCE=2 -fstack-protector-strong --param=ssp-buffer-size=4 -Werror=trampolines -fPIC -mtune=generic -march=x86-64 -gdwarf-4 -fno-debug-types-section -fvar-tracking-assignments -g2 -Wall -DTUNTAP -c -o ethertap.o ethertap.c make[1]: Leaving directory '/tmp/B.ZkteBE/BUILD/tools-20070815/uml_net' make[1]: Entering directory '/tmp/B.ZkteBE/BUILD/tools-20070815/uml_net' x86_64-pld-linux-gnux32-gcc -O2 -fwrapv -pipe -Wformat -Werror=format-security -gdwarf-4 -fno-debug-types-section -fvar-tracking-assignments -g2 -Wp,-D_FORTIFY_SOURCE=2 -fstack-protector-strong --param=ssp-buffer-size=4 -Werror=trampolines -fPIC -mtune=generic -march=x86-64 -gdwarf-4 -fno-debug-types-section -fvar-tracking-assignments -g2 -Wall -DTUNTAP -o uml_net ethertap.o host.o output.o slip.o uml_net.o tuntap.o /usr/bin/ld: host.o: in function `mk_node': /tmp/B.ZkteBE/BUILD/tools-20070815/uml_net/host.c:215: undefined reference to `makedev' collect2: error: ld returned 1 exit status make[1]: *** [Makefile:18: uml_net] Error 1 make[1]: Leaving directory '/tmp/B.ZkteBE/BUILD/tools-20070815/uml_net' make: *** [Makefile:12: all] Error 2 error: Bad exit status from /tmp/B.ZkteBE/BUILD/tmp/rpm-tmp.75215 (%build) RPM build errors: Bad exit status from /tmp/B.ZkteBE/BUILD/tmp/rpm-tmp.75215 (%build) ended at: Sat Oct 19 14:41:56 2019, done in 0:00:01.605467 error: No files produced. + chmod -R u+rwX /tmp/B.ZkteBE/BUILD + rm -rf /tmp/B.ZkteBE/tmp /tmp/B.ZkteBE/BUILD + rm -rf /tmp/B.ZkteBE Begin-PLD-Builder-Info Build-Time: user:3.28s sys:0.44s real:4.11s (faults io:0 non-io:154709) End-PLD-Builder-Info
[Back to list of logs] [View rpm -qa of builder]