FailedOk

th/SRPMS[OK]
th/x32[OK]
th/i686[OK]
th/x86_64[OK]

ac/SRPMS[OK]
ac/i386[OK]
ac/i586[OK]
ac/i686[OK]
ac/alpha[OK]
ac/amd64[OK]
ac/athlon[OK]
ac/ppc[OK]
ac/sparc[OK]
ac/sparc64[OK]

Advanced Search
main()
Powered by PLD Linux
(c) 2002-2018 PLD Team
$Revision: 1.37 $
Powered by computron.
Your IP: 54.198.3.15

volume_key 27bf8e0c-872b-4dff-94a5-19a0a7c31045

Status:Failed
Source URL:ftp://buildlogs.pld-linux.org/th/x32/FAIL/volume_key,27bf8e0c-872b-4dff-94a5-19a0a7c31045.bz2
text/plain URL:View!
rpm -qa of builder:View!
Date:2018/05/15 12:34:08
Runtime:0:00:17.222140

Toc:

  • prep
  • Executing(%prep): /bin/sh -e /tmp/B.Ut0b2H/BUILD/tmp/rpm-tmp.89490
  • build
  • Executing(%build): /bin/sh -e /tmp/B.Ut0b2H/BUILD/tmp/rpm-tmp.89490
  • error 1
  • lib/.libs/libvolume_key.so: undefined reference to `crypt_get_error'
  • error 2
  • collect2: error: ld returned 1 exit status
  • error 3
  • make[2]: *** [Makefile:960: src/volume_key] Error 1
  • error 4
  • make[1]: *** [Makefile:1224: all-recursive] Error 1
  • error 5
  • error: Bad exit status from /tmp/B.Ut0b2H/BUILD/tmp/rpm-tmp.89490 (%build)
  • error 6
  • RPM build errors:
  • error 7
  • error: No files produced.

Content:

request from: arekm
checking if we should skip the build
started at: Tue May 15 12:33:48 2018
killing old processes on a builder
sending signal 9 to pid -1
Killed
fetching https://srcbuilder.pld-linux.org/th//srpms/27bf8e0c-872b-4dff-94a5-19a0a7c31045/volume_key-0.3.9-2.src.rpm
fetched 459044 bytes, 671.5 K/s
installing srpm: volume_key-0.3.9-2.src.rpm
+ install -d /tmp/B.Ut0b2H/BUILD /tmp/B.Ut0b2H/RPMS
+ LC_ALL=en_US.UTF-8
+ rpm -qp --changelog volume_key-0.3.9-2.src.rpm
* Tue May 15 2018 PLD Linux Team <feedback@pld-linux.org>
- For complete changelog see: http://git.pld-linux.org/?p=packages/volume_key.git;a=log;h=master
* Tue May 15 2018 Arkadiusz Miƛkiewicz <arekm@maven.pl> 9e3ef64
- release 2 (by relup.sh) * Thu Nov 02 2017 Marcin Banasiak <marcin.banasiak@gmail.com> 81e6955
- Initial release (with upstream patches) + rpm -Uhv --nodeps --define '_topdir /tmp/B.Ut0b2H' --define '_specdir %{_topdir}' --define '_sourcedir %{_specdir}' --define '_rpmdir %{_topdir}/RPMS' --define '_builddir %{_topdir}/BUILD' volume_key-0.3.9-2.src.rpm Preparing... ################################################## volume_key ################################################## + rm -f volume_key-0.3.9-2.src.rpm + install -m 700 -d /tmp/B.Ut0b2H/BUILD/tmp + TMPDIR=/tmp/B.Ut0b2H/BUILD/tmp + exec nice -n 0 rpmbuild -bp --short-circuit --nodeps --define '_topdir /tmp/B.Ut0b2H' --define '_specdir %{_topdir}' --define '_sourcedir %{_specdir}' --define '_rpmdir %{_topdir}/RPMS' --define '_builddir %{_topdir}/BUILD' --target x32-pld-linux --define 'prep exit 0' /tmp/B.Ut0b2H/volume_key.spec Building target platforms: x32-pld-linux checking BuildConflict-ing packages no BuildConflicts found checking BR rpm: Building target platforms: x32-pld-linux no BR needed building RPM using: set -ex; : build-id: 27bf8e0c-872b-4dff-94a5-19a0a7c31045; TMPDIR=/tmp/B.Ut0b2H/BUILD/tmp exec nice -n 0 rpmbuild -bb --define '_smp_mflags -j9' --define '_make_opts -Otarget' --define '_pld_builder 1' --define '_topdir /tmp/B.Ut0b2H' --define '_specdir %{_topdir}' --define '_sourcedir %{_specdir}' --define '_rpmdir %{_topdir}/RPMS' --define '_builddir %{_topdir}/BUILD' --target x32-pld-linux /tmp/B.Ut0b2H/volume_key.spec + : build-id: 27bf8e0c-872b-4dff-94a5-19a0a7c31045 + TMPDIR=/tmp/B.Ut0b2H/BUILD/tmp + exec nice -n 0 rpmbuild -bb --define '_smp_mflags -j9' --define '_make_opts -Otarget' --define '_pld_builder 1' --define '_topdir /tmp/B.Ut0b2H' --define '_specdir %{_topdir}' --define '_sourcedir %{_specdir}' --define '_rpmdir %{_topdir}/RPMS' --define '_builddir %{_topdir}/BUILD' --target x32-pld-linux /tmp/B.Ut0b2H/volume_key.spec Building target platforms: x32-pld-linux Executing(%prep): /bin/sh -e /tmp/B.Ut0b2H/BUILD/tmp/rpm-tmp.89490 + umask 022 + cd /tmp/B.Ut0b2H/BUILD + cd /tmp/B.Ut0b2H/BUILD + rm -rf volume_key-0.3.9 + /usr/bin/xz -dc /tmp/B.Ut0b2H/volume_key-0.3.9.tar.xz + /bin/tar -xf - + STATUS=0 + '[' 0 -ne 0 ']' + cd volume_key-0.3.9 + /bin/id -u + '[' 1000 '=' 0 ']' + /bin/id -u + '[' 1000 '=' 0 ']' + /bin/chmod -Rf a+rX,u+w,g-w,o-w . + echo 'Patch #0 (volume_key-config.h.patch):' Patch #0 (volume_key-config.h.patch): + '[' -f /tmp/B.Ut0b2H/volume_key-config.h.patch ']' + /bin/cat /tmp/B.Ut0b2H/volume_key-config.h.patch + /usr/bin/patch -s -p1 + echo 'Patch #1 (volume_key-fips-crash.patch):' Patch #1 (volume_key-fips-crash.patch): + '[' -f /tmp/B.Ut0b2H/volume_key-fips-crash.patch ']' + /bin/cat /tmp/B.Ut0b2H/volume_key-fips-crash.patch + /usr/bin/patch -s -p1 + exit 0 Executing(%build): /bin/sh -e /tmp/B.Ut0b2H/BUILD/tmp/rpm-tmp.89490 HOME=/home/users/builder PATH=/home/users/builder/GNUstep/Tools:/usr/local/bin:/usr/bin:/bin TMPDIR=/tmp/B.Ut0b2H/BUILD/tmp + umask 022 + cd /tmp/B.Ut0b2H/BUILD + cd volume_key-0.3.9 + libtoolize --copy --force --install libtoolize: putting auxiliary files in AC_CONFIG_AUX_DIR, 'admin'. libtoolize: copying file 'admin/config.guess' libtoolize: copying file 'admin/config.sub' libtoolize: copying file 'admin/install-sh' libtoolize: copying file 'admin/ltmain.sh' libtoolize: putting macros in AC_CONFIG_MACRO_DIRS, 'm4'. libtoolize: copying file 'm4/libtool.m4' libtoolize: copying file 'm4/ltoptions.m4' libtoolize: copying file 'm4/ltsugar.m4' libtoolize: copying file 'm4/ltversion.m4' libtoolize: copying file 'm4/lt~obsolete.m4' + aclocal -I m4 + autoconf + autoheader + automake -a -c -f --foreign configure.ac:47: warning: The 'AM_PROG_MKDIR_P' macro is deprecated, and its use is discouraged. configure.ac:47: You should use the Autoconf-provided 'AC_PROG_MKDIR_P' macro instead, configure.ac:47: and use '$(MKDIR_P)' instead of '$(mkdir_p)'in your Makefile.am files. configure.ac:27: installing 'admin/compile' configure.ac:24: installing 'admin/missing' /usr/share/automake/am/ltlibrary.am: warning: 'lib/libvolume_key.la': linking libtool libraries using a non-POSIX /usr/share/automake/am/ltlibrary.am: archiver requires 'AM_PROG_AR' in 'configure.ac' Makefile.am:31: while processing Libtool library 'lib/libvolume_key.la' /usr/share/automake/am/ltlibrary.am: warning: 'python/_volume_key.la': linking libtool libraries using a non-POSIX /usr/share/automake/am/ltlibrary.am: archiver requires 'AM_PROG_AR' in 'configure.ac' Makefile.am:35: while processing Libtool library 'python/_volume_key.la' Makefile.am: installing 'admin/depcomp' parallel-tests: installing 'admin/test-driver' + ./configure 'LDFLAGS=-Wl,--as-needed -Wl,--no-copy-dt-needed-entries -Wl,-z,relro -Wl,-z,combreloc ' 'CFLAGS=-O2 -fwrapv -pipe -Wformat -Werror=format-security -gdwarf-4 -fno-debug-types-section -fvar-tracking-assignments -g2 -Wp,-D_FORTIFY_SOURCE=2 -fstack-protector-strong --param=ssp-buffer-size=4 -fPIC -mtune=generic -march=x86-64 -gdwarf-4 -fno-debug-types-section -fvar-tracking-assignments -g2 ' 'CXXFLAGS=-O2 -fwrapv -pipe -Wformat -Werror=format-security -gdwarf-4 -fno-debug-types-section -fvar-tracking-assignments -g2 -Wp,-D_FORTIFY_SOURCE=2 -fstack-protector-strong --param=ssp-buffer-size=4 -fPIC -mtune=generic -march=x86-64 -gdwarf-4 -fno-debug-types-section -fvar-tracking-assignments -g2 ' 'FFLAGS=-O2 -fwrapv -pipe -Wformat -Werror=format-security -gdwarf-4 -fno-debug-types-section -fvar-tracking-assignments -g2 -Wp,-D_FORTIFY_SOURCE=2 -fstack-protector-strong --param=ssp-buffer-size=4 -fPIC -mtune=generic -march=x86-64 -gdwarf-4 -fno-debug-types-section -fvar-tracking-assignments -g2 ' 'FCFLAGS=-O2 -fwrapv -pipe -Wformat -Werror=format-security -gdwarf-4 -fno-debug-types-section -fvar-tracking-assignments -g2 -Wp,-D_FORTIFY_SOURCE=2 -fstack-protector-strong --param=ssp-buffer-size=4 -fPIC -mtune=generic -march=x86-64 -gdwarf-4 -fno-debug-types-section -fvar-tracking-assignments -g2 ' 'CPPFLAGS=' 'CC=x86_64-pld-linux-gnux32-gcc' 'CXX=x86_64-pld-linux-gnux32-g++' '--host=x86_64-pld-linux-gnux32' '--build=x86_64-pld-linux-gnux32' '--prefix=/usr' '--exec-prefix=/usr' '--bindir=/usr/bin' '--sbindir=/usr/sbin' '--sysconfdir=/etc' '--datadir=/usr/share' '--includedir=/usr/include' '--libdir=/usr/libx32' '--libexecdir=/usr/libexec' '--localstatedir=/var' '--sharedstatedir=/var/lib' '--mandir=/usr/share/man' '--infodir=/usr/share/info' '--x-libraries=/usr/libx32' checking for a BSD-compatible install... /usr/bin/install -c checking whether build environment is sane... yes checking for a thread-safe mkdir -p... /bin/mkdir -p checking for mawk... mawk checking whether make sets $(MAKE)... yes checking whether make supports nested variables... yes checking for x86_64-pld-linux-gnux32-gcc... x86_64-pld-linux-gnux32-gcc checking whether the C compiler works... yes checking for C compiler default output file name... a.out checking for suffix of executables... checking whether we are cross compiling... no checking for suffix of object files... o checking whether we are using the GNU C compiler... yes checking whether x86_64-pld-linux-gnux32-gcc accepts -g... yes checking for x86_64-pld-linux-gnux32-gcc option to accept ISO C89... none needed checking whether x86_64-pld-linux-gnux32-gcc understands -c and -o together... yes checking whether make supports the include directive... yes (GNU style) checking dependency style of x86_64-pld-linux-gnux32-gcc... gcc3 checking build system type... x86_64-pld-linux-gnux32 checking host system type... x86_64-pld-linux-gnux32 checking how to print strings... print -r checking for a sed that does not truncate output... /bin/sed checking for grep that handles long lines and -e... /bin/grep checking for egrep... /bin/grep -E checking for fgrep... /bin/grep -F checking for ld used by x86_64-pld-linux-gnux32-gcc... /usr/bin/ld checking if the linker (/usr/bin/ld) is GNU ld... yes checking for BSD- or MS-compatible name lister (nm)... /usr/bin/nm -B checking the name lister (/usr/bin/nm -B) interface... BSD nm checking whether ln -s works... yes checking the maximum length of command line arguments... 1572864 checking how to convert x86_64-pld-linux-gnux32 file names to x86_64-pld-linux-gnux32 format... func_convert_file_noop checking how to convert x86_64-pld-linux-gnux32 file names to toolchain format... func_convert_file_noop checking for /usr/bin/ld option to reload object files... -r checking for x86_64-pld-linux-gnux32-objdump... no checking for objdump... objdump checking how to recognize dependent libraries... pass_all checking for x86_64-pld-linux-gnux32-dlltool... no checking for dlltool... no checking how to associate runtime and link libraries... print -r -- checking for x86_64-pld-linux-gnux32-ar... no checking for ar... ar checking for archiver @FILE support... @ checking for x86_64-pld-linux-gnux32-strip... no checking for strip... strip checking for x86_64-pld-linux-gnux32-ranlib... no checking for ranlib... ranlib checking command to parse /usr/bin/nm -B output from x86_64-pld-linux-gnux32-gcc object... ok checking for sysroot... no checking for a working dd... /bin/dd checking how to truncate binary pipes... /bin/dd bs=4096 count=1 checking for x86_64-pld-linux-gnux32-mt... no checking for mt... no checking if : is a manifest tool... no checking how to run the C preprocessor... x86_64-pld-linux-gnux32-gcc -E checking for ANSI C header files... yes checking for sys/types.h... yes checking for sys/stat.h... yes checking for stdlib.h... yes checking for string.h... yes checking for memory.h... yes checking for strings.h... yes checking for inttypes.h... yes checking for stdint.h... yes checking for unistd.h... yes checking for dlfcn.h... yes checking for objdir... .libs checking if x86_64-pld-linux-gnux32-gcc supports -fno-rtti -fno-exceptions... no checking for x86_64-pld-linux-gnux32-gcc option to produce PIC... -fPIC -DPIC checking if x86_64-pld-linux-gnux32-gcc PIC flag -fPIC -DPIC works... yes checking if x86_64-pld-linux-gnux32-gcc static flag -static works... yes checking if x86_64-pld-linux-gnux32-gcc supports -c -o file.o... yes checking if x86_64-pld-linux-gnux32-gcc supports -c -o file.o... (cached) yes checking whether the x86_64-pld-linux-gnux32-gcc linker (/usr/bin/ld -m elf32_x86_64) supports shared libraries... yes checking whether -lc should be explicitly linked in... no checking dynamic linker characteristics... GNU/Linux ld.so checking how to hardcode library paths into programs... immediate checking whether stripping libraries is possible... yes checking if libtool supports shared libraries... yes checking whether to build shared libraries... yes checking whether to build static libraries... no checking for python... /usr/bin/python checking for python version... 2.7 checking for python platform... linux2 checking for python script directory... ${prefix}/share/python2.7/site-packages checking for python extension module directory... ${exec_prefix}/libx32/python2.7/site-packages checking for gpg... /usr/bin/gpg checking for x86_64-pld-linux-gnux32-pkg-config... /usr/bin/x86_64-pld-linux-gnux32-pkg-config checking pkg-config is at least version 0.9.0... yes checking for blkid... yes checking for glib-2.0... yes checking for libcryptsetup... yes checking for nss... yes checking for gpgme-config... /usr/bin/gpgme-config checking for GPGME - version >= 0.4.2... yes checking whether NLS is requested... yes checking for msgfmt... /usr/bin/msgfmt checking for gmsgfmt... /usr/bin/msgfmt checking for xgettext... /usr/bin/xgettext checking for msgmerge... /usr/bin/msgmerge checking for ld used by GCC... /usr/bin/ld -m elf32_x86_64 checking if the linker (/usr/bin/ld -m elf32_x86_64) is GNU ld... yes checking for shared library run path origin... done checking for CFPreferencesCopyAppValue... no checking for CFLocaleCopyCurrent... no checking for GNU gettext in libc... yes checking whether to use NLS... yes checking where the gettext function comes from... libc checking for special C compiler options needed for large files... no checking for _FILE_OFFSET_BITS value needed for large files... no checking for available GCC warning flags... -Wall -W -Wcast-align -Wmissing-noreturn -Wnested-externs -Wpointer-arith -Wshadow -Wundef -Wwrite-strings checking whether we should use -Werror... no checking that generated files are newer than configure... done configure: creating ./config.status config.status: creating Makefile config.status: creating po/Makefile.in config.status: creating config.h config.status: executing depfiles commands config.status: executing libtool commands config.status: executing po-directories commands config.status: creating po/POTFILES config.status: creating po/Makefile + /usr/bin/make -Otarget -j9 /usr/bin/make all-recursive Making all in po make[2]: Entering directory '/tmp/B.Ut0b2H/BUILD/volume_key-0.3.9' /bin/sh ./libtool --tag=CC --mode=compile x86_64-pld-linux-gnux32-gcc -DHAVE_CONFIG_H -I. -I/usr/include/blkid -I/usr/include/uuid -I/usr/include/glib-2.0 -I/usr/libx32/glib-2.0/include -I/usr/include/nss -I/usr/include/nspr -DLOCALEDIR='"/usr/share/locale"' -O2 -fwrapv -pipe -Wformat -Werror=format-security -gdwarf-4 -fno-debug-types-section -fvar-tracking-assignments -g2 -Wp,-D_FORTIFY_SOURCE=2 -fstack-protector-strong --param=ssp-buffer-size=4 -fPIC -mtune=generic -march=x86-64 -gdwarf-4 -fno-debug-types-section -fvar-tracking-assignments -g2 -Wall -W -Wcast-align -Wmissing-noreturn -Wnested-externs -Wpointer-arith -Wshadow -Wundef -Wwrite-strings -MT lib/libvolume_key_la-nss_error.lo -MD -MP -MF lib/.deps/libvolume_key_la-nss_error.Tpo -c -o lib/libvolume_key_la-nss_error.lo `test -f 'lib/nss_error.c' || echo './'`lib/nss_error.c libtool: compile: x86_64-pld-linux-gnux32-gcc -DHAVE_CONFIG_H -I. -I/usr/include/blkid -I/usr/include/uuid -I/usr/include/glib-2.0 -I/usr/libx32/glib-2.0/include -I/usr/include/nss -I/usr/include/nspr -DLOCALEDIR=\"/usr/share/locale\" -O2 -fwrapv -pipe -Wformat -Werror=format-security -gdwarf-4 -fno-debug-types-section -fvar-tracking-assignments -g2 -Wp,-D_FORTIFY_SOURCE=2 -fstack-protector-strong --param=ssp-buffer-size=4 -fPIC -mtune=generic -march=x86-64 -gdwarf-4 -fno-debug-types-section -fvar-tracking-assignments -g2 -Wall -W -Wcast-align -Wmissing-noreturn -Wnested-externs -Wpointer-arith -Wshadow -Wundef -Wwrite-strings -MT lib/libvolume_key_la-nss_error.lo -MD -MP -MF lib/.deps/libvolume_key_la-nss_error.Tpo -c lib/nss_error.c -fPIC -DPIC -o lib/.libs/libvolume_key_la-nss_error.o mv -f lib/.deps/libvolume_key_la-nss_error.Tpo lib/.deps/libvolume_key_la-nss_error.Plo make[2]: Leaving directory '/tmp/B.Ut0b2H/BUILD/volume_key-0.3.9' make[2]: Entering directory '/tmp/B.Ut0b2H/BUILD/volume_key-0.3.9' /bin/sh ./libtool --tag=CC --mode=compile x86_64-pld-linux-gnux32-gcc -DHAVE_CONFIG_H -I. -I/usr/include/blkid -I/usr/include/uuid -I/usr/include/glib-2.0 -I/usr/libx32/glib-2.0/include -I/usr/include/nss -I/usr/include/nspr -DLOCALEDIR='"/usr/share/locale"' -O2 -fwrapv -pipe -Wformat -Werror=format-security -gdwarf-4 -fno-debug-types-section -fvar-tracking-assignments -g2 -Wp,-D_FORTIFY_SOURCE=2 -fstack-protector-strong --param=ssp-buffer-size=4 -fPIC -mtune=generic -march=x86-64 -gdwarf-4 -fno-debug-types-section -fvar-tracking-assignments -g2 -Wall -W -Wcast-align -Wmissing-noreturn -Wnested-externs -Wpointer-arith -Wshadow -Wundef -Wwrite-strings -MT lib/libvolume_key_la-ui.lo -MD -MP -MF lib/.deps/libvolume_key_la-ui.Tpo -c -o lib/libvolume_key_la-ui.lo `test -f 'lib/ui.c' || echo './'`lib/ui.c libtool: compile: x86_64-pld-linux-gnux32-gcc -DHAVE_CONFIG_H -I. -I/usr/include/blkid -I/usr/include/uuid -I/usr/include/glib-2.0 -I/usr/libx32/glib-2.0/include -I/usr/include/nss -I/usr/include/nspr -DLOCALEDIR=\"/usr/share/locale\" -O2 -fwrapv -pipe -Wformat -Werror=format-security -gdwarf-4 -fno-debug-types-section -fvar-tracking-assignments -g2 -Wp,-D_FORTIFY_SOURCE=2 -fstack-protector-strong --param=ssp-buffer-size=4 -fPIC -mtune=generic -march=x86-64 -gdwarf-4 -fno-debug-types-section -fvar-tracking-assignments -g2 -Wall -W -Wcast-align -Wmissing-noreturn -Wnested-externs -Wpointer-arith -Wshadow -Wundef -Wwrite-strings -MT lib/libvolume_key_la-ui.lo -MD -MP -MF lib/.deps/libvolume_key_la-ui.Tpo -c lib/ui.c -fPIC -DPIC -o lib/.libs/libvolume_key_la-ui.o mv -f lib/.deps/libvolume_key_la-ui.Tpo lib/.deps/libvolume_key_la-ui.Plo make[2]: Leaving directory '/tmp/B.Ut0b2H/BUILD/volume_key-0.3.9' make[2]: Entering directory '/tmp/B.Ut0b2H/BUILD/volume_key-0.3.9' /bin/sh ./libtool --tag=CC --mode=compile x86_64-pld-linux-gnux32-gcc -DHAVE_CONFIG_H -I. -I/usr/include/blkid -I/usr/include/uuid -I/usr/include/glib-2.0 -I/usr/libx32/glib-2.0/include -I/usr/include/nss -I/usr/include/nspr -DLOCALEDIR='"/usr/share/locale"' -O2 -fwrapv -pipe -Wformat -Werror=format-security -gdwarf-4 -fno-debug-types-section -fvar-tracking-assignments -g2 -Wp,-D_FORTIFY_SOURCE=2 -fstack-protector-strong --param=ssp-buffer-size=4 -fPIC -mtune=generic -march=x86-64 -gdwarf-4 -fno-debug-types-section -fvar-tracking-assignments -g2 -Wall -W -Wcast-align -Wmissing-noreturn -Wnested-externs -Wpointer-arith -Wshadow -Wundef -Wwrite-strings -MT lib/libvolume_key_la-crypto.lo -MD -MP -MF lib/.deps/libvolume_key_la-crypto.Tpo -c -o lib/libvolume_key_la-crypto.lo `test -f 'lib/crypto.c' || echo './'`lib/crypto.c libtool: compile: x86_64-pld-linux-gnux32-gcc -DHAVE_CONFIG_H -I. -I/usr/include/blkid -I/usr/include/uuid -I/usr/include/glib-2.0 -I/usr/libx32/glib-2.0/include -I/usr/include/nss -I/usr/include/nspr -DLOCALEDIR=\"/usr/share/locale\" -O2 -fwrapv -pipe -Wformat -Werror=format-security -gdwarf-4 -fno-debug-types-section -fvar-tracking-assignments -g2 -Wp,-D_FORTIFY_SOURCE=2 -fstack-protector-strong --param=ssp-buffer-size=4 -fPIC -mtune=generic -march=x86-64 -gdwarf-4 -fno-debug-types-section -fvar-tracking-assignments -g2 -Wall -W -Wcast-align -Wmissing-noreturn -Wnested-externs -Wpointer-arith -Wshadow -Wundef -Wwrite-strings -MT lib/libvolume_key_la-crypto.lo -MD -MP -MF lib/.deps/libvolume_key_la-crypto.Tpo -c lib/crypto.c -fPIC -DPIC -o lib/.libs/libvolume_key_la-crypto.o mv -f lib/.deps/libvolume_key_la-crypto.Tpo lib/.deps/libvolume_key_la-crypto.Plo make[2]: Leaving directory '/tmp/B.Ut0b2H/BUILD/volume_key-0.3.9' make[2]: Entering directory '/tmp/B.Ut0b2H/BUILD/volume_key-0.3.9' /bin/sh ./libtool --tag=CC --mode=compile x86_64-pld-linux-gnux32-gcc -DHAVE_CONFIG_H -I. -I/usr/include/blkid -I/usr/include/uuid -I/usr/include/glib-2.0 -I/usr/libx32/glib-2.0/include -I/usr/include/nss -I/usr/include/nspr -DLOCALEDIR='"/usr/share/locale"' -O2 -fwrapv -pipe -Wformat -Werror=format-security -gdwarf-4 -fno-debug-types-section -fvar-tracking-assignments -g2 -Wp,-D_FORTIFY_SOURCE=2 -fstack-protector-strong --param=ssp-buffer-size=4 -fPIC -mtune=generic -march=x86-64 -gdwarf-4 -fno-debug-types-section -fvar-tracking-assignments -g2 -Wall -W -Wcast-align -Wmissing-noreturn -Wnested-externs -Wpointer-arith -Wshadow -Wundef -Wwrite-strings -MT lib/libvolume_key_la-libvolume_key.lo -MD -MP -MF lib/.deps/libvolume_key_la-libvolume_key.Tpo -c -o lib/libvolume_key_la-libvolume_key.lo `test -f 'lib/libvolume_key.c' || echo './'`lib/libvolume_key.c libtool: compile: x86_64-pld-linux-gnux32-gcc -DHAVE_CONFIG_H -I. -I/usr/include/blkid -I/usr/include/uuid -I/usr/include/glib-2.0 -I/usr/libx32/glib-2.0/include -I/usr/include/nss -I/usr/include/nspr -DLOCALEDIR=\"/usr/share/locale\" -O2 -fwrapv -pipe -Wformat -Werror=format-security -gdwarf-4 -fno-debug-types-section -fvar-tracking-assignments -g2 -Wp,-D_FORTIFY_SOURCE=2 -fstack-protector-strong --param=ssp-buffer-size=4 -fPIC -mtune=generic -march=x86-64 -gdwarf-4 -fno-debug-types-section -fvar-tracking-assignments -g2 -Wall -W -Wcast-align -Wmissing-noreturn -Wnested-externs -Wpointer-arith -Wshadow -Wundef -Wwrite-strings -MT lib/libvolume_key_la-libvolume_key.lo -MD -MP -MF lib/.deps/libvolume_key_la-libvolume_key.Tpo -c lib/libvolume_key.c -fPIC -DPIC -o lib/.libs/libvolume_key_la-libvolume_key.o mv -f lib/.deps/libvolume_key_la-libvolume_key.Tpo lib/.deps/libvolume_key_la-libvolume_key.Plo make[2]: Leaving directory '/tmp/B.Ut0b2H/BUILD/volume_key-0.3.9' make[2]: Entering directory '/tmp/B.Ut0b2H/BUILD/volume_key-0.3.9' x86_64-pld-linux-gnux32-gcc -DHAVE_CONFIG_H -I. -I/usr/include/blkid -I/usr/include/uuid -I/usr/include/glib-2.0 -I/usr/libx32/glib-2.0/include -I/usr/include/nss -I/usr/include/nspr -DLOCALEDIR='"/usr/share/locale"' -O2 -fwrapv -pipe -Wformat -Werror=format-security -gdwarf-4 -fno-debug-types-section -fvar-tracking-assignments -g2 -Wp,-D_FORTIFY_SOURCE=2 -fstack-protector-strong --param=ssp-buffer-size=4 -fPIC -mtune=generic -march=x86-64 -gdwarf-4 -fno-debug-types-section -fvar-tracking-assignments -g2 -Wall -W -Wcast-align -Wmissing-noreturn -Wnested-externs -Wpointer-arith -Wshadow -Wundef -Wwrite-strings -MT src/volume_key-volume_key.o -MD -MP -MF src/.deps/volume_key-volume_key.Tpo -c -o src/volume_key-volume_key.o `test -f 'src/volume_key.c' || echo './'`src/volume_key.c mv -f src/.deps/volume_key-volume_key.Tpo src/.deps/volume_key-volume_key.Po make[2]: Leaving directory '/tmp/B.Ut0b2H/BUILD/volume_key-0.3.9' make[2]: Entering directory '/tmp/B.Ut0b2H/BUILD/volume_key-0.3.9' /bin/sh ./libtool --tag=CC --mode=compile x86_64-pld-linux-gnux32-gcc -DHAVE_CONFIG_H -I. -I/usr/include/blkid -I/usr/include/uuid -I/usr/include/glib-2.0 -I/usr/libx32/glib-2.0/include -I/usr/include/nss -I/usr/include/nspr -DLOCALEDIR='"/usr/share/locale"' -O2 -fwrapv -pipe -Wformat -Werror=format-security -gdwarf-4 -fno-debug-types-section -fvar-tracking-assignments -g2 -Wp,-D_FORTIFY_SOURCE=2 -fstack-protector-strong --param=ssp-buffer-size=4 -fPIC -mtune=generic -march=x86-64 -gdwarf-4 -fno-debug-types-section -fvar-tracking-assignments -g2 -Wall -W -Wcast-align -Wmissing-noreturn -Wnested-externs -Wpointer-arith -Wshadow -Wundef -Wwrite-strings -MT lib/libvolume_key_la-volume.lo -MD -MP -MF lib/.deps/libvolume_key_la-volume.Tpo -c -o lib/libvolume_key_la-volume.lo `test -f 'lib/volume.c' || echo './'`lib/volume.c libtool: compile: x86_64-pld-linux-gnux32-gcc -DHAVE_CONFIG_H -I. -I/usr/include/blkid -I/usr/include/uuid -I/usr/include/glib-2.0 -I/usr/libx32/glib-2.0/include -I/usr/include/nss -I/usr/include/nspr -DLOCALEDIR=\"/usr/share/locale\" -O2 -fwrapv -pipe -Wformat -Werror=format-security -gdwarf-4 -fno-debug-types-section -fvar-tracking-assignments -g2 -Wp,-D_FORTIFY_SOURCE=2 -fstack-protector-strong --param=ssp-buffer-size=4 -fPIC -mtune=generic -march=x86-64 -gdwarf-4 -fno-debug-types-section -fvar-tracking-assignments -g2 -Wall -W -Wcast-align -Wmissing-noreturn -Wnested-externs -Wpointer-arith -Wshadow -Wundef -Wwrite-strings -MT lib/libvolume_key_la-volume.lo -MD -MP -MF lib/.deps/libvolume_key_la-volume.Tpo -c lib/volume.c -fPIC -DPIC -o lib/.libs/libvolume_key_la-volume.o mv -f lib/.deps/libvolume_key_la-volume.Tpo lib/.deps/libvolume_key_la-volume.Plo make[2]: Leaving directory '/tmp/B.Ut0b2H/BUILD/volume_key-0.3.9' make[2]: Entering directory '/tmp/B.Ut0b2H/BUILD/volume_key-0.3.9' /bin/sh ./libtool --tag=CC --mode=compile x86_64-pld-linux-gnux32-gcc -DHAVE_CONFIG_H -I. -I/usr/include/blkid -I/usr/include/uuid -I/usr/include/glib-2.0 -I/usr/libx32/glib-2.0/include -I/usr/include/nss -I/usr/include/nspr -DLOCALEDIR='"/usr/share/locale"' -O2 -fwrapv -pipe -Wformat -Werror=format-security -gdwarf-4 -fno-debug-types-section -fvar-tracking-assignments -g2 -Wp,-D_FORTIFY_SOURCE=2 -fstack-protector-strong --param=ssp-buffer-size=4 -fPIC -mtune=generic -march=x86-64 -gdwarf-4 -fno-debug-types-section -fvar-tracking-assignments -g2 -Wall -W -Wcast-align -Wmissing-noreturn -Wnested-externs -Wpointer-arith -Wshadow -Wundef -Wwrite-strings -MT lib/libvolume_key_la-volume_luks.lo -MD -MP -MF lib/.deps/libvolume_key_la-volume_luks.Tpo -c -o lib/libvolume_key_la-volume_luks.lo `test -f 'lib/volume_luks.c' || echo './'`lib/volume_luks.c libtool: compile: x86_64-pld-linux-gnux32-gcc -DHAVE_CONFIG_H -I. -I/usr/include/blkid -I/usr/include/uuid -I/usr/include/glib-2.0 -I/usr/libx32/glib-2.0/include -I/usr/include/nss -I/usr/include/nspr -DLOCALEDIR=\"/usr/share/locale\" -O2 -fwrapv -pipe -Wformat -Werror=format-security -gdwarf-4 -fno-debug-types-section -fvar-tracking-assignments -g2 -Wp,-D_FORTIFY_SOURCE=2 -fstack-protector-strong --param=ssp-buffer-size=4 -fPIC -mtune=generic -march=x86-64 -gdwarf-4 -fno-debug-types-section -fvar-tracking-assignments -g2 -Wall -W -Wcast-align -Wmissing-noreturn -Wnested-externs -Wpointer-arith -Wshadow -Wundef -Wwrite-strings -MT lib/libvolume_key_la-volume_luks.lo -MD -MP -MF lib/.deps/libvolume_key_la-volume_luks.Tpo -c lib/volume_luks.c -fPIC -DPIC -o lib/.libs/libvolume_key_la-volume_luks.o lib/volume_luks.c: In function 'error_from_cryptsetup': lib/volume_luks.c:72:3: warning: implicit declaration of function 'crypt_get_error'; did you mean 'crypt_get_dir'? [-Wimplicit-function-declaration] crypt_get_error (crypt_msg, sizeof (crypt_msg)); ^~~~~~~~~~~~~~~ crypt_get_dir lib/volume_luks.c:72:3: warning: nested extern declaration of 'crypt_get_error' [-Wnested-externs] mv -f lib/.deps/libvolume_key_la-volume_luks.Tpo lib/.deps/libvolume_key_la-volume_luks.Plo make[2]: Leaving directory '/tmp/B.Ut0b2H/BUILD/volume_key-0.3.9' make[2]: Entering directory '/tmp/B.Ut0b2H/BUILD/volume_key-0.3.9' /bin/sh ./libtool --tag=CC --mode=compile x86_64-pld-linux-gnux32-gcc -DHAVE_CONFIG_H -I. -I/usr/include/blkid -I/usr/include/uuid -I/usr/include/glib-2.0 -I/usr/libx32/glib-2.0/include -I/usr/include/nss -I/usr/include/nspr -DLOCALEDIR='"/usr/share/locale"' -O2 -fwrapv -pipe -Wformat -Werror=format-security -gdwarf-4 -fno-debug-types-section -fvar-tracking-assignments -g2 -Wp,-D_FORTIFY_SOURCE=2 -fstack-protector-strong --param=ssp-buffer-size=4 -fPIC -mtune=generic -march=x86-64 -gdwarf-4 -fno-debug-types-section -fvar-tracking-assignments -g2 -Wall -W -Wcast-align -Wmissing-noreturn -Wnested-externs -Wpointer-arith -Wshadow -Wundef -Wwrite-strings -MT lib/libvolume_key_la-kmip.lo -MD -MP -MF lib/.deps/libvolume_key_la-kmip.Tpo -c -o lib/libvolume_key_la-kmip.lo `test -f 'lib/kmip.c' || echo './'`lib/kmip.c libtool: compile: x86_64-pld-linux-gnux32-gcc -DHAVE_CONFIG_H -I. -I/usr/include/blkid -I/usr/include/uuid -I/usr/include/glib-2.0 -I/usr/libx32/glib-2.0/include -I/usr/include/nss -I/usr/include/nspr -DLOCALEDIR=\"/usr/share/locale\" -O2 -fwrapv -pipe -Wformat -Werror=format-security -gdwarf-4 -fno-debug-types-section -fvar-tracking-assignments -g2 -Wp,-D_FORTIFY_SOURCE=2 -fstack-protector-strong --param=ssp-buffer-size=4 -fPIC -mtune=generic -march=x86-64 -gdwarf-4 -fno-debug-types-section -fvar-tracking-assignments -g2 -Wall -W -Wcast-align -Wmissing-noreturn -Wnested-externs -Wpointer-arith -Wshadow -Wundef -Wwrite-strings -MT lib/libvolume_key_la-kmip.lo -MD -MP -MF lib/.deps/libvolume_key_la-kmip.Tpo -c lib/kmip.c -fPIC -DPIC -o lib/.libs/libvolume_key_la-kmip.o mv -f lib/.deps/libvolume_key_la-kmip.Tpo lib/.deps/libvolume_key_la-kmip.Plo make[2]: Leaving directory '/tmp/B.Ut0b2H/BUILD/volume_key-0.3.9' make[2]: Entering directory '/tmp/B.Ut0b2H/BUILD/volume_key-0.3.9' /bin/sh ./libtool --tag=CC --mode=compile x86_64-pld-linux-gnux32-gcc -DHAVE_CONFIG_H -I. -I/usr/include/blkid -I/usr/include/uuid -I/usr/include/glib-2.0 -I/usr/libx32/glib-2.0/include -I/usr/include/nss -I/usr/include/nspr -I/usr/include/python2.7 -O2 -fwrapv -pipe -Wformat -Werror=format-security -gdwarf-4 -fno-debug-types-section -fvar-tracking-assignments -g2 -Wp,-D_FORTIFY_SOURCE=2 -fstack-protector-strong --param=ssp-buffer-size=4 -fPIC -mtune=generic -march=x86-64 -gdwarf-4 -fno-debug-types-section -fvar-tracking-assignments -g2 -Wall -W -Wcast-align -Wmissing-noreturn -Wnested-externs -Wpointer-arith -Wshadow -Wundef -Wwrite-strings -MT python/_volume_key_la-volume_key_wrap.lo -MD -MP -MF python/.deps/_volume_key_la-volume_key_wrap.Tpo -c -o python/_volume_key_la-volume_key_wrap.lo `test -f 'python/volume_key_wrap.c' || echo './'`python/volume_key_wrap.c libtool: compile: x86_64-pld-linux-gnux32-gcc -DHAVE_CONFIG_H -I. -I/usr/include/blkid -I/usr/include/uuid -I/usr/include/glib-2.0 -I/usr/libx32/glib-2.0/include -I/usr/include/nss -I/usr/include/nspr -I/usr/include/python2.7 -O2 -fwrapv -pipe -Wformat -Werror=format-security -gdwarf-4 -fno-debug-types-section -fvar-tracking-assignments -g2 -Wp,-D_FORTIFY_SOURCE=2 -fstack-protector-strong --param=ssp-buffer-size=4 -fPIC -mtune=generic -march=x86-64 -gdwarf-4 -fno-debug-types-section -fvar-tracking-assignments -g2 -Wall -W -Wcast-align -Wmissing-noreturn -Wnested-externs -Wpointer-arith -Wshadow -Wundef -Wwrite-strings -MT python/_volume_key_la-volume_key_wrap.lo -MD -MP -MF python/.deps/_volume_key_la-volume_key_wrap.Tpo -c python/volume_key_wrap.c -fPIC -DPIC -o python/.libs/_volume_key_la-volume_key_wrap.o python/volume_key_wrap.c: In function 'SWIG_PyInstanceMethod_New': python/volume_key_wrap.c:1049:59: warning: unused parameter 'self' [-Wunused-parameter] SWIGRUNTIME PyObject* SWIG_PyInstanceMethod_New(PyObject *self, PyObject *func) ^~~~ python/volume_key_wrap.c:1049:75: warning: unused parameter 'func' [-Wunused-parameter] SWIGRUNTIME PyObject* SWIG_PyInstanceMethod_New(PyObject *self, PyObject *func) ^~~~ python/volume_key_wrap.c: In function '_PySwigObject_type': python/volume_key_wrap.c:1829:7: warning: missing initializer for field 'tp_version_tag' of 'PyTypeObject {aka const struct _typeobject}' [-Wmissing-field-initializers] }; ^ In file included from /usr/include/python2.7/Python.h:83:0, from python/volume_key_wrap.c:125: /usr/include/python2.7/object.h:401:18: note: 'tp_version_tag' declared here unsigned int tp_version_tag; ^~~~~~~~~~~~~~ python/volume_key_wrap.c: In function '_PySwigPacked_type': python/volume_key_wrap.c:2004:7: warning: missing initializer for field 'tp_version_tag' of 'PyTypeObject {aka const struct _typeobject}' [-Wmissing-field-initializers] }; ^ In file included from /usr/include/python2.7/Python.h:83:0, from python/volume_key_wrap.c:125: /usr/include/python2.7/object.h:401:18: note: 'tp_version_tag' declared here unsigned int tp_version_tag; ^~~~~~~~~~~~~~ python/volume_key_wrap.c: In function 'SWIG_Python_NewShadowInstance': python/volume_key_wrap.c:2287:65: warning: declaration of 'swig_this' shadows a global declaration [-Wshadow] SWIG_Python_NewShadowInstance(SwigPyClientData *data, PyObject *swig_this) ^~~~~~~~~ python/volume_key_wrap.c:2057:18: note: shadowed declaration is here static PyObject *swig_this = NULL; ^~~~~~~~~ python/volume_key_wrap.c: In function 'SWIG_Python_SetSwigThis': python/volume_key_wrap.c:2356:51: warning: declaration of 'swig_this' shadows a global declaration [-Wshadow] SWIG_Python_SetSwigThis(PyObject *inst, PyObject *swig_this) ^~~~~~~~~ python/volume_key_wrap.c:2057:18: note: shadowed declaration is here static PyObject *swig_this = NULL; ^~~~~~~~~ python/volume_key_wrap.c: In function 'SWIG_Python_MustGetPtr': python/volume_key_wrap.c:2666:63: warning: unused parameter 'argnum' [-Wunused-parameter] SWIG_Python_MustGetPtr(PyObject *obj, swig_type_info *ty, int argnum, int flags) { ^~~~~~ python/volume_key_wrap.c: In function 'swig_varlink_type': python/volume_key_wrap.c:5472:7: warning: missing initializer for field 'tp_version_tag' of 'PyTypeObject {aka const struct _typeobject}' [-Wmissing-field-initializers] }; ^ In file included from /usr/include/python2.7/Python.h:83:0, from python/volume_key_wrap.c:125: /usr/include/python2.7/object.h:401:18: note: 'tp_version_tag' declared here unsigned int tp_version_tag; ^~~~~~~~~~~~~~ mv -f python/.deps/_volume_key_la-volume_key_wrap.Tpo python/.deps/_volume_key_la-volume_key_wrap.Plo make[2]: Leaving directory '/tmp/B.Ut0b2H/BUILD/volume_key-0.3.9' make[2]: Entering directory '/tmp/B.Ut0b2H/BUILD/volume_key-0.3.9' /bin/sh ./libtool --tag=CC --mode=link x86_64-pld-linux-gnux32-gcc -O2 -fwrapv -pipe -Wformat -Werror=format-security -gdwarf-4 -fno-debug-types-section -fvar-tracking-assignments -g2 -Wp,-D_FORTIFY_SOURCE=2 -fstack-protector-strong --param=ssp-buffer-size=4 -fPIC -mtune=generic -march=x86-64 -gdwarf-4 -fno-debug-types-section -fvar-tracking-assignments -g2 -Wall -W -Wcast-align -Wmissing-noreturn -Wnested-externs -Wpointer-arith -Wshadow -Wundef -Wwrite-strings -version-info 3:2:2 -Wl,--as-needed -Wl,--no-copy-dt-needed-entries -Wl,-z,relro -Wl,-z,combreloc -o lib/libvolume_key.la -rpath /usr/libx32 lib/libvolume_key_la-crypto.lo lib/libvolume_key_la-kmip.lo lib/libvolume_key_la-libvolume_key.lo lib/libvolume_key_la-nss_error.lo lib/libvolume_key_la-ui.lo lib/libvolume_key_la-volume.lo lib/libvolume_key_la-volume_luks.lo -lblkid -lglib-2.0 -L/usr/libx32 -lgpgme -lassuan -lgpg-error -lcryptsetup -lnss3 -lnssutil3 -lsmime3 -lssl3 -lsoftokn3 -lplds4 -lplc4 -lnspr4 libtool: link: x86_64-pld-linux-gnux32-gcc -shared -fPIC -DPIC -O2 -gdwarf-4 -g2 -fstack-protector-strong -mtune=generic -march=x86-64 -gdwarf-4 -g2 -Wl,--as-needed -Wl,--no-copy-dt-needed-entries -Wl,-z -Wl,relro -Wl,-z -Wl,combreloc lib/.libs/libvolume_key_la-crypto.o lib/.libs/libvolume_key_la-kmip.o lib/.libs/libvolume_key_la-libvolume_key.o lib/.libs/libvolume_key_la-nss_error.o lib/.libs/libvolume_key_la-ui.o lib/.libs/libvolume_key_la-volume.o lib/.libs/libvolume_key_la-volume_luks.o -lblkid /usr/libx32/libglib-2.0.so -L/usr/libx32 /usr/libx32/libpcre.so -lpthread /usr/libx32/libgpgme.so /usr/libx32/libassuan.so /usr/libx32/libcryptsetup.so /usr/libx32/libuuid.so -ldevmapper /usr/libx32/libgcrypt.so /usr/libx32/libgpg-error.so -largon2 -lrt -ldl -ljson-c -lnss3 -lnssutil3 -lsmime3 -lssl3 -lsoftokn3 -lplds4 -lplc4 -lnspr4 -Wl,-soname -Wl,libvolume_key.so.1 -o lib/.libs/libvolume_key.so.1.2.2 libtool: link: (cd "lib/.libs" && rm -f "libvolume_key.so.1" && ln -s "libvolume_key.so.1.2.2" "libvolume_key.so.1") libtool: link: (cd "lib/.libs" && rm -f "libvolume_key.so" && ln -s "libvolume_key.so.1.2.2" "libvolume_key.so") libtool: link: ( cd "lib/.libs" && rm -f "libvolume_key.la" && ln -s "../libvolume_key.la" "libvolume_key.la" ) make[2]: Leaving directory '/tmp/B.Ut0b2H/BUILD/volume_key-0.3.9' make[2]: Entering directory '/tmp/B.Ut0b2H/BUILD/volume_key-0.3.9' /bin/sh ./libtool --tag=CC --mode=link x86_64-pld-linux-gnux32-gcc -O2 -fwrapv -pipe -Wformat -Werror=format-security -gdwarf-4 -fno-debug-types-section -fvar-tracking-assignments -g2 -Wp,-D_FORTIFY_SOURCE=2 -fstack-protector-strong --param=ssp-buffer-size=4 -fPIC -mtune=generic -march=x86-64 -gdwarf-4 -fno-debug-types-section -fvar-tracking-assignments -g2 -Wall -W -Wcast-align -Wmissing-noreturn -Wnested-externs -Wpointer-arith -Wshadow -Wundef -Wwrite-strings -Wl,--as-needed -Wl,--no-copy-dt-needed-entries -Wl,-z,relro -Wl,-z,combreloc -o src/volume_key src/volume_key-volume_key.o lib/libvolume_key.la -lglib-2.0 -lnss3 -lnssutil3 -lsmime3 -lssl3 -lsoftokn3 -lplds4 -lplc4 -lnspr4 libtool: link: x86_64-pld-linux-gnux32-gcc -O2 -fwrapv -pipe -Wformat -Werror=format-security -gdwarf-4 -fno-debug-types-section -fvar-tracking-assignments -g2 -Wp,-D_FORTIFY_SOURCE=2 -fstack-protector-strong --param=ssp-buffer-size=4 -fPIC -mtune=generic -march=x86-64 -gdwarf-4 -fno-debug-types-section -fvar-tracking-assignments -g2 -Wall -W -Wcast-align -Wmissing-noreturn -Wnested-externs -Wpointer-arith -Wshadow -Wundef -Wwrite-strings -Wl,--as-needed -Wl,--no-copy-dt-needed-entries -Wl,-z -Wl,relro -Wl,-z -Wl,combreloc -o src/.libs/volume_key src/volume_key-volume_key.o lib/.libs/libvolume_key.so -L/usr/libx32 -lblkid /usr/libx32/libgpgme.so /usr/libx32/libassuan.so /usr/libx32/libcryptsetup.so /usr/libx32/libuuid.so -ldevmapper /usr/libx32/libgcrypt.so /usr/libx32/libgpg-error.so -largon2 -lrt -ldl -ljson-c /usr/libx32/libglib-2.0.so /usr/libx32/libpcre.so -lpthread -lnss3 -lnssutil3 -lsmime3 -lssl3 -lsoftokn3 -lplds4 -lplc4 -lnspr4 lib/.libs/libvolume_key.so: undefined reference to `crypt_get_error' collect2: error: ld returned 1 exit status make[2]: *** [Makefile:960: src/volume_key] Error 1 make[2]: Leaving directory '/tmp/B.Ut0b2H/BUILD/volume_key-0.3.9' make[2]: *** Waiting for unfinished jobs.... make[2]: Entering directory '/tmp/B.Ut0b2H/BUILD/volume_key-0.3.9' /bin/sh ./libtool --tag=CC --mode=link x86_64-pld-linux-gnux32-gcc -O2 -fwrapv -pipe -Wformat -Werror=format-security -gdwarf-4 -fno-debug-types-section -fvar-tracking-assignments -g2 -Wp,-D_FORTIFY_SOURCE=2 -fstack-protector-strong --param=ssp-buffer-size=4 -fPIC -mtune=generic -march=x86-64 -gdwarf-4 -fno-debug-types-section -fvar-tracking-assignments -g2 -Wall -W -Wcast-align -Wmissing-noreturn -Wnested-externs -Wpointer-arith -Wshadow -Wundef -Wwrite-strings -module -avoid-version -lglib-2.0 -Wl,--as-needed -Wl,--no-copy-dt-needed-entries -Wl,-z,relro -Wl,-z,combreloc -o python/_volume_key.la -rpath /usr/libx32/python2.7/site-packages python/_volume_key_la-volume_key_wrap.lo lib/libvolume_key.la -lpython2.7 -lglib-2.0 -lnss3 -lnssutil3 -lsmime3 -lssl3 -lsoftokn3 -lplds4 -lplc4 -lnspr4 libtool: link: x86_64-pld-linux-gnux32-gcc -shared -fPIC -DPIC -O2 -gdwarf-4 -g2 -fstack-protector-strong -mtune=generic -march=x86-64 -gdwarf-4 -g2 -Wl,--as-needed -Wl,--no-copy-dt-needed-entries -Wl,-z -Wl,relro -Wl,-z -Wl,combreloc python/.libs/_volume_key_la-volume_key_wrap.o -Wl,-rpath -Wl,/tmp/B.Ut0b2H/BUILD/volume_key-0.3.9/lib/.libs lib/.libs/libvolume_key.so -L/usr/libx32 -lblkid /usr/libx32/libgpgme.so /usr/libx32/libassuan.so /usr/libx32/libcryptsetup.so /usr/libx32/libuuid.so -ldevmapper /usr/libx32/libgcrypt.so /usr/libx32/libgpg-error.so -largon2 -lrt -ldl -ljson-c -lpython2.7 /usr/libx32/libglib-2.0.so /usr/libx32/libpcre.so -lpthread -lnss3 -lnssutil3 -lsmime3 -lssl3 -lsoftokn3 -lplds4 -lplc4 -lnspr4 -Wl,-soname -Wl,_volume_key.so -o python/.libs/_volume_key.so libtool: link: ( cd "python/.libs" && rm -f "_volume_key.la" && ln -s "../_volume_key.la" "_volume_key.la" ) make[2]: Leaving directory '/tmp/B.Ut0b2H/BUILD/volume_key-0.3.9' make[1]: *** [Makefile:1224: all-recursive] Error 1 make: *** [Makefile:735: all] Error 2 error: Bad exit status from /tmp/B.Ut0b2H/BUILD/tmp/rpm-tmp.89490 (%build) RPM build errors: Bad exit status from /tmp/B.Ut0b2H/BUILD/tmp/rpm-tmp.89490 (%build) ended at: Tue May 15 12:34:07 2018, done in 0:00:17.222140 error: No files produced. + chmod -R u+rwX /tmp/B.Ut0b2H/BUILD + rm -rf /tmp/B.Ut0b2H/tmp /tmp/B.Ut0b2H/BUILD + rm -rf /tmp/B.Ut0b2H Begin-PLD-Builder-Info Build-Time: user:20.37s sys:6.79s real:20.15s (faults io:0 non-io:834205) End-PLD-Builder-Info
[Back to list of logs] [View rpm -qa of builder]