FailedOk

th/SRPMS[OK]
th/x32[OK]
th/i686[OK]
th/x86_64[OK]

ac/SRPMS[OK]
ac/i386[OK]
ac/i586[OK]
ac/i686[OK]
ac/alpha[OK]
ac/amd64[OK]
ac/athlon[OK]
ac/ppc[OK]
ac/sparc[OK]
ac/sparc64[OK]

Advanced Search
main()
Powered by PLD Linux
(c) 2002-2017 PLD Team
$Revision: 1.37 $
Powered by bogon.
Your IP: 54.221.73.186

vpb-driver b6b65614-97ee-4635-8a73-7f117eda0cc6

Status:Failed
Source URL:ftp://buildlogs.pld-linux.org/th/x32/FAIL/vpb-driver,b6b65614-97ee-4635-8a73-7f117eda0cc6.bz2
text/plain URL:View!
rpm -qa of builder:View!
Date:2017/07/31 19:50:27
Runtime:0:00:09.465539

Toc:

  • prep
  • Executing(%prep): /bin/sh -e /tmp/B.OXprzh/BUILD/tmp/rpm-tmp.16314
  • build
  • Executing(%build): /bin/sh -e /tmp/B.OXprzh/BUILD/tmp/rpm-tmp.16314
  • error 1
  • /tmp/B.OXprzh/BUILD/vpb-driver-4.2.58/src/vpb/vpb.c:457:8: error: implicit declaration of function 'copy_from_user' [-Werror=implicit-function-declaration]
  • error 2
  • /tmp/B.OXprzh/BUILD/vpb-driver-4.2.58/src/vpb/vpb.c:475:9: error: implicit declaration of function 'copy_to_user' [-Werror=implicit-function-declaration]
  • error 3
  • error: Bad exit status from /tmp/B.OXprzh/BUILD/tmp/rpm-tmp.16314 (%build)
  • error 4
  • RPM build errors:
  • error 5
  • error: No files produced.

Content:

request from: baggins
checking if we should skip the build
started at: Mon Jul 31 19:50:11 2017
fetching https://srcbuilder.pld-linux.org/th//srpms/b6b65614-97ee-4635-8a73-7f117eda0cc6/vpb-driver-kernel-4.2.58-2%404.12.4_1.src.rpm
fetched 754617 bytes, 492.5 K/s
installing srpm: vpb-driver-kernel-4.2.58-2@4.12.4_1.src.rpm
+ install -d /tmp/B.OXprzh/BUILD /tmp/B.OXprzh/RPMS
+ LC_ALL=en_US.UTF-8
+ rpm -qp --changelog vpb-driver-kernel-4.2.58-2@4.12.4_1.src.rpm
* Mon Jul 31 2017 PLD Linux Team <feedback@pld-linux.org>
- For complete changelog see: http://git.pld-linux.org/?p=packages/vpb-driver.git;a=log;h=master
+ rpm -Uhv --nodeps --define '_topdir /tmp/B.OXprzh' --define '_specdir %{_topdir}' --define '_sourcedir %{_specdir}' --define '_rpmdir %{_topdir}/RPMS' --define '_builddir %{_topdir}/BUILD' --without userspace --define 'build_kernels head,4.9,4.4,4.1' vpb-driver-kernel-4.2.58-2@4.12.4_1.src.rpm Preparing... ################################################## vpb-driver-kernel ################################################## + rm -f vpb-driver-kernel-4.2.58-2@4.12.4_1.src.rpm + install -m 700 -d /tmp/B.OXprzh/BUILD/tmp + TMPDIR=/tmp/B.OXprzh/BUILD/tmp + exec nice -n 0 rpmbuild -bp --short-circuit --nodeps --define '_topdir /tmp/B.OXprzh' --define '_specdir %{_topdir}' --define '_sourcedir %{_specdir}' --define '_rpmdir %{_topdir}/RPMS' --define '_builddir %{_topdir}/BUILD' --without userspace --target x32-pld-linux --define 'build_kernels head,4.9,4.4,4.1' --define 'prep exit 0' /tmp/B.OXprzh/vpb-driver.spec Building target platforms: x32-pld-linux checking BuildConflict-ing packages no BuildConflicts found checking BR rpm: Building target platforms: x32-pld-linux no BR needed building RPM using: set -ex; : build-id: b6b65614-97ee-4635-8a73-7f117eda0cc6; TMPDIR=/tmp/B.OXprzh/BUILD/tmp exec nice -n 0 rpmbuild -bb --define '_smp_mflags -j9' --define '_make_opts -Otarget' --define '_pld_builder 1' --define '_topdir /tmp/B.OXprzh' --define '_specdir %{_topdir}' --define '_sourcedir %{_specdir}' --define '_rpmdir %{_topdir}/RPMS' --define '_builddir %{_topdir}/BUILD' --without userspace --target x32-pld-linux --define 'build_kernels head,4.9,4.4,4.1' /tmp/B.OXprzh/vpb-driver.spec + : build-id: b6b65614-97ee-4635-8a73-7f117eda0cc6 + TMPDIR=/tmp/B.OXprzh/BUILD/tmp + exec nice -n 0 rpmbuild -bb --define '_smp_mflags -j9' --define '_make_opts -Otarget' --define '_pld_builder 1' --define '_topdir /tmp/B.OXprzh' --define '_specdir %{_topdir}' --define '_sourcedir %{_specdir}' --define '_rpmdir %{_topdir}/RPMS' --define '_builddir %{_topdir}/BUILD' --without userspace --target x32-pld-linux --define 'build_kernels head,4.9,4.4,4.1' /tmp/B.OXprzh/vpb-driver.spec Building target platforms: x32-pld-linux Executing(%prep): /bin/sh -e /tmp/B.OXprzh/BUILD/tmp/rpm-tmp.16314 + umask 022 + cd /tmp/B.OXprzh/BUILD + cd /tmp/B.OXprzh/BUILD + rm -rf vpb-driver-4.2.58 + /usr/bin/gzip -dc /tmp/B.OXprzh/vpb-driver-4.2.58.tar.gz + /bin/tar -xf - + STATUS=0 + '[' 0 -ne 0 ']' + cd vpb-driver-4.2.58 + /bin/id -u + '[' 1000 '=' 0 ']' + /bin/id -u + '[' 1000 '=' 0 ']' + /bin/chmod -Rf a+rX,u+w,g-w,o-w . + echo 'Patch #0 (vpb-driver-make.patch):' Patch #0 (vpb-driver-make.patch): + '[' -f /tmp/B.OXprzh/vpb-driver-make.patch ']' + /bin/cat /tmp/B.OXprzh/vpb-driver-make.patch + /usr/bin/patch -s -p1 + /bin/sed -i -e 's,subdirs = libtoneg libvpb utils,,' src/Makefile.in + exit 0 Executing(%build): /bin/sh -e /tmp/B.OXprzh/BUILD/tmp/rpm-tmp.16314 HOME=/home/users/builder PATH=/home/users/builder/GNUstep/Tools:/usr/local/bin:/usr/bin:/bin TMPDIR=/tmp/B.OXprzh/BUILD/tmp + umask 022 + cd /tmp/B.OXprzh/BUILD + cd vpb-driver-4.2.58 + aclocal + autoconf + ./configure 'LDFLAGS=-Wl,--as-needed -Wl,--no-copy-dt-needed-entries -Wl,-z,relro -Wl,-z,combreloc ' 'CFLAGS=-O2 -fwrapv -pipe -Wformat -Werror=format-security -Wp,-D_FORTIFY_SOURCE=2 -fstack-protector-strong --param=ssp-buffer-size=4 -fPIC -mtune=generic -march=x86-64 ' 'CXXFLAGS=-O2 -fwrapv -pipe -Wformat -Werror=format-security -Wp,-D_FORTIFY_SOURCE=2 -fstack-protector-strong --param=ssp-buffer-size=4 -fPIC -mtune=generic -march=x86-64 ' 'FFLAGS=-O2 -fwrapv -pipe -Wformat -Werror=format-security -Wp,-D_FORTIFY_SOURCE=2 -fstack-protector-strong --param=ssp-buffer-size=4 -fPIC -mtune=generic -march=x86-64 ' 'FCFLAGS=-O2 -fwrapv -pipe -Wformat -Werror=format-security -Wp,-D_FORTIFY_SOURCE=2 -fstack-protector-strong --param=ssp-buffer-size=4 -fPIC -mtune=generic -march=x86-64 ' 'CPPFLAGS=' 'CC=x86_64-pld-linux-gnux32-gcc' 'CXX=x86_64-pld-linux-gnux32-g++' '--host=x86_64-pld-linux-gnux32' '--build=x86_64-pld-linux-gnux32' '--prefix=/usr' '--exec-prefix=/usr' '--bindir=/usr/bin' '--sbindir=/usr/sbin' '--sysconfdir=/etc' '--datadir=/usr/share' '--includedir=/usr/include' '--libdir=/usr/libx32' '--libexecdir=/usr/libx32' '--localstatedir=/var' '--sharedstatedir=/var/lib' '--mandir=/usr/share/man' '--infodir=/usr/share/info' '--x-libraries=/usr/libx32' --enable-shared checking build system type... x86_64-pld-linux-gnux32 checking host system type... x86_64-pld-linux-gnux32 checking for x86_64-pld-linux-gnux32-gcc... x86_64-pld-linux-gnux32-gcc checking whether the C compiler works... yes checking for C compiler default output file name... a.out checking for suffix of executables... checking whether we are cross compiling... no checking for suffix of object files... o checking whether we are using the GNU C compiler... yes checking whether x86_64-pld-linux-gnux32-gcc accepts -g... yes checking for x86_64-pld-linux-gnux32-gcc option to accept ISO C89... none needed checking how to run the C preprocessor... x86_64-pld-linux-gnux32-gcc -E checking whether we are using the GNU C++ compiler... yes checking whether x86_64-pld-linux-gnux32-g++ accepts -g... yes checking how to run the C++ preprocessor... x86_64-pld-linux-gnux32-g++ -E checking for x86_64-pld-linux-gnux32-ar... no checking for ar... ar checking for pthread_create in -lpthread... yes checking for gzopen in -lz... yes checking for pci_read_block in -lpci... yes checking for an ANSI C-conforming const... yes configure: creating ./config.status config.status: creating Version config.status: creating Makefile config.status: creating Makefile.common config.status: creating src/Makefile config.status: creating src/libtoneg/Makefile config.status: creating src/libvpb/Makefile config.status: creating src/libvpb/doc/doxyconf config.status: creating src/utils/Makefile config.status: creating vpb-detect/Makefile config.status: creating src/utils/VpbConfigurator Configured vpb-driver 4.2.58: library linkage: shared using pri: no using debug mode: no + /usr/bin/make -Otarget -j9 -C src/vtcore 'KSRC=/usr/src/linux' /usr/bin/make -C /usr/src/linux M=/tmp/B.OXprzh/BUILD/vpb-driver-4.2.58/src/vtcore VT_VERSION=4.2.58 modules CC [M] /tmp/B.OXprzh/BUILD/vpb-driver-4.2.58/src/vtcore/mu-alaw.o CC [M] /tmp/B.OXprzh/BUILD/vpb-driver-4.2.58/src/vtcore/vtopenswitch.o CC [M] /tmp/B.OXprzh/BUILD/vpb-driver-4.2.58/src/vtcore/vtcore_main.o LD [M] /tmp/B.OXprzh/BUILD/vpb-driver-4.2.58/src/vtcore/vtcore.o CC [M] /tmp/B.OXprzh/BUILD/vpb-driver-4.2.58/src/vtcore/vtopenpci.o make[1]: Entering directory '/usr/src/linux-4.12.4' Building modules, stage 2. make[1]: Leaving directory '/usr/src/linux-4.12.4' MODPOST 3 modules CC /tmp/B.OXprzh/BUILD/vpb-driver-4.2.58/src/vtcore/vtopenswitch.mod.o LD [M] /tmp/B.OXprzh/BUILD/vpb-driver-4.2.58/src/vtcore/vtopenswitch.ko CC /tmp/B.OXprzh/BUILD/vpb-driver-4.2.58/src/vtcore/vtopenpci.mod.o LD [M] /tmp/B.OXprzh/BUILD/vpb-driver-4.2.58/src/vtcore/vtopenpci.ko CC /tmp/B.OXprzh/BUILD/vpb-driver-4.2.58/src/vtcore/vtcore.mod.o LD [M] /tmp/B.OXprzh/BUILD/vpb-driver-4.2.58/src/vtcore/vtcore.ko + /usr/bin/make -Otarget -j9 -C src/vpb 'KSRC=/usr/src/linux' /usr/bin/make -C /usr/src/linux M=/tmp/B.OXprzh/BUILD/vpb-driver-4.2.58/src/vpb VT_VERSION=4.2.58 modules CC [M] /tmp/B.OXprzh/BUILD/vpb-driver-4.2.58/src/vpb/vpb.o /tmp/B.OXprzh/BUILD/vpb-driver-4.2.58/src/vpb/vpb.c: In function 'vpb_ioctl': /tmp/B.OXprzh/BUILD/vpb-driver-4.2.58/src/vpb/vpb.c:457:8: error: implicit declaration of function 'copy_from_user' [-Werror=implicit-function-declaration] ret = copy_from_user(&vpb_data, (void*)arg, sizeof(VPB_DATA)); ^~~~~~~~~~~~~~ /tmp/B.OXprzh/BUILD/vpb-driver-4.2.58/src/vpb/vpb.c:475:9: error: implicit declaration of function 'copy_to_user' [-Werror=implicit-function-declaration] ret = copy_to_user(data, &numPCI, sizeof(int)); ^~~~~~~~~~~~ cc1: some warnings being treated as errors make[2]: *** [scripts/Makefile.build:309: /tmp/B.OXprzh/BUILD/vpb-driver-4.2.58/src/vpb/vpb.o] Error 1 make[1]: *** [Makefile:1515: _module_/tmp/B.OXprzh/BUILD/vpb-driver-4.2.58/src/vpb] Error 2 make: *** [Makefile:39: all] Error 2 error: Bad exit status from /tmp/B.OXprzh/BUILD/tmp/rpm-tmp.16314 (%build) RPM build errors: Bad exit status from /tmp/B.OXprzh/BUILD/tmp/rpm-tmp.16314 (%build) ended at: Mon Jul 31 19:50:27 2017, done in 0:00:09.465539 error: No files produced. + chmod -R u+rwX /tmp/B.OXprzh/BUILD + rm -rf /tmp/B.OXprzh/tmp /tmp/B.OXprzh/BUILD + rm -rf /tmp/B.OXprzh Begin-PLD-Builder-Info Build-Time: user:12.44s sys:1.53s real:16.13s (faults io:0 non-io:647971) End-PLD-Builder-Info
[Back to list of logs] [View rpm -qa of builder]