FailedOk

th/SRPMS[OK]
th/x32[OK]
th/i686[OK]
th/x86_64[OK]

ac/SRPMS[OK]
ac/i386[OK]
ac/i586[OK]
ac/i686[OK]
ac/alpha[OK]
ac/amd64[OK]
ac/athlon[OK]
ac/ppc[OK]
ac/sparc[OK]
ac/sparc64[OK]

Advanced Search
main()
Powered by PLD Linux
(c) 2002-2017 PLD Team
$Revision: 1.37 $
Powered by achelon.
Your IP: 54.162.255.186

wxWidgets 5a309ae1-7196-4d69-86db-66c8185e79e8

Status:Failed
Source URL:ftp://buildlogs.pld-linux.org/th/x32/FAIL/wxWidgets,5a309ae1-7196-4d69-86db-66c8185e79e8.bz2
text/plain URL:View!
full text:View!
rpm -qa of builder:View!
Date:2017/04/16 00:19:38
Runtime:0:17:53.527828

Toc:

  • error 1
  • ../../../.././utils/ifacecheck/src/xmlparser.cpp:573:24: error: cannot convert 'bool' to 'const wxMethod*' in return
  • error 2
  • error: Bad exit status from /tmp/B.HOP97I/BUILD/tmp/rpm-tmp.32680 (%build)
  • error 3
  • RPM build errors:
  • error 4
  • error: No files produced.

Content:

(cd /tmp/B.HOP97I/BUILD/wxWidgets-3.0.2/obj--with-x11--disable-unicode/lib/; rm -f libwx_x11univ_richtext-3.0.so libwx_x11univ_richtext-3.0.so.0; ln -s libwx_x11univ_richtext-3.0.so.0.2.0 libwx_x11univ_richtext-3.0.so.0; ln -s libwx_x11univ_richtext-3.0.so.0 libwx_x11univ_richtext-3.0.so)
+ grep -q with-x11--disable-unicode
+ echo obj--with-x11--disable-unicode
+ /usr/bin/make -Otarget -j9 -C utils
(cd emulator/src && /usr/bin/make all)
(cd execmon && /usr/bin/make all)
(cd helpview/src && /usr/bin/make all)
(cd hhp2cached && /usr/bin/make all)
(cd ifacecheck/src && /usr/bin/make all)
(cd screenshotgen/src && /usr/bin/make all)
(cd wxrc && /usr/bin/make all)
make[1]: Nothing to be done for 'all'.
make[1]: Entering directory '/tmp/B.HOP97I/BUILD/wxWidgets-3.0.2/obj--with-x11--disable-unicode/utils/execmon'
/tmp/B.HOP97I/BUILD/wxWidgets-3.0.2/obj--with-x11--disable-unicode/bk-deps x86_64-pld-linux-gnux32-g++ -c -o execmon_execmon.o -D__WXX11__ -D__WXUNIVERSAL__     -I../../.././utils/execmon -DWXUSINGDLL -DwxUSE_GUI=0 -Wall -Wundef -Wunused-parameter -Wno-ctor-dtor-privacy -Woverloaded-virtual -D_FILE_OFFSET_BITS=64 -DwxDEBUG_LEVEL=0 -I/tmp/B.HOP97I/BUILD/wxWidgets-3.0.2/obj--with-x11--disable-unicode/lib/wx/include/x11univ-ansi-3.0 -I../../.././include -I/usr/include/cairo -I/usr/include/pixman-1 -I/usr/include/freetype2 -I/usr/include/libpng16 -I/usr/include/harfbuzz -I/usr/include/glib-2.0 -I/usr/libx32/glib-2.0/include -I/usr/include/freetype2 -I/usr/include/harfbuzz -I/usr/include/glib-2.0 -I/usr/libx32/glib-2.0/include -I/usr/include/libpng16 -O2 -fwrapv -pipe -Wformat -Werror=format-security -gdwarf-4 -fno-debug-types-section -fvar-tracking-assignments -g2 -Wp,-D_FORTIFY_SOURCE=2 -fstack-protector-strong --param=ssp-buffer-size=4 -fPIC -mtune=generic -march=x86-64 -gdwarf-4 -fno-debug-types-section -fvar-tracking-assignments -g2 -Wno-narrowing -fPIC -I/tmp/B.HOP97I/BUILD/wxWidgets-3.0.2/include -DWX_PRECOMP -pthread -O2 -fwrapv -pipe -Wformat -Werror=format-security -gdwarf-4 -fno-debug-types-section -fvar-tracking-assignments -g2 -Wp,-D_FORTIFY_SOURCE=2 -fstack-protector-strong --param=ssp-buffer-size=4 -fPIC -mtune=generic -march=x86-64 -gdwarf-4 -fno-debug-types-section -fvar-tracking-assignments -g2 -fvisibility=hidden -fvisibility-inlines-hidden ../../.././utils/execmon/execmon.cpp
make[1]: Leaving directory '/tmp/B.HOP97I/BUILD/wxWidgets-3.0.2/obj--with-x11--disable-unicode/utils/execmon'
make[1]: Entering directory '/tmp/B.HOP97I/BUILD/wxWidgets-3.0.2/obj--with-x11--disable-unicode/utils/execmon'
x86_64-pld-linux-gnux32-g++ -o execmon execmon_execmon.o    -L/tmp/B.HOP97I/BUILD/wxWidgets-3.0.2/obj--with-x11--disable-unicode/lib  -pthread      -lwx_base-3.0       -pthread    -Wl,--version-script,/tmp/B.HOP97I/BUILD/wxWidgets-3.0.2/obj--with-x11--disable-unicode/version-script -lz -ldl -lm -lpangocairo-1.0 -lpango-1.0 -lgobject-2.0 -lglib-2.0 -lcairo  -lz -ldl -lm -lpangocairo-1.0 -lpango-1.0 -lgobject-2.0 -lglib-2.0 -lcairo
make[1]: Leaving directory '/tmp/B.HOP97I/BUILD/wxWidgets-3.0.2/obj--with-x11--disable-unicode/utils/execmon'
make[1]: Entering directory '/tmp/B.HOP97I/BUILD/wxWidgets-3.0.2/obj--with-x11--disable-unicode/utils/hhp2cached'
/tmp/B.HOP97I/BUILD/wxWidgets-3.0.2/obj--with-x11--disable-unicode/bk-deps x86_64-pld-linux-gnux32-g++ -c -o hhp2cached_hhp2cached.o -D__WXX11__ -D__WXUNIVERSAL__     -I../../.././utils/hhp2cached -DWXUSINGDLL -I../../.././utils/hhp2cached/../../samples -Wall -Wundef -Wunused-parameter -Wno-ctor-dtor-privacy -Woverloaded-virtual -D_FILE_OFFSET_BITS=64 -DwxDEBUG_LEVEL=0 -I/tmp/B.HOP97I/BUILD/wxWidgets-3.0.2/obj--with-x11--disable-unicode/lib/wx/include/x11univ-ansi-3.0 -I../../.././include -I/usr/include/cairo -I/usr/include/pixman-1 -I/usr/include/freetype2 -I/usr/include/libpng16 -I/usr/include/harfbuzz -I/usr/include/glib-2.0 -I/usr/libx32/glib-2.0/include -I/usr/include/freetype2 -I/usr/include/harfbuzz -I/usr/include/glib-2.0 -I/usr/libx32/glib-2.0/include -I/usr/include/libpng16 -O2 -fwrapv -pipe -Wformat -Werror=format-security -gdwarf-4 -fno-debug-types-section -fvar-tracking-assignments -g2 -Wp,-D_FORTIFY_SOURCE=2 -fstack-protector-strong --param=ssp-buffer-size=4 -fPIC -mtune=generic -march=x86-64 -gdwarf-4 -fno-debug-types-section -fvar-tracking-assignments -g2 -Wno-narrowing -fPIC -I/tmp/B.HOP97I/BUILD/wxWidgets-3.0.2/include -DWX_PRECOMP -pthread -O2 -fwrapv -pipe -Wformat -Werror=format-security -gdwarf-4 -fno-debug-types-section -fvar-tracking-assignments -g2 -Wp,-D_FORTIFY_SOURCE=2 -fstack-protector-strong --param=ssp-buffer-size=4 -fPIC -mtune=generic -march=x86-64 -gdwarf-4 -fno-debug-types-section -fvar-tracking-assignments -g2 -fvisibility=hidden -fvisibility-inlines-hidden ../../.././utils/hhp2cached/hhp2cached.cpp
In file included from ../../.././include/wx/window.h:1946:0,
                 from ../../.././include/wx/wx.h:38,
                 from ../../.././include/wx/wxprec.h:58,
                 from ../../.././utils/hhp2cached/hhp2cached.cpp:10:
../../.././include/wx/univ/window.h:18:28: warning: attribute ignored in declaration of 'class wxControlRenderer' [-Wattributes]
 class WXDLLIMPEXP_FWD_CORE wxControlRenderer;
                            ^~~~~~~~~~~~~~~~~
../../.././include/wx/univ/window.h:18:28: note: attribute for 'class wxControlRenderer' must follow the 'class' keyword
make[1]: Leaving directory '/tmp/B.HOP97I/BUILD/wxWidgets-3.0.2/obj--with-x11--disable-unicode/utils/hhp2cached'
make[1]: Entering directory '/tmp/B.HOP97I/BUILD/wxWidgets-3.0.2/obj--with-x11--disable-unicode/utils/screenshotgen/src'
/tmp/B.HOP97I/BUILD/wxWidgets-3.0.2/obj--with-x11--disable-unicode/bk-deps x86_64-pld-linux-gnux32-g++ -c -o screenshotgen_screenshot_app.o -D__WXX11__ -D__WXUNIVERSAL__     -I../../../.././utils/screenshotgen/src -DWXUSINGDLL -I../../../.././utils/screenshotgen/src/../../../samples -Wall -Wundef -Wunused-parameter -Wno-ctor-dtor-privacy -Woverloaded-virtual -D_FILE_OFFSET_BITS=64 -DwxDEBUG_LEVEL=0 -I/tmp/B.HOP97I/BUILD/wxWidgets-3.0.2/obj--with-x11--disable-unicode/lib/wx/include/x11univ-ansi-3.0 -I../../../.././include -I/usr/include/cairo -I/usr/include/pixman-1 -I/usr/include/freetype2 -I/usr/include/libpng16 -I/usr/include/harfbuzz -I/usr/include/glib-2.0 -I/usr/libx32/glib-2.0/include -I/usr/include/freetype2 -I/usr/include/harfbuzz -I/usr/include/glib-2.0 -I/usr/libx32/glib-2.0/include -I/usr/include/libpng16 -O2 -fwrapv -pipe -Wformat -Werror=format-security -gdwarf-4 -fno-debug-types-section -fvar-tracking-assignments -g2 -Wp,-D_FORTIFY_SOURCE=2 -fstack-protector-strong --param=ssp-buffer-size=4 -fPIC -mtune=generic -march=x86-64 -gdwarf-4 -fno-debug-types-section -fvar-tracking-assignments -g2 -Wno-narrowing -fPIC -I/tmp/B.HOP97I/BUILD/wxWidgets-3.0.2/include -DWX_PRECOMP -pthread -O2 -fwrapv -pipe -Wformat -Werror=format-security -gdwarf-4 -fno-debug-types-section -fvar-tracking-assignments -g2 -Wp,-D_FORTIFY_SOURCE=2 -fstack-protector-strong --param=ssp-buffer-size=4 -fPIC -mtune=generic -march=x86-64 -gdwarf-4 -fno-debug-types-section -fvar-tracking-assignments -g2 -fvisibility=hidden -fvisibility-inlines-hidden ../../../.././utils/screenshotgen/src/screenshot_app.cpp
In file included from ../../../.././include/wx/window.h:1946:0,
                 from ../../../.././include/wx/wx.h:38,
                 from ../../../.././include/wx/wxprec.h:58,
                 from ../../../.././utils/screenshotgen/src/screenshot_app.cpp:9:
../../../.././include/wx/univ/window.h:18:28: warning: attribute ignored in declaration of 'class wxControlRenderer' [-Wattributes]
 class WXDLLIMPEXP_FWD_CORE wxControlRenderer;
                            ^~~~~~~~~~~~~~~~~
../../../.././include/wx/univ/window.h:18:28: note: attribute for 'class wxControlRenderer' must follow the 'class' keyword
make[1]: Leaving directory '/tmp/B.HOP97I/BUILD/wxWidgets-3.0.2/obj--with-x11--disable-unicode/utils/screenshotgen/src'
make[1]: Entering directory '/tmp/B.HOP97I/BUILD/wxWidgets-3.0.2/obj--with-x11--disable-unicode/utils/hhp2cached'
x86_64-pld-linux-gnux32-g++ -o hhp2cached  hhp2cached_hhp2cached.o     -L/tmp/B.HOP97I/BUILD/wxWidgets-3.0.2/obj--with-x11--disable-unicode/lib  -pthread      -lwx_x11univ_html-3.0 -lmspack -lwx_x11univ_core-3.0  -lwx_base-3.0        -L/usr/libx32 -lX11 -lXext -lXinerama -lXxf86vm -lSM -lcairo -lpng -lz -ljpeg -ltiff    -pthread    -Wl,--version-script,/tmp/B.HOP97I/BUILD/wxWidgets-3.0.2/obj--with-x11--disable-unicode/version-script -lz -ldl -lm -lpangocairo-1.0 -lpango-1.0 -lgobject-2.0 -lglib-2.0 -lcairo  -lz -ldl -lm -lpangocairo-1.0 -lpango-1.0 -lgobject-2.0 -lglib-2.0 -lcairo
make[1]: Leaving directory '/tmp/B.HOP97I/BUILD/wxWidgets-3.0.2/obj--with-x11--disable-unicode/utils/hhp2cached'
make[1]: Entering directory '/tmp/B.HOP97I/BUILD/wxWidgets-3.0.2/obj--with-x11--disable-unicode/utils/screenshotgen/src'
/tmp/B.HOP97I/BUILD/wxWidgets-3.0.2/obj--with-x11--disable-unicode/bk-deps x86_64-pld-linux-gnux32-g++ -c -o screenshotgen_customcombo.o -D__WXX11__ -D__WXUNIVERSAL__     -I../../../.././utils/screenshotgen/src -DWXUSINGDLL -I../../../.././utils/screenshotgen/src/../../../samples -Wall -Wundef -Wunused-parameter -Wno-ctor-dtor-privacy -Woverloaded-virtual -D_FILE_OFFSET_BITS=64 -DwxDEBUG_LEVEL=0 -I/tmp/B.HOP97I/BUILD/wxWidgets-3.0.2/obj--with-x11--disable-unicode/lib/wx/include/x11univ-ansi-3.0 -I../../../.././include -I/usr/include/cairo -I/usr/include/pixman-1 -I/usr/include/freetype2 -I/usr/include/libpng16 -I/usr/include/harfbuzz -I/usr/include/glib-2.0 -I/usr/libx32/glib-2.0/include -I/usr/include/freetype2 -I/usr/include/harfbuzz -I/usr/include/glib-2.0 -I/usr/libx32/glib-2.0/include -I/usr/include/libpng16 -O2 -fwrapv -pipe -Wformat -Werror=format-security -gdwarf-4 -fno-debug-types-section -fvar-tracking-assignments -g2 -Wp,-D_FORTIFY_SOURCE=2 -fstack-protector-strong --param=ssp-buffer-size=4 -fPIC -mtune=generic -march=x86-64 -gdwarf-4 -fno-debug-types-section -fvar-tracking-assignments -g2 -Wno-narrowing -fPIC -I/tmp/B.HOP97I/BUILD/wxWidgets-3.0.2/include -DWX_PRECOMP -pthread -O2 -fwrapv -pipe -Wformat -Werror=format-security -gdwarf-4 -fno-debug-types-section -fvar-tracking-assignments -g2 -Wp,-D_FORTIFY_SOURCE=2 -fstack-protector-strong --param=ssp-buffer-size=4 -fPIC -mtune=generic -march=x86-64 -gdwarf-4 -fno-debug-types-section -fvar-tracking-assignments -g2 -fvisibility=hidden -fvisibility-inlines-hidden ../../../.././utils/screenshotgen/src/customcombo.cpp
In file included from ../../../.././include/wx/window.h:1946:0,
                 from ../../../.././include/wx/wx.h:38,
                 from ../../../.././include/wx/wxprec.h:58,
                 from ../../../.././utils/screenshotgen/src/customcombo.cpp:9:
../../../.././include/wx/univ/window.h:18:28: warning: attribute ignored in declaration of 'class wxControlRenderer' [-Wattributes]
 class WXDLLIMPEXP_FWD_CORE wxControlRenderer;
                            ^~~~~~~~~~~~~~~~~
../../../.././include/wx/univ/window.h:18:28: note: attribute for 'class wxControlRenderer' must follow the 'class' keyword
make[1]: Leaving directory '/tmp/B.HOP97I/BUILD/wxWidgets-3.0.2/obj--with-x11--disable-unicode/utils/screenshotgen/src'
make[1]: Entering directory '/tmp/B.HOP97I/BUILD/wxWidgets-3.0.2/obj--with-x11--disable-unicode/utils/helpview/src'
/tmp/B.HOP97I/BUILD/wxWidgets-3.0.2/obj--with-x11--disable-unicode/bk-deps x86_64-pld-linux-gnux32-g++ -c -o helpview_helpview.o -D__WXX11__ -D__WXUNIVERSAL__     -I../../../.././utils/helpview/src -DWXUSINGDLL -I../../../.././utils/helpview/src/../../../samples -Wall -Wundef -Wunused-parameter -Wno-ctor-dtor-privacy -Woverloaded-virtual -D_FILE_OFFSET_BITS=64 -DwxDEBUG_LEVEL=0 -I/tmp/B.HOP97I/BUILD/wxWidgets-3.0.2/obj--with-x11--disable-unicode/lib/wx/include/x11univ-ansi-3.0 -I../../../.././include -I/usr/include/cairo -I/usr/include/pixman-1 -I/usr/include/freetype2 -I/usr/include/libpng16 -I/usr/include/harfbuzz -I/usr/include/glib-2.0 -I/usr/libx32/glib-2.0/include -I/usr/include/freetype2 -I/usr/include/harfbuzz -I/usr/include/glib-2.0 -I/usr/libx32/glib-2.0/include -I/usr/include/libpng16 -O2 -fwrapv -pipe -Wformat -Werror=format-security -gdwarf-4 -fno-debug-types-section -fvar-tracking-assignments -g2 -Wp,-D_FORTIFY_SOURCE=2 -fstack-protector-strong --param=ssp-buffer-size=4 -fPIC -mtune=generic -march=x86-64 -gdwarf-4 -fno-debug-types-section -fvar-tracking-assignments -g2 -Wno-narrowing -fPIC -I/tmp/B.HOP97I/BUILD/wxWidgets-3.0.2/include -DWX_PRECOMP -pthread -O2 -fwrapv -pipe -Wformat -Werror=format-security -gdwarf-4 -fno-debug-types-section -fvar-tracking-assignments -g2 -Wp,-D_FORTIFY_SOURCE=2 -fstack-protector-strong --param=ssp-buffer-size=4 -fPIC -mtune=generic -march=x86-64 -gdwarf-4 -fno-debug-types-section -fvar-tracking-assignments -g2 -fvisibility=hidden -fvisibility-inlines-hidden ../../../.././utils/helpview/src/helpview.cpp
In file included from ../../../.././include/wx/window.h:1946:0,
                 from ../../../.././include/wx/wx.h:38,
                 from ../../../.././include/wx/wxprec.h:58,
                 from ../../../.././utils/helpview/src/helpview.cpp:13:
../../../.././include/wx/univ/window.h:18:28: warning: attribute ignored in declaration of 'class wxControlRenderer' [-Wattributes]
 class WXDLLIMPEXP_FWD_CORE wxControlRenderer;
                            ^~~~~~~~~~~~~~~~~
../../../.././include/wx/univ/window.h:18:28: note: attribute for 'class wxControlRenderer' must follow the 'class' keyword
make[1]: Leaving directory '/tmp/B.HOP97I/BUILD/wxWidgets-3.0.2/obj--with-x11--disable-unicode/utils/helpview/src'
make[1]: Entering directory '/tmp/B.HOP97I/BUILD/wxWidgets-3.0.2/obj--with-x11--disable-unicode/utils/emulator/src'
/tmp/B.HOP97I/BUILD/wxWidgets-3.0.2/obj--with-x11--disable-unicode/bk-deps x86_64-pld-linux-gnux32-g++ -c -o wxemulator_emulator.o -D__WXX11__ -D__WXUNIVERSAL__     -I../../../.././utils/emulator/src -DWXUSINGDLL -I../../../.././utils/emulator/src/../../../samples -Wall -Wundef -Wunused-parameter -Wno-ctor-dtor-privacy -Woverloaded-virtual -D_FILE_OFFSET_BITS=64 -DwxDEBUG_LEVEL=0 -I/tmp/B.HOP97I/BUILD/wxWidgets-3.0.2/obj--with-x11--disable-unicode/lib/wx/include/x11univ-ansi-3.0 -I../../../.././include -I/usr/include/cairo -I/usr/include/pixman-1 -I/usr/include/freetype2 -I/usr/include/libpng16 -I/usr/include/harfbuzz -I/usr/include/glib-2.0 -I/usr/libx32/glib-2.0/include -I/usr/include/freetype2 -I/usr/include/harfbuzz -I/usr/include/glib-2.0 -I/usr/libx32/glib-2.0/include -I/usr/include/libpng16 -O2 -fwrapv -pipe -Wformat -Werror=format-security -gdwarf-4 -fno-debug-types-section -fvar-tracking-assignments -g2 -Wp,-D_FORTIFY_SOURCE=2 -fstack-protector-strong --param=ssp-buffer-size=4 -fPIC -mtune=generic -march=x86-64 -gdwarf-4 -fno-debug-types-section -fvar-tracking-assignments -g2 -Wno-narrowing -fPIC -I/tmp/B.HOP97I/BUILD/wxWidgets-3.0.2/include -DWX_PRECOMP -pthread -O2 -fwrapv -pipe -Wformat -Werror=format-security -gdwarf-4 -fno-debug-types-section -fvar-tracking-assignments -g2 -Wp,-D_FORTIFY_SOURCE=2 -fstack-protector-strong --param=ssp-buffer-size=4 -fPIC -mtune=generic -march=x86-64 -gdwarf-4 -fno-debug-types-section -fvar-tracking-assignments -g2 -fvisibility=hidden -fvisibility-inlines-hidden ../../../.././utils/emulator/src/emulator.cpp
In file included from ../../../.././include/wx/window.h:1946:0,
                 from ../../../.././include/wx/wx.h:38,
                 from ../../../.././include/wx/wxprec.h:58,
                 from ../../../.././utils/emulator/src/emulator.cpp:20:
../../../.././include/wx/univ/window.h:18:28: warning: attribute ignored in declaration of 'class wxControlRenderer' [-Wattributes]
 class WXDLLIMPEXP_FWD_CORE wxControlRenderer;
                            ^~~~~~~~~~~~~~~~~
../../../.././include/wx/univ/window.h:18:28: note: attribute for 'class wxControlRenderer' must follow the 'class' keyword
make[1]: Leaving directory '/tmp/B.HOP97I/BUILD/wxWidgets-3.0.2/obj--with-x11--disable-unicode/utils/emulator/src'
make[1]: Entering directory '/tmp/B.HOP97I/BUILD/wxWidgets-3.0.2/obj--with-x11--disable-unicode/utils/helpview/src'
x86_64-pld-linux-gnux32-g++ -o helpview  helpview_helpview.o     -L/tmp/B.HOP97I/BUILD/wxWidgets-3.0.2/obj--with-x11--disable-unicode/lib  -Wl,-rpath,/tmp/B.HOP97I/BUILD/wxWidgets-3.0.2/obj--with-x11--disable-unicode/lib -pthread      -lwx_x11univ_html-3.0 -lmspack -lwx_x11univ_core-3.0  -lwx_base_net-3.0  -lwx_base-3.0        -L/usr/libx32 -lX11 -lXext -lXinerama -lXxf86vm -lSM -lcairo -lpng -lz -ljpeg -ltiff    -pthread    -Wl,--version-script,/tmp/B.HOP97I/BUILD/wxWidgets-3.0.2/obj--with-x11--disable-unicode/version-script -lz -ldl -lm -lpangocairo-1.0 -lpango-1.0 -lgobject-2.0 -lglib-2.0 -lcairo  -lz -ldl -lm -lpangocairo-1.0 -lpango-1.0 -lgobject-2.0 -lglib-2.0 -lcairo
make[1]: Leaving directory '/tmp/B.HOP97I/BUILD/wxWidgets-3.0.2/obj--with-x11--disable-unicode/utils/helpview/src'
make[1]: Entering directory '/tmp/B.HOP97I/BUILD/wxWidgets-3.0.2/obj--with-x11--disable-unicode/utils/screenshotgen/src'
/tmp/B.HOP97I/BUILD/wxWidgets-3.0.2/obj--with-x11--disable-unicode/bk-deps x86_64-pld-linux-gnux32-g++ -c -o screenshotgen_screenshot_main.o -D__WXX11__ -D__WXUNIVERSAL__     -I../../../.././utils/screenshotgen/src -DWXUSINGDLL -I../../../.././utils/screenshotgen/src/../../../samples -Wall -Wundef -Wunused-parameter -Wno-ctor-dtor-privacy -Woverloaded-virtual -D_FILE_OFFSET_BITS=64 -DwxDEBUG_LEVEL=0 -I/tmp/B.HOP97I/BUILD/wxWidgets-3.0.2/obj--with-x11--disable-unicode/lib/wx/include/x11univ-ansi-3.0 -I../../../.././include -I/usr/include/cairo -I/usr/include/pixman-1 -I/usr/include/freetype2 -I/usr/include/libpng16 -I/usr/include/harfbuzz -I/usr/include/glib-2.0 -I/usr/libx32/glib-2.0/include -I/usr/include/freetype2 -I/usr/include/harfbuzz -I/usr/include/glib-2.0 -I/usr/libx32/glib-2.0/include -I/usr/include/libpng16 -O2 -fwrapv -pipe -Wformat -Werror=format-security -gdwarf-4 -fno-debug-types-section -fvar-tracking-assignments -g2 -Wp,-D_FORTIFY_SOURCE=2 -fstack-protector-strong --param=ssp-buffer-size=4 -fPIC -mtune=generic -march=x86-64 -gdwarf-4 -fno-debug-types-section -fvar-tracking-assignments -g2 -Wno-narrowing -fPIC -I/tmp/B.HOP97I/BUILD/wxWidgets-3.0.2/include -DWX_PRECOMP -pthread -O2 -fwrapv -pipe -Wformat -Werror=format-security -gdwarf-4 -fno-debug-types-section -fvar-tracking-assignments -g2 -Wp,-D_FORTIFY_SOURCE=2 -fstack-protector-strong --param=ssp-buffer-size=4 -fPIC -mtune=generic -march=x86-64 -gdwarf-4 -fno-debug-types-section -fvar-tracking-assignments -g2 -fvisibility=hidden -fvisibility-inlines-hidden ../../../.././utils/screenshotgen/src/screenshot_main.cpp
In file included from ../../../.././include/wx/window.h:1946:0,
                 from ../../../.././include/wx/wx.h:38,
                 from ../../../.././include/wx/wxprec.h:58,
                 from ../../../.././utils/screenshotgen/src/screenshot_main.cpp:9:
../../../.././include/wx/univ/window.h:18:28: warning: attribute ignored in declaration of 'class wxControlRenderer' [-Wattributes]
 class WXDLLIMPEXP_FWD_CORE wxControlRenderer;
                            ^~~~~~~~~~~~~~~~~
../../../.././include/wx/univ/window.h:18:28: note: attribute for 'class wxControlRenderer' must follow the 'class' keyword
make[1]: Leaving directory '/tmp/B.HOP97I/BUILD/wxWidgets-3.0.2/obj--with-x11--disable-unicode/utils/screenshotgen/src'
make[1]: Entering directory '/tmp/B.HOP97I/BUILD/wxWidgets-3.0.2/obj--with-x11--disable-unicode/utils/emulator/src'
x86_64-pld-linux-gnux32-g++ -o wxemulator   wxemulator_emulator.o    -L/tmp/B.HOP97I/BUILD/wxWidgets-3.0.2/obj--with-x11--disable-unicode/lib  -pthread      -lwx_x11univ_core-3.0  -lwx_base-3.0        -L/usr/libx32 -lX11 -lXext -lXinerama -lXxf86vm -lSM -lcairo -lpng -lz -ljpeg -ltiff    -pthread    -Wl,--version-script,/tmp/B.HOP97I/BUILD/wxWidgets-3.0.2/obj--with-x11--disable-unicode/version-script -lz -ldl -lm -lpangocairo-1.0 -lpango-1.0 -lgobject-2.0 -lglib-2.0 -lcairo  -lz -ldl -lm -lpangocairo-1.0 -lpango-1.0 -lgobject-2.0 -lglib-2.0 -lcairo
make[1]: Leaving directory '/tmp/B.HOP97I/BUILD/wxWidgets-3.0.2/obj--with-x11--disable-unicode/utils/emulator/src'
make[1]: Entering directory '/tmp/B.HOP97I/BUILD/wxWidgets-3.0.2/obj--with-x11--disable-unicode/utils/ifacecheck/src'
/tmp/B.HOP97I/BUILD/wxWidgets-3.0.2/obj--with-x11--disable-unicode/bk-deps x86_64-pld-linux-gnux32-g++ -c -o ifacecheck_ifacecheck.o -D__WXX11__ -D__WXUNIVERSAL__     -I../../../.././utils/ifacecheck/src -DWXUSINGDLL -DwxUSE_GUI=0 -Wall -Wundef -Wunused-parameter -Wno-ctor-dtor-privacy -Woverloaded-virtual -D_FILE_OFFSET_BITS=64 -DwxDEBUG_LEVEL=0 -I/tmp/B.HOP97I/BUILD/wxWidgets-3.0.2/obj--with-x11--disable-unicode/lib/wx/include/x11univ-ansi-3.0 -I../../../.././include -I/usr/include/cairo -I/usr/include/pixman-1 -I/usr/include/freetype2 -I/usr/include/libpng16 -I/usr/include/harfbuzz -I/usr/include/glib-2.0 -I/usr/libx32/glib-2.0/include -I/usr/include/freetype2 -I/usr/include/harfbuzz -I/usr/include/glib-2.0 -I/usr/libx32/glib-2.0/include -I/usr/include/libpng16 -O2 -fwrapv -pipe -Wformat -Werror=format-security -gdwarf-4 -fno-debug-types-section -fvar-tracking-assignments -g2 -Wp,-D_FORTIFY_SOURCE=2 -fstack-protector-strong --param=ssp-buffer-size=4 -fPIC -mtune=generic -march=x86-64 -gdwarf-4 -fno-debug-types-section -fvar-tracking-assignments -g2 -Wno-narrowing -fPIC -I/tmp/B.HOP97I/BUILD/wxWidgets-3.0.2/include -DWX_PRECOMP -pthread -O2 -fwrapv -pipe -Wformat -Werror=format-security -gdwarf-4 -fno-debug-types-section -fvar-tracking-assignments -g2 -Wp,-D_FORTIFY_SOURCE=2 -fstack-protector-strong --param=ssp-buffer-size=4 -fPIC -mtune=generic -march=x86-64 -gdwarf-4 -fno-debug-types-section -fvar-tracking-assignments -g2 -fvisibility=hidden -fvisibility-inlines-hidden ../../../.././utils/ifacecheck/src/ifacecheck.cpp
make[1]: Leaving directory '/tmp/B.HOP97I/BUILD/wxWidgets-3.0.2/obj--with-x11--disable-unicode/utils/ifacecheck/src'
make[1]: Entering directory '/tmp/B.HOP97I/BUILD/wxWidgets-3.0.2/obj--with-x11--disable-unicode/utils/ifacecheck/src'
/tmp/B.HOP97I/BUILD/wxWidgets-3.0.2/obj--with-x11--disable-unicode/bk-deps x86_64-pld-linux-gnux32-g++ -c -o ifacecheck_xmlparser.o -D__WXX11__ -D__WXUNIVERSAL__     -I../../../.././utils/ifacecheck/src -DWXUSINGDLL -DwxUSE_GUI=0 -Wall -Wundef -Wunused-parameter -Wno-ctor-dtor-privacy -Woverloaded-virtual -D_FILE_OFFSET_BITS=64 -DwxDEBUG_LEVEL=0 -I/tmp/B.HOP97I/BUILD/wxWidgets-3.0.2/obj--with-x11--disable-unicode/lib/wx/include/x11univ-ansi-3.0 -I../../../.././include -I/usr/include/cairo -I/usr/include/pixman-1 -I/usr/include/freetype2 -I/usr/include/libpng16 -I/usr/include/harfbuzz -I/usr/include/glib-2.0 -I/usr/libx32/glib-2.0/include -I/usr/include/freetype2 -I/usr/include/harfbuzz -I/usr/include/glib-2.0 -I/usr/libx32/glib-2.0/include -I/usr/include/libpng16 -O2 -fwrapv -pipe -Wformat -Werror=format-security -gdwarf-4 -fno-debug-types-section -fvar-tracking-assignments -g2 -Wp,-D_FORTIFY_SOURCE=2 -fstack-protector-strong --param=ssp-buffer-size=4 -fPIC -mtune=generic -march=x86-64 -gdwarf-4 -fno-debug-types-section -fvar-tracking-assignments -g2 -Wno-narrowing -fPIC -I/tmp/B.HOP97I/BUILD/wxWidgets-3.0.2/include -DWX_PRECOMP -pthread -O2 -fwrapv -pipe -Wformat -Werror=format-security -gdwarf-4 -fno-debug-types-section -fvar-tracking-assignments -g2 -Wp,-D_FORTIFY_SOURCE=2 -fstack-protector-strong --param=ssp-buffer-size=4 -fPIC -mtune=generic -march=x86-64 -gdwarf-4 -fno-debug-types-section -fvar-tracking-assignments -g2 -fvisibility=hidden -fvisibility-inlines-hidden ../../../.././utils/ifacecheck/src/xmlparser.cpp
../../../.././utils/ifacecheck/src/xmlparser.cpp: In member function 'const wxMethod* wxClass::RecursiveUpwardFindMethod(const wxMethod&, const wxXmlInterface*) const':
../../../.././utils/ifacecheck/src/xmlparser.cpp:573:24: error: cannot convert 'bool' to 'const wxMethod*' in return
                 return false;
                        ^~~~~
make[1]: *** [Makefile:130: ifacecheck_xmlparser.o] Error 1
make[1]: Leaving directory '/tmp/B.HOP97I/BUILD/wxWidgets-3.0.2/obj--with-x11--disable-unicode/utils/ifacecheck/src'
make: *** [Makefile:75: ifacecheck] Error 2
make: *** Waiting for unfinished jobs....
make[1]: Entering directory '/tmp/B.HOP97I/BUILD/wxWidgets-3.0.2/obj--with-x11--disable-unicode/utils/screenshotgen/src'
/tmp/B.HOP97I/BUILD/wxWidgets-3.0.2/obj--with-x11--disable-unicode/bk-deps x86_64-pld-linux-gnux32-g++ -c -o screenshotgen_guiframe.o -D__WXX11__ -D__WXUNIVERSAL__     -I../../../.././utils/screenshotgen/src -DWXUSINGDLL -I../../../.././utils/screenshotgen/src/../../../samples -Wall -Wundef -Wunused-parameter -Wno-ctor-dtor-privacy -Woverloaded-virtual -D_FILE_OFFSET_BITS=64 -DwxDEBUG_LEVEL=0 -I/tmp/B.HOP97I/BUILD/wxWidgets-3.0.2/obj--with-x11--disable-unicode/lib/wx/include/x11univ-ansi-3.0 -I../../../.././include -I/usr/include/cairo -I/usr/include/pixman-1 -I/usr/include/freetype2 -I/usr/include/libpng16 -I/usr/include/harfbuzz -I/usr/include/glib-2.0 -I/usr/libx32/glib-2.0/include -I/usr/include/freetype2 -I/usr/include/harfbuzz -I/usr/include/glib-2.0 -I/usr/libx32/glib-2.0/include -I/usr/include/libpng16 -O2 -fwrapv -pipe -Wformat -Werror=format-security -gdwarf-4 -fno-debug-types-section -fvar-tracking-assignments -g2 -Wp,-D_FORTIFY_SOURCE=2 -fstack-protector-strong --param=ssp-buffer-size=4 -fPIC -mtune=generic -march=x86-64 -gdwarf-4 -fno-debug-types-section -fvar-tracking-assignments -g2 -Wno-narrowing -fPIC -I/tmp/B.HOP97I/BUILD/wxWidgets-3.0.2/include -DWX_PRECOMP -pthread -O2 -fwrapv -pipe -Wformat -Werror=format-security -gdwarf-4 -fno-debug-types-section -fvar-tracking-assignments -g2 -Wp,-D_FORTIFY_SOURCE=2 -fstack-protector-strong --param=ssp-buffer-size=4 -fPIC -mtune=generic -march=x86-64 -gdwarf-4 -fno-debug-types-section -fvar-tracking-assignments -g2 -fvisibility=hidden -fvisibility-inlines-hidden ../../../.././utils/screenshotgen/src/guiframe.cpp
In file included from ../../../.././include/wx/window.h:1946:0,
                 from ../../../.././include/wx/wx.h:38,
                 from ../../../.././include/wx/wxprec.h:58,
                 from ../../../.././utils/screenshotgen/src/guiframe.cpp:9:
../../../.././include/wx/univ/window.h:18:28: warning: attribute ignored in declaration of 'class wxControlRenderer' [-Wattributes]
 class WXDLLIMPEXP_FWD_CORE wxControlRenderer;
                            ^~~~~~~~~~~~~~~~~
../../../.././include/wx/univ/window.h:18:28: note: attribute for 'class wxControlRenderer' must follow the 'class' keyword
make[1]: Leaving directory '/tmp/B.HOP97I/BUILD/wxWidgets-3.0.2/obj--with-x11--disable-unicode/utils/screenshotgen/src'
make[1]: Entering directory '/tmp/B.HOP97I/BUILD/wxWidgets-3.0.2/obj--with-x11--disable-unicode/utils/screenshotgen/src'
/tmp/B.HOP97I/BUILD/wxWidgets-3.0.2/obj--with-x11--disable-unicode/bk-deps x86_64-pld-linux-gnux32-g++ -c -o screenshotgen_autocapture.o -D__WXX11__ -D__WXUNIVERSAL__     -I../../../.././utils/screenshotgen/src -DWXUSINGDLL -I../../../.././utils/screenshotgen/src/../../../samples -Wall -Wundef -Wunused-parameter -Wno-ctor-dtor-privacy -Woverloaded-virtual -D_FILE_OFFSET_BITS=64 -DwxDEBUG_LEVEL=0 -I/tmp/B.HOP97I/BUILD/wxWidgets-3.0.2/obj--with-x11--disable-unicode/lib/wx/include/x11univ-ansi-3.0 -I../../../.././include -I/usr/include/cairo -I/usr/include/pixman-1 -I/usr/include/freetype2 -I/usr/include/libpng16 -I/usr/include/harfbuzz -I/usr/include/glib-2.0 -I/usr/libx32/glib-2.0/include -I/usr/include/freetype2 -I/usr/include/harfbuzz -I/usr/include/glib-2.0 -I/usr/libx32/glib-2.0/include -I/usr/include/libpng16 -O2 -fwrapv -pipe -Wformat -Werror=format-security -gdwarf-4 -fno-debug-types-section -fvar-tracking-assignments -g2 -Wp,-D_FORTIFY_SOURCE=2 -fstack-protector-strong --param=ssp-buffer-size=4 -fPIC -mtune=generic -march=x86-64 -gdwarf-4 -fno-debug-types-section -fvar-tracking-assignments -g2 -Wno-narrowing -fPIC -I/tmp/B.HOP97I/BUILD/wxWidgets-3.0.2/include -DWX_PRECOMP -pthread -O2 -fwrapv -pipe -Wformat -Werror=format-security -gdwarf-4 -fno-debug-types-section -fvar-tracking-assignments -g2 -Wp,-D_FORTIFY_SOURCE=2 -fstack-protector-strong --param=ssp-buffer-size=4 -fPIC -mtune=generic -march=x86-64 -gdwarf-4 -fno-debug-types-section -fvar-tracking-assignments -g2 -fvisibility=hidden -fvisibility-inlines-hidden ../../../.././utils/screenshotgen/src/autocapture.cpp
In file included from ../../../.././include/wx/window.h:1946:0,
                 from ../../../.././include/wx/wx.h:38,
                 from ../../../.././include/wx/wxprec.h:58,
                 from ../../../.././utils/screenshotgen/src/autocapture.cpp:9:
../../../.././include/wx/univ/window.h:18:28: warning: attribute ignored in declaration of 'class wxControlRenderer' [-Wattributes]
 class WXDLLIMPEXP_FWD_CORE wxControlRenderer;
                            ^~~~~~~~~~~~~~~~~
../../../.././include/wx/univ/window.h:18:28: note: attribute for 'class wxControlRenderer' must follow the 'class' keyword
make[1]: Leaving directory '/tmp/B.HOP97I/BUILD/wxWidgets-3.0.2/obj--with-x11--disable-unicode/utils/screenshotgen/src'
make[1]: Entering directory '/tmp/B.HOP97I/BUILD/wxWidgets-3.0.2/obj--with-x11--disable-unicode/utils/screenshotgen/src'
x86_64-pld-linux-gnux32-g++ -o screenshotgen  screenshotgen_screenshot_app.o screenshotgen_screenshot_main.o screenshotgen_guiframe.o screenshotgen_customcombo.o screenshotgen_autocapture.o     -L/tmp/B.HOP97I/BUILD/wxWidgets-3.0.2/obj--with-x11--disable-unicode/lib   -Wl,-rpath,/tmp/B.HOP97I/BUILD/wxWidgets-3.0.2/obj--with-x11--disable-unicode/lib -pthread      -lwx_x11univ_aui-3.0  -lwx_x11univ_richtext-3.0  -lwx_x11univ_html-3.0 -lmspack -lwx_x11univ_adv-3.0  -lwx_base_xml-3.0 -lexpat -lwx_x11univ_core-3.0  -lwx_base-3.0        -L/usr/libx32 -lX11 -lXext -lXinerama -lXxf86vm -lSM -lcairo -lpng -lz -ljpeg -ltiff    -pthread    -Wl,--version-script,/tmp/B.HOP97I/BUILD/wxWidgets-3.0.2/obj--with-x11--disable-unicode/version-script -lz -ldl -lm -lpangocairo-1.0 -lpango-1.0 -lgobject-2.0 -lglib-2.0 -lcairo  -lz -ldl -lm -lpangocairo-1.0 -lpango-1.0 -lgobject-2.0 -lglib-2.0 -lcairo
make[1]: Leaving directory '/tmp/B.HOP97I/BUILD/wxWidgets-3.0.2/obj--with-x11--disable-unicode/utils/screenshotgen/src'
error: Bad exit status from /tmp/B.HOP97I/BUILD/tmp/rpm-tmp.32680 (%build)


RPM build errors:
    Bad exit status from /tmp/B.HOP97I/BUILD/tmp/rpm-tmp.32680 (%build)
ended at: Sun Apr 16 00:19:31 2017, done in 0:17:53.527828
error: No files produced.
+ chmod -R u+rwX /tmp/B.HOP97I/BUILD
+ rm -rf /tmp/B.HOP97I/tmp /tmp/B.HOP97I/BUILD
+ rm -rf /tmp/B.HOP97I
Begin-PLD-Builder-Info
Build-Time: user:6511.85s sys:641.99s real:1082.40s (faults io:22 non-io:92245604)

End-PLD-Builder-Info
[Back to list of logs] [View rpm -qa of builder]