FailedOk

th/SRPMS[OK]
th/x32[OK]
th/i686[OK]
th/x86_64[OK]

ac/SRPMS[OK]
ac/i386[OK]
ac/i586[OK]
ac/i686[OK]
ac/alpha[OK]
ac/amd64[OK]
ac/athlon[OK]
ac/ppc[OK]
ac/sparc[OK]
ac/sparc64[OK]

Advanced Search
main()
Powered by PLD Linux
(c) 2002-2018 PLD Team
$Revision: 1.37 $
Powered by Joe.
Your IP: 54.224.85.115

xfce4-taskbar-plugin 3e03f45f-ce01-4f60-984a-7e24b542f530

Status:Failed
Source URL:ftp://buildlogs.pld-linux.org/th/x32/FAIL/xfce4-taskbar-plugin,3e03f45f-ce01-4f60-984a-7e24b542f530.bz2
text/plain URL:View!
full text:View!
rpm -qa of builder:View!
Date:2018/06/10 22:51:08
Runtime:0:00:02.352549

Toc:

  • error 1
  • rpm: error: Failed build dependencies:
  • error 2
  • rpm: error: Failed build dependencies:
  • prep
  • Executing(%prep): /bin/sh -e /tmp/B.0u0oBv/BUILD/tmp/rpm-tmp.73063
  • build
  • Executing(%build): /bin/sh -e /tmp/B.0u0oBv/BUILD/tmp/rpm-tmp.73063
  • error 3
  • panel-xfconf.c:23:10: fatal error: dbus/dbus-glib.h: No such file or directory
  • error 4
  • compilation terminated.
  • error 5
  • error: Bad exit status from /tmp/B.0u0oBv/BUILD/tmp/rpm-tmp.73063 (%build)
  • error 6
  • RPM build errors:
  • error 7
  • error: No files produced.

Content:

checking if we should skip the build
started at: Sun Jun 10 22:50:51 2018
killing old processes on a builder
sending signal 9 to pid -1
Killed
fetching https://srcbuilder.pld-linux.org/th//srpms/3e03f45f-ce01-4f60-984a-7e24b542f530/xfce4-taskbar-plugin-0.20130504-3.src.rpm
fetched 41124 bytes, 117.3 K/s
installing srpm: xfce4-taskbar-plugin-0.20130504-3.src.rpm
+ install -d /tmp/B.0u0oBv/BUILD /tmp/B.0u0oBv/RPMS
+ LC_ALL=en_US.UTF-8
+ rpm -qp --changelog xfce4-taskbar-plugin-0.20130504-3.src.rpm
* Sun Jun 10 2018 PLD Linux Team <feedback@pld-linux.org>
- For complete changelog see: http://git.pld-linux.org/?p=packages/xfce4-taskbar-plugin.git;a=log;h=master
+ rpm -Uhv --nodeps --define '_topdir /tmp/B.0u0oBv' --define '_specdir %{_topdir}' --define '_sourcedir %{_specdir}' --define '_rpmdir %{_topdir}/RPMS' --define '_builddir %{_topdir}/BUILD' xfce4-taskbar-plugin-0.20130504-3.src.rpm Preparing... ################################################## xfce4-taskbar-plugin ################################################## + rm -f xfce4-taskbar-plugin-0.20130504-3.src.rpm + install -m 700 -d /tmp/B.0u0oBv/BUILD/tmp + TMPDIR=/tmp/B.0u0oBv/BUILD/tmp + exec nice -n 0 rpmbuild -bp --short-circuit --nodeps --define '_topdir /tmp/B.0u0oBv' --define '_specdir %{_topdir}' --define '_sourcedir %{_specdir}' --define '_rpmdir %{_topdir}/RPMS' --define '_builddir %{_topdir}/BUILD' --target x32-pld-linux --define 'prep exit 0' /tmp/B.0u0oBv/xfce4-taskbar-plugin.spec Building target platforms: x32-pld-linux checking BuildConflict-ing packages no BuildConflicts found checking BR rpm: error: Failed build dependencies: rpm: gtkhotkey-devel is needed by xfce4-taskbar-plugin-0.20130504-3.src rpm: Building target platforms: x32-pld-linux updating poldek cache... ready is up to date Retrieving th::packages.ndir.md... th is up to date Retrieving th::packages.ndir.md... th is up to date Retrieving th-ready::packages.ndir.md... th-ready is up to date Retrieving th-ready::packages.ndir.md... th-ready is up to date Retrieving th-test::packages.ndir.md... th-test is up to date Retrieving th-test::packages.ndir.md... th-test is up to date checking conflicting packages in BRed packages poldek: Loading [pndir]ready... poldek: Loading [pndir]th-test... poldek: Loading [pndir]th-test... poldek: Loading [pndir]th-ready... poldek: Loading [pndir]th-ready... poldek: Loading [pndir]th... poldek: Loading [pndir]th... poldek: 25709 packages read poldek: Removed 2430 duplicate packages from available set poldek: Processing dependencies... poldek: gtkhotkey-devel-0.2.1-6.x32 marks gtkhotkey-0.2.1-6.x32 (cap gtkhotkey = 0.2.1-6) poldek: There are 2 packages to install (1 marked by dependencies): poldek: I gtkhotkey-devel-0.2.1-6.x32 poldek: D gtkhotkey-0.2.1-6.x32 poldek: This operation will use 67.0KB of disk space. poldek: Need to get 30.7KB of archives (30.7KB to download). poldek: poldek: Retrieving [1/2] th::gtkhotkey-0.2.1-6.x32.rpm... poldek: ..............................done poldek: Retrieving [2/2] th::gtkhotkey-devel-0.2.1-6.x32.rpm... poldek: ..............................done poldek: Executing pm-command.sh --upgrade -vh --test --root / --define _check_dirname_deps 1... poldek: Preparing... ################################################## no conflicts found checking BR rpm: error: Failed build dependencies: rpm: gtkhotkey-devel is needed by xfce4-taskbar-plugin-0.20130504-3.src rpm: Building target platforms: x32-pld-linux installing BR: gtkhotkey\-devel + poldek --noask --caplookup -Q -v '--ignore=hhvm-*' '--ignore=php4-*' '--ignore=php52-*' '--ignore=php54-*' '--ignore=php55-*' '--ignore=php56-*' '--ignore=php70-*' '--ignore=php71-*' '--ignore=php72-*' --upgrade gtkhotkey-devel Loading [pndir]ready... Loading [pndir]th-test... Loading [pndir]th-test... Loading [pndir]th-ready... Loading [pndir]th-ready... Loading [pndir]th... Loading [pndir]th... 25709 packages read Removed 2430 duplicate packages from available set Processing dependencies... gtkhotkey-devel-0.2.1-6.x32 marks gtkhotkey-0.2.1-6.x32 (cap gtkhotkey = 0.2.1-6) There are 2 packages to install (1 marked by dependencies): I gtkhotkey-devel-0.2.1-6.x32 D gtkhotkey-0.2.1-6.x32 This operation will use 67.0KB of disk space. Need to get 30.7KB of archives. Executing pm-command.sh --upgrade -vh --root / --define _check_dirname_deps 1... Preparing... ################################################## gtkhotkey ################################################## gtkhotkey-devel ################################################## building RPM using: set -ex; : build-id: 3e03f45f-ce01-4f60-984a-7e24b542f530; TMPDIR=/tmp/B.0u0oBv/BUILD/tmp exec nice -n 0 rpmbuild -bb --define '_smp_mflags -j9' --define '_make_opts -Otarget' --define '_pld_builder 1' --define '_topdir /tmp/B.0u0oBv' --define '_specdir %{_topdir}' --define '_sourcedir %{_specdir}' --define '_rpmdir %{_topdir}/RPMS' --define '_builddir %{_topdir}/BUILD' --target x32-pld-linux /tmp/B.0u0oBv/xfce4-taskbar-plugin.spec + : build-id: 3e03f45f-ce01-4f60-984a-7e24b542f530 + TMPDIR=/tmp/B.0u0oBv/BUILD/tmp + exec nice -n 0 rpmbuild -bb --define '_smp_mflags -j9' --define '_make_opts -Otarget' --define '_pld_builder 1' --define '_topdir /tmp/B.0u0oBv' --define '_specdir %{_topdir}' --define '_sourcedir %{_specdir}' --define '_rpmdir %{_topdir}/RPMS' --define '_builddir %{_topdir}/BUILD' --target x32-pld-linux /tmp/B.0u0oBv/xfce4-taskbar-plugin.spec Building target platforms: x32-pld-linux Executing(%prep): /bin/sh -e /tmp/B.0u0oBv/BUILD/tmp/rpm-tmp.73063 + umask 022 + cd /tmp/B.0u0oBv/BUILD + cd /tmp/B.0u0oBv/BUILD + rm -rf xfce4-taskbar-plugin + /usr/bin/bzip2 -dc /tmp/B.0u0oBv/xfce4-taskbar-plugin-20130504.tar.bz2 + /bin/tar -xf - + STATUS=0 + '[' 0 -ne 0 ']' + cd xfce4-taskbar-plugin + /bin/id -u + '[' 1000 '=' 0 ']' + /bin/id -u + '[' 1000 '=' 0 ']' + /bin/chmod -Rf a+rX,u+w,g-w,o-w . + echo 'Patch #0 (make.patch):' Patch #0 (make.patch): + '[' -f /tmp/B.0u0oBv/make.patch ']' + /bin/cat /tmp/B.0u0oBv/make.patch + /usr/bin/patch -s -p1 + exit 0 Executing(%build): /bin/sh -e /tmp/B.0u0oBv/BUILD/tmp/rpm-tmp.73063 HOME=/home/users/builder PATH=/home/users/builder/GNUstep/Tools:/usr/local/bin:/usr/bin:/bin TMPDIR=/tmp/B.0u0oBv/BUILD/tmp + umask 022 + cd /tmp/B.0u0oBv/BUILD + cd xfce4-taskbar-plugin + /usr/bin/make -Otarget -j9 'OPT=-O2 -fwrapv -pipe -Wformat -Werror=format-security -gdwarf-4 -fno-debug-types-section -fvar-tracking-assignments -g2 -Wp,-D_FORTIFY_SOURCE=2 -fstack-protector-strong --param=ssp-buffer-size=4 -fPIC -mtune=generic -march=x86-64 -gdwarf-4 -fno-debug-types-section -fvar-tracking-assignments -g2 ' cc -fPIC -DPACKAGE_NAME="\"Taskbar\"" -DLC_MESSAGES="\"C\"" -DHELPDIR="\"/usr/share/doc/xfce4-taskbar/\"" -O2 -fwrapv -pipe -Wformat -Werror=format-security -gdwarf-4 -fno-debug-types-section -fvar-tracking-assignments -g2 -Wp,-D_FORTIFY_SOURCE=2 -fstack-protector-strong --param=ssp-buffer-size=4 -fPIC -mtune=generic -march=x86-64 -gdwarf-4 -fno-debug-types-section -fvar-tracking-assignments -g2 -I. `pkg-config --cflags-only-I gtk+-2.0 exo-1 libwnck-1.0 libxfce4panel-1.0 libxfce4ui-1 libxfconf-0 gtkhotkey-1.0` -c -o panel-xfconf.o panel-xfconf.c panel-xfconf.c:23:10: fatal error: dbus/dbus-glib.h: No such file or directory #include <dbus/dbus-glib.h> ^~~~~~~~~~~~~~~~~~ compilation terminated. make: *** [<builtin>: panel-xfconf.o] Error 1 make: *** Waiting for unfinished jobs.... cc -fPIC -DPACKAGE_NAME="\"Taskbar\"" -DLC_MESSAGES="\"C\"" -DHELPDIR="\"/usr/share/doc/xfce4-taskbar/\"" -O2 -fwrapv -pipe -Wformat -Werror=format-security -gdwarf-4 -fno-debug-types-section -fvar-tracking-assignments -g2 -Wp,-D_FORTIFY_SOURCE=2 -fstack-protector-strong --param=ssp-buffer-size=4 -fPIC -mtune=generic -march=x86-64 -gdwarf-4 -fno-debug-types-section -fvar-tracking-assignments -g2 -I. `pkg-config --cflags-only-I gtk+-2.0 exo-1 libwnck-1.0 libxfce4panel-1.0 libxfce4ui-1 libxfconf-0 gtkhotkey-1.0` -c -o panel-debug.o panel-debug.c cc -fPIC -DPACKAGE_NAME="\"Taskbar\"" -DLC_MESSAGES="\"C\"" -DHELPDIR="\"/usr/share/doc/xfce4-taskbar/\"" -O2 -fwrapv -pipe -Wformat -Werror=format-security -gdwarf-4 -fno-debug-types-section -fvar-tracking-assignments -g2 -Wp,-D_FORTIFY_SOURCE=2 -fstack-protector-strong --param=ssp-buffer-size=4 -fPIC -mtune=generic -march=x86-64 -gdwarf-4 -fno-debug-types-section -fvar-tracking-assignments -g2 -I. `pkg-config --cflags-only-I gtk+-2.0 exo-1 libwnck-1.0 libxfce4panel-1.0 libxfce4ui-1 libxfconf-0 gtkhotkey-1.0` -c -o hotkeys.o hotkeys.c hotkeys.c: In function 'create_default_keymap': hotkeys.c:42:3: warning: implicit declaration of function 'g_sprintf'; did you mean 'g_snprintf'? [-Wimplicit-function-declaration] g_sprintf(key, "%s/<Super>%d", TASKBAR_XFCONF_PREFIX, i % 10); ^~~~~~~~~ g_snprintf hotkeys.c: In function 'hotkey_activated_callback': hotkeys.c:52:4: warning: implicit declaration of function 'xfce_taskbar_selgrp_cmd'; did you mean 'xfce_taskbar_set_size'? [-Wimplicit-function-declaration] xfce_taskbar_selgrp_cmd(data->taskbar, arg); ^~~~~~~~~~~~~~~~~~~~~~~ xfce_taskbar_set_size cc -fPIC -DPACKAGE_NAME="\"Taskbar\"" -DLC_MESSAGES="\"C\"" -DHELPDIR="\"/usr/share/doc/xfce4-taskbar/\"" -O2 -fwrapv -pipe -Wformat -Werror=format-security -gdwarf-4 -fno-debug-types-section -fvar-tracking-assignments -g2 -Wp,-D_FORTIFY_SOURCE=2 -fstack-protector-strong --param=ssp-buffer-size=4 -fPIC -mtune=generic -march=x86-64 -gdwarf-4 -fno-debug-types-section -fvar-tracking-assignments -g2 -I. `pkg-config --cflags-only-I gtk+-2.0 exo-1 libwnck-1.0 libxfce4panel-1.0 libxfce4ui-1 libxfconf-0 gtkhotkey-1.0` -c -o panel-utils.o panel-utils.c cc -fPIC -DPACKAGE_NAME="\"Taskbar\"" -DLC_MESSAGES="\"C\"" -DHELPDIR="\"/usr/share/doc/xfce4-taskbar/\"" -O2 -fwrapv -pipe -Wformat -Werror=format-security -gdwarf-4 -fno-debug-types-section -fvar-tracking-assignments -g2 -Wp,-D_FORTIFY_SOURCE=2 -fstack-protector-strong --param=ssp-buffer-size=4 -fPIC -mtune=generic -march=x86-64 -gdwarf-4 -fno-debug-types-section -fvar-tracking-assignments -g2 -I. `pkg-config --cflags-only-I gtk+-2.0 exo-1 libwnck-1.0 libxfce4panel-1.0 libxfce4ui-1 libxfconf-0 gtkhotkey-1.0` -c -o taskbar.o taskbar.c cc -fPIC -DPACKAGE_NAME="\"Taskbar\"" -DLC_MESSAGES="\"C\"" -DHELPDIR="\"/usr/share/doc/xfce4-taskbar/\"" -O2 -fwrapv -pipe -Wformat -Werror=format-security -gdwarf-4 -fno-debug-types-section -fvar-tracking-assignments -g2 -Wp,-D_FORTIFY_SOURCE=2 -fstack-protector-strong --param=ssp-buffer-size=4 -fPIC -mtune=generic -march=x86-64 -gdwarf-4 -fno-debug-types-section -fvar-tracking-assignments -g2 -I. `pkg-config --cflags-only-I gtk+-2.0 exo-1 libwnck-1.0 libxfce4panel-1.0 libxfce4ui-1 libxfconf-0 gtkhotkey-1.0` -c -o taskbar-widget.o taskbar-widget.c taskbar-widget.c: In function 'xfce_taskbar_load_pinned_config': taskbar-widget.c:528:13: warning: implicit declaration of function 'xfce_dialog_show_error' [-Wimplicit-function-declaration] xfce_dialog_show_error (NULL, err, _("Failed to load the icon \"%s\""), png_path); ^~~~~~~~~~~~~~~~~~~~~~ error: Bad exit status from /tmp/B.0u0oBv/BUILD/tmp/rpm-tmp.73063 (%build) RPM build errors: Bad exit status from /tmp/B.0u0oBv/BUILD/tmp/rpm-tmp.73063 (%build) ended at: Sun Jun 10 22:51:08 2018, done in 0:00:02.352549 error: No files produced. + chmod -R u+rwX /tmp/B.0u0oBv/BUILD + rm -rf /tmp/B.0u0oBv/tmp /tmp/B.0u0oBv/BUILD + rm -rf /tmp/B.0u0oBv Begin-PLD-Builder-Info Build-Time: user:12.26s sys:2.96s real:17.39s (faults io:0 non-io:347997) End-PLD-Builder-Info
[Back to list of logs] [View rpm -qa of builder]