FailedOk

th/SRPMS[OK]
th/x32[OK]
th/i686[OK]
th/x86_64[OK]

ac/SRPMS[OK]
ac/i386[OK]
ac/i586[OK]
ac/i686[OK]
ac/alpha[OK]
ac/amd64[OK]
ac/athlon[OK]
ac/ppc[OK]
ac/sparc[OK]
ac/sparc64[OK]

Advanced Search
main()
Powered by PLD Linux
(c) 2002-2018 PLD Team
$Revision: 1.37 $
Powered by The Bad Thing.
Your IP: 54.80.87.166

xorg-driver-video-tseng f2926ed1-a941-481f-b346-91df13635955

Status:Failed
Source URL:ftp://buildlogs.pld-linux.org/th/x32/FAIL/xorg-driver-video-tseng,f2926ed1-a941-481f-b346-91df13635955.bz2
text/plain URL:View!
full text:View!
rpm -qa of builder:View!
Date:2018/05/14 04:57:52
Runtime:0:00:13.365246

Toc:

  • error 1
  • tseng_driver.c:1041:10: error: 'struct _ScrnInfoRec' has no member named 'maxHValue'
  • error 2
  • tseng_driver.c:1042:10: error: 'struct _ScrnInfoRec' has no member named 'maxVValue'
  • error 3
  • tseng_driver.c:1136:17: error: 'struct _ScrnInfoRec' has no member named 'maxHValue'
  • error 4
  • tseng_driver.c:1137:10: error: 'struct _ScrnInfoRec' has no member named 'maxVValue'
  • error 5
  • make[2]: *** [Makefile:496: tseng_driver.lo] Error 1
  • error 6
  • make[1]: *** [Makefile:440: all-recursive] Error 1
  • error 7
  • error: Bad exit status from /tmp/B.SvQwr6/BUILD/tmp/rpm-tmp.6290 (%build)
  • error 8
  • RPM build errors:
  • error 9
  • error: No files produced.

Content:

checking if libtool supports shared libraries... yes
checking whether to build shared libraries... yes
checking whether to build static libraries... no
checking if RANDR is defined... yes
checking if RENDER is defined... yes
checking if XV is defined... yes
checking if DPMSExtension is defined... yes
checking for xorg-server >= 1.0.99.901 xproto fontsproto  randrproto renderproto videoproto xextproto... yes
checking whether XSERVER_LIBPCIACCESS is declared... yes
checking xf1bpp.h usability... no
checking xf1bpp.h presence... no
checking for xf1bpp.h... no
checking xf4bpp.h usability... no
checking xf4bpp.h presence... no
checking for xf4bpp.h... no
checking for pciaccess >= 0.8.0... yes
checking xaa.h usability... no
checking xaa.h presence... no
checking for xaa.h... no
checking whether to include XAA support... no
checking that generated files are newer than configure... done
configure: creating ./config.status
config.status: creating Makefile
config.status: creating src/Makefile
config.status: creating man/Makefile
config.status: creating config.h
config.status: executing depfiles commands
config.status: executing libtool commands
+ /usr/bin/make -Otarget -j9
/usr/bin/make  all-recursive
Making all in src
make[2]: Entering directory '/tmp/B.SvQwr6/BUILD/xf86-video-tseng-1.2.5/src'
/bin/sh ../libtool  --tag=CC   --mode=compile x86_64-pld-linux-gnux32-gcc -DHAVE_CONFIG_H -I. -I..    -fvisibility=hidden -I/usr/include/xorg -I/usr/include/pixman-1 -I/usr/include/libdrm -I/usr/include/X11/dri  -Wall -Wpointer-arith -Wmissing-declarations -Wformat=2 -Wstrict-prototypes -Wmissing-prototypes -Wnested-externs -Wbad-function-cast -Wold-style-definition -Wdeclaration-after-statement -Wunused -Wuninitialized -Wshadow -Wmissing-noreturn -Wmissing-format-attribute -Wredundant-decls -Wlogical-op -Werror=implicit -Werror=nonnull -Werror=init-self -Werror=main -Werror=missing-braces -Werror=sequence-point -Werror=return-type -Werror=trigraphs -Werror=array-bounds -Werror=write-strings -Werror=address -Werror=int-to-pointer-cast -Werror=pointer-to-int-cast -fno-strict-aliasing -O2 -fwrapv -pipe -Wformat -Werror=format-security -gdwarf-4 -fno-debug-types-section -fvar-tracking-assignments -g2 -Wp,-D_FORTIFY_SOURCE=2 -fstack-protector-strong --param=ssp-buffer-size=4 -fPIC -mtune=generic -march=x86-64 -gdwarf-4 -fno-debug-types-section -fvar-tracking-assignments -g2  -MT tseng_accel.lo -MD -MP -MF .deps/tseng_accel.Tpo -c -o tseng_accel.lo tseng_accel.c
libtool: compile:  x86_64-pld-linux-gnux32-gcc -DHAVE_CONFIG_H -I. -I.. -fvisibility=hidden -I/usr/include/xorg -I/usr/include/pixman-1 -I/usr/include/libdrm -I/usr/include/X11/dri -Wall -Wpointer-arith -Wmissing-declarations -Wformat=2 -Wstrict-prototypes -Wmissing-prototypes -Wnested-externs -Wbad-function-cast -Wold-style-definition -Wdeclaration-after-statement -Wunused -Wuninitialized -Wshadow -Wmissing-noreturn -Wmissing-format-attribute -Wredundant-decls -Wlogical-op -Werror=implicit -Werror=nonnull -Werror=init-self -Werror=main -Werror=missing-braces -Werror=sequence-point -Werror=return-type -Werror=trigraphs -Werror=array-bounds -Werror=write-strings -Werror=address -Werror=int-to-pointer-cast -Werror=pointer-to-int-cast -fno-strict-aliasing -O2 -fwrapv -pipe -Wformat -Werror=format-security -gdwarf-4 -fno-debug-types-section -fvar-tracking-assignments -g2 -Wp,-D_FORTIFY_SOURCE=2 -fstack-protector-strong --param=ssp-buffer-size=4 -fPIC -mtune=generic -march=x86-64 -gdwarf-4 -fno-debug-types-section -fvar-tracking-assignments -g2 -MT tseng_accel.lo -MD -MP -MF .deps/tseng_accel.Tpo -c tseng_accel.c  -fPIC -DPIC -o .libs/tseng_accel.o
In file included from tseng_accel.c:27:0:
tseng_accel.h: In function 'wait_acl_queue':
tseng_accel.h:116:63: warning: passing argument 3 of 'tseng_wait' discards 'const' qualifier from pointer target type [-Wdiscarded-qualifiers]
 #define WAIT_QUEUE tseng_wait(pTseng, ACL_ACCELERATOR_STATUS, "QUEUE", 0x1)
                                                               ^
tseng_accel.h:394:2: note: in expansion of macro 'WAIT_QUEUE'
  WAIT_QUEUE;
  ^~~~~~~~~~
tseng_accel.h:101:1: note: expected 'char *' but argument is of type 'const char *'
 tseng_wait(TsengPtr pTseng, int reg, char *name, unsigned char mask)
 ^~~~~~~~~~
tseng_accel.h:121:61: warning: passing argument 3 of 'tseng_wait' discards 'const' qualifier from pointer target type [-Wdiscarded-qualifiers]
 #define WAIT_ACL tseng_wait(pTseng, ACL_ACCELERATOR_STATUS, "ACL", 0x2)
                                                             ^
tseng_accel.h:396:2: note: in expansion of macro 'WAIT_ACL'
  WAIT_ACL;
  ^~~~~~~~
tseng_accel.h:101:1: note: expected 'char *' but argument is of type 'const char *'
 tseng_wait(TsengPtr pTseng, int reg, char *name, unsigned char mask)
 ^~~~~~~~~~
tseng_accel.c: At top level:
tseng_accel.h:98:13: warning: 'tseng_recover_timeout' used but never defined
 static void tseng_recover_timeout(TsengPtr pTseng);
             ^~~~~~~~~~~~~~~~~~~~~
mv -f .deps/tseng_accel.Tpo .deps/tseng_accel.Plo
make[2]: Leaving directory '/tmp/B.SvQwr6/BUILD/xf86-video-tseng-1.2.5/src'
make[2]: Entering directory '/tmp/B.SvQwr6/BUILD/xf86-video-tseng-1.2.5/src'
/bin/sh ../libtool  --tag=CC   --mode=compile x86_64-pld-linux-gnux32-gcc -DHAVE_CONFIG_H -I. -I..    -fvisibility=hidden -I/usr/include/xorg -I/usr/include/pixman-1 -I/usr/include/libdrm -I/usr/include/X11/dri  -Wall -Wpointer-arith -Wmissing-declarations -Wformat=2 -Wstrict-prototypes -Wmissing-prototypes -Wnested-externs -Wbad-function-cast -Wold-style-definition -Wdeclaration-after-statement -Wunused -Wuninitialized -Wshadow -Wmissing-noreturn -Wmissing-format-attribute -Wredundant-decls -Wlogical-op -Werror=implicit -Werror=nonnull -Werror=init-self -Werror=main -Werror=missing-braces -Werror=sequence-point -Werror=return-type -Werror=trigraphs -Werror=array-bounds -Werror=write-strings -Werror=address -Werror=int-to-pointer-cast -Werror=pointer-to-int-cast -fno-strict-aliasing -O2 -fwrapv -pipe -Wformat -Werror=format-security -gdwarf-4 -fno-debug-types-section -fvar-tracking-assignments -g2 -Wp,-D_FORTIFY_SOURCE=2 -fstack-protector-strong --param=ssp-buffer-size=4 -fPIC -mtune=generic -march=x86-64 -gdwarf-4 -fno-debug-types-section -fvar-tracking-assignments -g2  -MT tseng_driver.lo -MD -MP -MF .deps/tseng_driver.Tpo -c -o tseng_driver.lo tseng_driver.c
libtool: compile:  x86_64-pld-linux-gnux32-gcc -DHAVE_CONFIG_H -I. -I.. -fvisibility=hidden -I/usr/include/xorg -I/usr/include/pixman-1 -I/usr/include/libdrm -I/usr/include/X11/dri -Wall -Wpointer-arith -Wmissing-declarations -Wformat=2 -Wstrict-prototypes -Wmissing-prototypes -Wnested-externs -Wbad-function-cast -Wold-style-definition -Wdeclaration-after-statement -Wunused -Wuninitialized -Wshadow -Wmissing-noreturn -Wmissing-format-attribute -Wredundant-decls -Wlogical-op -Werror=implicit -Werror=nonnull -Werror=init-self -Werror=main -Werror=missing-braces -Werror=sequence-point -Werror=return-type -Werror=trigraphs -Werror=array-bounds -Werror=write-strings -Werror=address -Werror=int-to-pointer-cast -Werror=pointer-to-int-cast -fno-strict-aliasing -O2 -fwrapv -pipe -Wformat -Werror=format-security -gdwarf-4 -fno-debug-types-section -fvar-tracking-assignments -g2 -Wp,-D_FORTIFY_SOURCE=2 -fstack-protector-strong --param=ssp-buffer-size=4 -fPIC -mtune=generic -march=x86-64 -gdwarf-4 -fno-debug-types-section -fvar-tracking-assignments -g2 -MT tseng_driver.lo -MD -MP -MF .deps/tseng_driver.Tpo -c tseng_driver.c  -fPIC -DPIC -o .libs/tseng_driver.o
In file included from tseng_driver.c:37:0:
/usr/include/xorg/xf86PciInfo.h:50:2: warning: #warning "xf86PciInfo.h is deprecated.  For greater compatibility, drivers should include necessary PCI IDs locally rather than relying on this file from xorg-server." [-Wcpp]
 #warning "xf86PciInfo.h is deprecated.  For greater compatibility, drivers should include necessary PCI IDs locally rather than relying on this file from xorg-server."
  ^~~~~~~
tseng_driver.c: In function 'TsengLimitMem':
tseng_driver.c:663:11: warning: passing argument 4 of 'TsengDoMemLimit' discards 'const' qualifier from pointer target type [-Wdiscarded-qualifiers]
           "in linear + accelerated mode "
           ^~~~~~~~~~~~~~~~~~~~~~~~~~~~~~~
tseng_driver.c:638:1: note: expected 'char *' but argument is of type 'const char *'
 TsengDoMemLimit(ScrnInfoPtr pScrn, int ram, int limit, char *reason)
 ^~~~~~~~~~~~~~~
tseng_driver.c:667:7: warning: passing argument 4 of 'TsengDoMemLimit' discards 'const' qualifier from pointer target type [-Wdiscarded-qualifiers]
       "in linear + accelerated mode "
       ^~~~~~~~~~~~~~~~~~~~~~~~~~~~~~~
tseng_driver.c:638:1: note: expected 'char *' but argument is of type 'const char *'
 TsengDoMemLimit(ScrnInfoPtr pScrn, int ram, int limit, char *reason)
 ^~~~~~~~~~~~~~~
tseng_driver.c:675:7: warning: passing argument 4 of 'TsengDoMemLimit' discards 'const' qualifier from pointer target type [-Wdiscarded-qualifiers]
       "in linear + accelerated mode "
       ^~~~~~~~~~~~~~~~~~~~~~~~~~~~~~~
tseng_driver.c:638:1: note: expected 'char *' but argument is of type 'const char *'
 TsengDoMemLimit(ScrnInfoPtr pScrn, int ram, int limit, char *reason)
 ^~~~~~~~~~~~~~~
tseng_driver.c:683:7: warning: passing argument 4 of 'TsengDoMemLimit' discards 'const' qualifier from pointer target type [-Wdiscarded-qualifiers]
       "in linear + accelerated mode "
       ^~~~~~~~~~~~~~~~~~~~~~~~~~~~~~~
tseng_driver.c:638:1: note: expected 'char *' but argument is of type 'const char *'
 TsengDoMemLimit(ScrnInfoPtr pScrn, int ram, int limit, char *reason)
 ^~~~~~~~~~~~~~~
tseng_driver.c:687:45: warning: passing argument 4 of 'TsengDoMemLimit' discards 'const' qualifier from pointer target type [-Wdiscarded-qualifiers]
     ram = TsengDoMemLimit(pScrn, ram, 4096, "on any Tseng card");
                                             ^~~~~~~~~~~~~~~~~~~
tseng_driver.c:638:1: note: expected 'char *' but argument is of type 'const char *'
 TsengDoMemLimit(ScrnInfoPtr pScrn, int ram, int limit, char *reason)
 ^~~~~~~~~~~~~~~
tseng_driver.c: In function 'TsengPreInit':
tseng_driver.c:1041:10: error: 'struct _ScrnInfoRec' has no member named 'maxHValue'
     pScrn->maxHValue = Tseng_HMAX;
          ^~
tseng_driver.c:1042:10: error: 'struct _ScrnInfoRec' has no member named 'maxVValue'
     pScrn->maxVValue = Tseng_VMAX;
          ^~
tseng_driver.c:1136:17: error: 'struct _ScrnInfoRec' has no member named 'maxHValue'
  NULL, 32, pScrn->maxHValue, 8*pTseng->Bytesperpixel, /* H limits */
                 ^~
tseng_driver.c:1137:10: error: 'struct _ScrnInfoRec' has no member named 'maxVValue'
  0, pScrn->maxVValue,        /* V limits */
          ^~
tseng_driver.c: In function 'TsengMapMem':
tseng_driver.c:1659:19: warning: pointer targets in assignment differ in signedness [-Wpointer-sign]
  pTseng->MMioBase = pTseng->FbBase;
                   ^
make[2]: *** [Makefile:496: tseng_driver.lo] Error 1
make[2]: Leaving directory '/tmp/B.SvQwr6/BUILD/xf86-video-tseng-1.2.5/src'
make[2]: *** Waiting for unfinished jobs....
make[2]: Entering directory '/tmp/B.SvQwr6/BUILD/xf86-video-tseng-1.2.5/src'
/bin/sh ../libtool  --tag=CC   --mode=compile x86_64-pld-linux-gnux32-gcc -DHAVE_CONFIG_H -I. -I..    -fvisibility=hidden -I/usr/include/xorg -I/usr/include/pixman-1 -I/usr/include/libdrm -I/usr/include/X11/dri  -Wall -Wpointer-arith -Wmissing-declarations -Wformat=2 -Wstrict-prototypes -Wmissing-prototypes -Wnested-externs -Wbad-function-cast -Wold-style-definition -Wdeclaration-after-statement -Wunused -Wuninitialized -Wshadow -Wmissing-noreturn -Wmissing-format-attribute -Wredundant-decls -Wlogical-op -Werror=implicit -Werror=nonnull -Werror=init-self -Werror=main -Werror=missing-braces -Werror=sequence-point -Werror=return-type -Werror=trigraphs -Werror=array-bounds -Werror=write-strings -Werror=address -Werror=int-to-pointer-cast -Werror=pointer-to-int-cast -fno-strict-aliasing -O2 -fwrapv -pipe -Wformat -Werror=format-security -gdwarf-4 -fno-debug-types-section -fvar-tracking-assignments -g2 -Wp,-D_FORTIFY_SOURCE=2 -fstack-protector-strong --param=ssp-buffer-size=4 -fPIC -mtune=generic -march=x86-64 -gdwarf-4 -fno-debug-types-section -fvar-tracking-assignments -g2  -MT tseng_cursor.lo -MD -MP -MF .deps/tseng_cursor.Tpo -c -o tseng_cursor.lo tseng_cursor.c
libtool: compile:  x86_64-pld-linux-gnux32-gcc -DHAVE_CONFIG_H -I. -I.. -fvisibility=hidden -I/usr/include/xorg -I/usr/include/pixman-1 -I/usr/include/libdrm -I/usr/include/X11/dri -Wall -Wpointer-arith -Wmissing-declarations -Wformat=2 -Wstrict-prototypes -Wmissing-prototypes -Wnested-externs -Wbad-function-cast -Wold-style-definition -Wdeclaration-after-statement -Wunused -Wuninitialized -Wshadow -Wmissing-noreturn -Wmissing-format-attribute -Wredundant-decls -Wlogical-op -Werror=implicit -Werror=nonnull -Werror=init-self -Werror=main -Werror=missing-braces -Werror=sequence-point -Werror=return-type -Werror=trigraphs -Werror=array-bounds -Werror=write-strings -Werror=address -Werror=int-to-pointer-cast -Werror=pointer-to-int-cast -fno-strict-aliasing -O2 -fwrapv -pipe -Wformat -Werror=format-security -gdwarf-4 -fno-debug-types-section -fvar-tracking-assignments -g2 -Wp,-D_FORTIFY_SOURCE=2 -fstack-protector-strong --param=ssp-buffer-size=4 -fPIC -mtune=generic -march=x86-64 -gdwarf-4 -fno-debug-types-section -fvar-tracking-assignments -g2 -MT tseng_cursor.lo -MD -MP -MF .deps/tseng_cursor.Tpo -c tseng_cursor.c  -fPIC -DPIC -o .libs/tseng_cursor.o
mv -f .deps/tseng_cursor.Tpo .deps/tseng_cursor.Plo
make[2]: Leaving directory '/tmp/B.SvQwr6/BUILD/xf86-video-tseng-1.2.5/src'
make[2]: Entering directory '/tmp/B.SvQwr6/BUILD/xf86-video-tseng-1.2.5/src'
/bin/sh ../libtool  --tag=CC   --mode=compile x86_64-pld-linux-gnux32-gcc -DHAVE_CONFIG_H -I. -I..    -fvisibility=hidden -I/usr/include/xorg -I/usr/include/pixman-1 -I/usr/include/libdrm -I/usr/include/X11/dri  -Wall -Wpointer-arith -Wmissing-declarations -Wformat=2 -Wstrict-prototypes -Wmissing-prototypes -Wnested-externs -Wbad-function-cast -Wold-style-definition -Wdeclaration-after-statement -Wunused -Wuninitialized -Wshadow -Wmissing-noreturn -Wmissing-format-attribute -Wredundant-decls -Wlogical-op -Werror=implicit -Werror=nonnull -Werror=init-self -Werror=main -Werror=missing-braces -Werror=sequence-point -Werror=return-type -Werror=trigraphs -Werror=array-bounds -Werror=write-strings -Werror=address -Werror=int-to-pointer-cast -Werror=pointer-to-int-cast -fno-strict-aliasing -O2 -fwrapv -pipe -Wformat -Werror=format-security -gdwarf-4 -fno-debug-types-section -fvar-tracking-assignments -g2 -Wp,-D_FORTIFY_SOURCE=2 -fstack-protector-strong --param=ssp-buffer-size=4 -fPIC -mtune=generic -march=x86-64 -gdwarf-4 -fno-debug-types-section -fvar-tracking-assignments -g2  -MT tseng_dga.lo -MD -MP -MF .deps/tseng_dga.Tpo -c -o tseng_dga.lo tseng_dga.c
libtool: compile:  x86_64-pld-linux-gnux32-gcc -DHAVE_CONFIG_H -I. -I.. -fvisibility=hidden -I/usr/include/xorg -I/usr/include/pixman-1 -I/usr/include/libdrm -I/usr/include/X11/dri -Wall -Wpointer-arith -Wmissing-declarations -Wformat=2 -Wstrict-prototypes -Wmissing-prototypes -Wnested-externs -Wbad-function-cast -Wold-style-definition -Wdeclaration-after-statement -Wunused -Wuninitialized -Wshadow -Wmissing-noreturn -Wmissing-format-attribute -Wredundant-decls -Wlogical-op -Werror=implicit -Werror=nonnull -Werror=init-self -Werror=main -Werror=missing-braces -Werror=sequence-point -Werror=return-type -Werror=trigraphs -Werror=array-bounds -Werror=write-strings -Werror=address -Werror=int-to-pointer-cast -Werror=pointer-to-int-cast -fno-strict-aliasing -O2 -fwrapv -pipe -Wformat -Werror=format-security -gdwarf-4 -fno-debug-types-section -fvar-tracking-assignments -g2 -Wp,-D_FORTIFY_SOURCE=2 -fstack-protector-strong --param=ssp-buffer-size=4 -fPIC -mtune=generic -march=x86-64 -gdwarf-4 -fno-debug-types-section -fvar-tracking-assignments -g2 -MT tseng_dga.lo -MD -MP -MF .deps/tseng_dga.Tpo -c tseng_dga.c  -fPIC -DPIC -o .libs/tseng_dga.o
tseng_dga.c: In function 'Tseng_Sync':
tseng_dga.c:215:14: warning: unused variable 'pTseng' [-Wunused-variable]
     TsengPtr pTseng = TsengPTR(pScrn);
              ^~~~~~
mv -f .deps/tseng_dga.Tpo .deps/tseng_dga.Plo
make[2]: Leaving directory '/tmp/B.SvQwr6/BUILD/xf86-video-tseng-1.2.5/src'
make[2]: Entering directory '/tmp/B.SvQwr6/BUILD/xf86-video-tseng-1.2.5/src'
/bin/sh ../libtool  --tag=CC   --mode=compile x86_64-pld-linux-gnux32-gcc -DHAVE_CONFIG_H -I. -I..    -fvisibility=hidden -I/usr/include/xorg -I/usr/include/pixman-1 -I/usr/include/libdrm -I/usr/include/X11/dri  -Wall -Wpointer-arith -Wmissing-declarations -Wformat=2 -Wstrict-prototypes -Wmissing-prototypes -Wnested-externs -Wbad-function-cast -Wold-style-definition -Wdeclaration-after-statement -Wunused -Wuninitialized -Wshadow -Wmissing-noreturn -Wmissing-format-attribute -Wredundant-decls -Wlogical-op -Werror=implicit -Werror=nonnull -Werror=init-self -Werror=main -Werror=missing-braces -Werror=sequence-point -Werror=return-type -Werror=trigraphs -Werror=array-bounds -Werror=write-strings -Werror=address -Werror=int-to-pointer-cast -Werror=pointer-to-int-cast -fno-strict-aliasing -O2 -fwrapv -pipe -Wformat -Werror=format-security -gdwarf-4 -fno-debug-types-section -fvar-tracking-assignments -g2 -Wp,-D_FORTIFY_SOURCE=2 -fstack-protector-strong --param=ssp-buffer-size=4 -fPIC -mtune=generic -march=x86-64 -gdwarf-4 -fno-debug-types-section -fvar-tracking-assignments -g2  -MT tseng_mode.lo -MD -MP -MF .deps/tseng_mode.Tpo -c -o tseng_mode.lo tseng_mode.c
libtool: compile:  x86_64-pld-linux-gnux32-gcc -DHAVE_CONFIG_H -I. -I.. -fvisibility=hidden -I/usr/include/xorg -I/usr/include/pixman-1 -I/usr/include/libdrm -I/usr/include/X11/dri -Wall -Wpointer-arith -Wmissing-declarations -Wformat=2 -Wstrict-prototypes -Wmissing-prototypes -Wnested-externs -Wbad-function-cast -Wold-style-definition -Wdeclaration-after-statement -Wunused -Wuninitialized -Wshadow -Wmissing-noreturn -Wmissing-format-attribute -Wredundant-decls -Wlogical-op -Werror=implicit -Werror=nonnull -Werror=init-self -Werror=main -Werror=missing-braces -Werror=sequence-point -Werror=return-type -Werror=trigraphs -Werror=array-bounds -Werror=write-strings -Werror=address -Werror=int-to-pointer-cast -Werror=pointer-to-int-cast -fno-strict-aliasing -O2 -fwrapv -pipe -Wformat -Werror=format-security -gdwarf-4 -fno-debug-types-section -fvar-tracking-assignments -g2 -Wp,-D_FORTIFY_SOURCE=2 -fstack-protector-strong --param=ssp-buffer-size=4 -fPIC -mtune=generic -march=x86-64 -gdwarf-4 -fno-debug-types-section -fvar-tracking-assignments -g2 -MT tseng_mode.lo -MD -MP -MF .deps/tseng_mode.Tpo -c tseng_mode.c  -fPIC -DPIC -o .libs/tseng_mode.o
mv -f .deps/tseng_mode.Tpo .deps/tseng_mode.Plo
make[2]: Leaving directory '/tmp/B.SvQwr6/BUILD/xf86-video-tseng-1.2.5/src'
make[1]: *** [Makefile:440: all-recursive] Error 1
make: *** [Makefile:372: all] Error 2
error: Bad exit status from /tmp/B.SvQwr6/BUILD/tmp/rpm-tmp.6290 (%build)


RPM build errors:
    Bad exit status from /tmp/B.SvQwr6/BUILD/tmp/rpm-tmp.6290 (%build)
ended at: Mon May 14 04:57:52 2018, done in 0:00:13.365246
error: No files produced.
+ chmod -R u+rwX /tmp/B.SvQwr6/BUILD
+ rm -rf /tmp/B.SvQwr6/tmp /tmp/B.SvQwr6/BUILD
+ rm -rf /tmp/B.SvQwr6
Begin-PLD-Builder-Info
Build-Time: user:12.45s sys:2.43s real:16.38s (faults io:0 non-io:662010)

End-PLD-Builder-Info
[Back to list of logs] [View rpm -qa of builder]