FailedOk

th/SRPMS[OK]
th/x32[OK]
th/i686[OK]
th/x86_64[OK]

ac/SRPMS[OK]
ac/i386[OK]
ac/i586[OK]
ac/i686[OK]
ac/alpha[OK]
ac/amd64[OK]
ac/athlon[OK]
ac/ppc[OK]
ac/sparc[OK]
ac/sparc64[OK]

Advanced Search
main()
Powered by PLD Linux
(c) 2002-2021 PLD Team
$Revision: 1.37 $
Powered by Dark Side of the Force.
Your IP: 3.237.178.91

xtables-addons 8ddc4091-82a8-4e66-836b-fda5c8dc972e

Status:Failed
Source URL:https://buildlogs.pld-linux.org/pld/th/x32/FAIL/xtables-addons,8ddc4091-82a8-4e66-836b-fda5c8dc972e.bz2
text/plain URL:View!
rpm -qa of builder:View!
Date:2021/02/23 13:41:41
Runtime:0:00:10.262338

Toc:

  • prep
  • Executing(%prep): /bin/sh -e /tmp/B.Y7FwVw/BUILD/tmp/rpm-tmp.boBXo4
  • build
  • Executing(%build): /bin/sh -e /tmp/B.Y7FwVw/BUILD/tmp/rpm-tmp.k0iqXR
  • error 1
  • /tmp/B.Y7FwVw/BUILD/xtables-addons-3.13/extensions/xt_ECHO.c:100:55: error: passing argument 2 of 'security_skb_classify_flow' from incompatible pointer type [-Werror=incompatible-pointer-types]
  • error 2
  • make[1]: *** [scripts/Makefile.build:279: /tmp/B.Y7FwVw/BUILD/xtables-addons-3.13/extensions/xt_ECHO.o] Error 1
  • error 3
  • /tmp/B.Y7FwVw/BUILD/xtables-addons-3.13/extensions/pknock/xt_pknock.c:251:20: error: implicit declaration of function 'get_seconds' [-Werror=implicit-function-declaration]
  • error 4
  • make[2]: *** [scripts/Makefile.build:279: /tmp/B.Y7FwVw/BUILD/xtables-addons-3.13/extensions/pknock/xt_pknock.o] Error 1
  • error 5
  • make[1]: *** [scripts/Makefile.build:496: /tmp/B.Y7FwVw/BUILD/xtables-addons-3.13/extensions/pknock] Error 2
  • error 6
  • error: Bad exit status from /tmp/B.Y7FwVw/BUILD/tmp/rpm-tmp.k0iqXR (%build)
  • error 7
  • RPM build errors:
  • error 8
  • error: No files produced.

Content:

request from: baggins
checking if we should skip the build
started at: Tue Feb 23 13:41:17 2021
killing old processes on a builder
sending signal 9 to pid -1
cleaning up /tmp
fetching https://srcbuilder.pld-linux.org/th//srpms/8ddc4091-82a8-4e66-836b-fda5c8dc972e/xtables-addons-kernel-3.13-1%405.11.0_1.src.rpm
fetched 339755 bytes, 752.5 K/s
installing srpm: xtables-addons-kernel-3.13-1@5.11.0_1.src.rpm
+ install -d /tmp/B.Y7FwVw/BUILD /tmp/B.Y7FwVw/RPMS
+ LC_ALL=en_US.UTF-8
+ rpm -qp --changelog xtables-addons-kernel-3.13-1@5.11.0_1.src.rpm
* Tue Feb 23 2021 PLD Linux Team <feedback@pld-linux.org>
- For complete changelog see: http://git.pld-linux.org/?p=packages/xtables-addons.git;a=log;h=master
* Sun Nov 29 2020 Jan Rękorajski <baggins@pld-linux.org> 4ba041e
- up to 3.13 * Wed Oct 21 2020 Jan Rękorajski <baggins@pld-linux.org> d776018
- up to 3.11 * Sat Aug 22 2020 Jakub Bogusz <qboosh@pld-linux.org> c6204fc
- updated to 3.10 (linux 5.8 support) * Tue Apr 14 2020 Jakub Bogusz <qboosh@pld-linux.org> 9603d03
- ensure fixed kmod-deps macros * Sun Apr 05 2020 Jan Rękorajski <baggins@pld-linux.org> e06a9dd
- up to 3.9 * Fri Jan 31 2020 Jakub Bogusz <qboosh@pld-linux.org> b84a30a
- updated to 3.7 * Fri Nov 29 2019 Jakub Bogusz <qboosh@pld-linux.org> 65b98a0
- updated to 3.6 * Sun Sep 22 2019 Jakub Bogusz <qboosh@pld-linux.org> 3c4b425
- pkgconfig epoch * Wed Sep 18 2019 Jan Rękorajski <baggins@pld-linux.org> 7865ba8
- up to 3.5 * Fri Jul 12 2019 Jan Rękorajski <baggins@pld-linux.org> 7753aa3
- fix building with kernel 5.2 - rel 2 * Sat Mar 09 2019 Jan Rękorajski <baggins@pld-linux.org> cff304e
- up to 3.3 * Tue Nov 27 2018 Jakub Bogusz <qboosh@pld-linux.org> fdbbcb4
- updated to 3.2 (targeted to Linux 4.18) * Fri Aug 17 2018 Jan Rękorajski <baggins@pld-linux.org> 84f6341
- updated support note * Fri Aug 17 2018 Jan Rękorajski <baggins@pld-linux.org> 6a690fe
- Merge branch 'XTADDONS_3' * Fri Aug 17 2018 Jan Rękorajski <baggins@pld-linux.org> 27d3193
- up to 3.1 * Thu Jul 12 2018 Jakub Bogusz <qboosh@pld-linux.org> d8e895a
- more precise information (3.0 userspace part didn't introduce incompatibilities with Linux 3.7 .. 4.14) * Thu Jul 12 2018 Jakub Bogusz <qboosh@pld-linux.org> bf80647
- xtables-addons 3.0 note * Thu Jul 12 2018 Jakub Bogusz <qboosh@pld-linux.org> 45e0a4c
- updated to 3.0, modules require Linux >= 4.15 * Tue Jan 30 2018 Jan Rękorajski <baggins@pld-linux.org> c0b838d
- up to 2.14 - upstream fix for kernel 4.15 * Thu Nov 16 2017 Jan Rękorajski <baggins@pld-linux.org> 3bff943
- fix building with kernel 4.14 - rel 2 + rpm -Uhv --nodeps --define '_topdir /tmp/B.Y7FwVw' --define '_specdir %{_topdir}' --define '_sourcedir %{_specdir}' --define '_rpmdir %{_topdir}/RPMS' --define '_builddir %{_topdir}/BUILD' --without userspace --define 'build_kernels head,5.4,4.19,5.10' xtables-addons-kernel-3.13-1@5.11.0_1.src.rpm Updating / installing... xtables-addons-kernel-3.13-1@5.11.0_1 ######################################## + rm -f xtables-addons-kernel-3.13-1@5.11.0_1.src.rpm + install -m 700 -d /tmp/B.Y7FwVw/BUILD/tmp + TMPDIR=/tmp/B.Y7FwVw/BUILD/tmp + exec nice -n 0 rpmbuild -bp --short-circuit --nodeps --define '_topdir /tmp/B.Y7FwVw' --define '_specdir %{_topdir}' --define '_sourcedir %{_specdir}' --define '_rpmdir %{_topdir}/RPMS' --define '_builddir %{_topdir}/BUILD' --without userspace --target x32-pld-linux --define 'build_kernels head,5.4,4.19,5.10' --define 'prep exit 0' /tmp/B.Y7FwVw/xtables-addons.spec warning: line 46: It's not recommended to have unversioned Obsoletes: Obsoletes: iptables-ipp2p warning: Could not canonicalize hostname: naiad Building target platforms: x32-pld-linux Building for target x32-pld-linux checking BuildConflict-ing packages no BuildConflicts found checking BR rpm: warning: line 46: It's not recommended to have unversioned Obsoletes: Obsoletes: iptables-ipp2p rpm: warning: Could not canonicalize hostname: naiad rpm: Building target platforms: x32-pld-linux rpm: Building for target x32-pld-linux no BR needed building RPM using: set -ex; : build-id: 8ddc4091-82a8-4e66-836b-fda5c8dc972e; TMPDIR=/tmp/B.Y7FwVw/BUILD/tmp exec nice -n 0 rpmbuild -bb --define '_smp_mflags -j9' --define '_make_opts -Otarget' --define '_pld_builder 1' --define '_topdir /tmp/B.Y7FwVw' --define '_specdir %{_topdir}' --define '_sourcedir %{_specdir}' --define '_rpmdir %{_topdir}/RPMS' --define '_builddir %{_topdir}/BUILD' --without userspace --target x32-pld-linux --define 'build_kernels head,5.4,4.19,5.10' /tmp/B.Y7FwVw/xtables-addons.spec + : build-id: 8ddc4091-82a8-4e66-836b-fda5c8dc972e + TMPDIR=/tmp/B.Y7FwVw/BUILD/tmp + exec nice -n 0 rpmbuild -bb --define '_smp_mflags -j9' --define '_make_opts -Otarget' --define '_pld_builder 1' --define '_topdir /tmp/B.Y7FwVw' --define '_specdir %{_topdir}' --define '_sourcedir %{_specdir}' --define '_rpmdir %{_topdir}/RPMS' --define '_builddir %{_topdir}/BUILD' --without userspace --target x32-pld-linux --define 'build_kernels head,5.4,4.19,5.10' /tmp/B.Y7FwVw/xtables-addons.spec warning: line 46: It's not recommended to have unversioned Obsoletes: Obsoletes: iptables-ipp2p warning: Could not canonicalize hostname: naiad Building target platforms: x32-pld-linux Building for target x32-pld-linux Executing(%prep): /bin/sh -e /tmp/B.Y7FwVw/BUILD/tmp/rpm-tmp.boBXo4 + umask 022 + cd /tmp/B.Y7FwVw/BUILD + cd /tmp/B.Y7FwVw/BUILD + rm -rf xtables-addons-3.13 + /usr/bin/xz -dc /tmp/B.Y7FwVw/xtables-addons-3.13.tar.xz + /bin/tar -xof - + STATUS=0 + '[' 0 -ne 0 ']' + cd xtables-addons-3.13 + /bin/chmod -Rf a+rX,u+w,g-w,o-w . + RPM_EC=0 + jobs -p + exit 0 Executing(%build): /bin/sh -e /tmp/B.Y7FwVw/BUILD/tmp/rpm-tmp.k0iqXR HOME=/home/users/builder PATH=/home/users/builder/GNUstep/Tools:/bin:/usr/bin:/usr/local/bin TMPDIR=/tmp/B.Y7FwVw/BUILD/tmp + umask 022 + cd /tmp/B.Y7FwVw/BUILD + cd xtables-addons-3.13 + ./configure 'LDFLAGS=-Wl,--as-needed -Wl,--no-copy-dt-needed-entries -Wl,-z,relro -Wl,-z,combreloc ' 'CFLAGS=-O2 -fwrapv -pipe -Wformat -Werror=format-security -Wp,-D_FORTIFY_SOURCE=2 -fstack-protector-strong --param=ssp-buffer-size=4 -Werror=trampolines -fPIC -mtune=generic -march=x86-64 ' 'CXXFLAGS=-O2 -fwrapv -pipe -Wformat -Werror=format-security -Wp,-D_FORTIFY_SOURCE=2 -fstack-protector-strong --param=ssp-buffer-size=4 -Werror=trampolines -fPIC -mtune=generic -march=x86-64 ' 'FFLAGS=-O2 -fwrapv -pipe -Wformat -Werror=format-security -Wp,-D_FORTIFY_SOURCE=2 -fstack-protector-strong --param=ssp-buffer-size=4 -Werror=trampolines -fPIC -mtune=generic -march=x86-64 ' 'FCFLAGS=-O2 -fwrapv -pipe -Wformat -Werror=format-security -Wp,-D_FORTIFY_SOURCE=2 -fstack-protector-strong --param=ssp-buffer-size=4 -Werror=trampolines -fPIC -mtune=generic -march=x86-64 ' 'CPPFLAGS=' 'CC=x86_64-pld-linux-gnux32-gcc' 'CXX=x86_64-pld-linux-gnux32-g++' '--host=x86_64-pld-linux-gnux32' '--build=x86_64-pld-linux-gnux32' '--prefix=/usr' '--exec-prefix=/usr' '--bindir=/usr/bin' '--sbindir=/usr/sbin' '--sysconfdir=/etc' '--datadir=/usr/share' '--includedir=/usr/include' '--libdir=/usr/libx32' '--libexecdir=/usr/libexec' '--localstatedir=/var' '--sharedstatedir=/var/lib' '--mandir=/usr/share/man' '--infodir=/usr/share/info' '--x-libraries=/usr/libx32' --without-kbuild checking for a BSD-compatible install... /usr/bin/install -c checking whether build environment is sane... yes checking for a thread-safe mkdir -p... /bin/mkdir -p checking for gawk... gawk checking whether make sets $(MAKE)... yes checking whether make supports nested variables... yes checking whether make supports nested variables... (cached) yes checking for x86_64-pld-linux-gnux32-gcc... x86_64-pld-linux-gnux32-gcc checking whether the C compiler works... yes checking for C compiler default output file name... a.out checking for suffix of executables... checking whether we are cross compiling... no checking for suffix of object files... o checking whether we are using the GNU C compiler... yes checking whether x86_64-pld-linux-gnux32-gcc accepts -g... yes checking for x86_64-pld-linux-gnux32-gcc option to accept ISO C89... none needed checking whether x86_64-pld-linux-gnux32-gcc understands -c and -o together... yes checking whether make supports the include directive... yes (GNU style) checking dependency style of x86_64-pld-linux-gnux32-gcc... gcc3 checking for x86_64-pld-linux-gnux32-ar... no checking for x86_64-pld-linux-gnux32-lib... no checking for x86_64-pld-linux-gnux32-link... no checking for ar... ar checking the archiver (ar) interface... ar checking build system type... x86_64-pld-linux-gnux32 checking host system type... x86_64-pld-linux-gnux32 checking how to print strings... print -r checking for a sed that does not truncate output... /bin/sed checking for grep that handles long lines and -e... /bin/grep checking for egrep... /bin/grep -E checking for fgrep... /bin/grep -F checking for ld used by x86_64-pld-linux-gnux32-gcc... /usr/bin/ld checking if the linker (/usr/bin/ld) is GNU ld... yes checking for BSD- or MS-compatible name lister (nm)... /usr/bin/nm -B checking the name lister (/usr/bin/nm -B) interface... BSD nm checking whether ln -s works... yes checking the maximum length of command line arguments... 1572864 checking how to convert x86_64-pld-linux-gnux32 file names to x86_64-pld-linux-gnux32 format... func_convert_file_noop checking how to convert x86_64-pld-linux-gnux32 file names to toolchain format... func_convert_file_noop checking for /usr/bin/ld option to reload object files... -r checking for x86_64-pld-linux-gnux32-objdump... no checking for objdump... objdump checking how to recognize dependent libraries... pass_all checking for x86_64-pld-linux-gnux32-dlltool... no checking for dlltool... no checking how to associate runtime and link libraries... print -r -- checking for x86_64-pld-linux-gnux32-ar... ar checking for archiver @FILE support... @ checking for x86_64-pld-linux-gnux32-strip... no checking for strip... strip checking for x86_64-pld-linux-gnux32-ranlib... no checking for ranlib... ranlib checking command to parse /usr/bin/nm -B output from x86_64-pld-linux-gnux32-gcc object... ok checking for sysroot... no checking for a working dd... /bin/dd checking how to truncate binary pipes... /bin/dd bs=4096 count=1 checking for x86_64-pld-linux-gnux32-mt... no checking for mt... no checking if : is a manifest tool... no checking how to run the C preprocessor... x86_64-pld-linux-gnux32-gcc -E checking for ANSI C header files... yes checking for sys/types.h... yes checking for sys/stat.h... yes checking for stdlib.h... yes checking for string.h... yes checking for memory.h... yes checking for strings.h... yes checking for inttypes.h... yes checking for stdint.h... yes checking for unistd.h... yes checking for dlfcn.h... yes checking for objdir... .libs checking if x86_64-pld-linux-gnux32-gcc supports -fno-rtti -fno-exceptions... no checking for x86_64-pld-linux-gnux32-gcc option to produce PIC... -fPIC -DPIC checking if x86_64-pld-linux-gnux32-gcc PIC flag -fPIC -DPIC works... yes checking if x86_64-pld-linux-gnux32-gcc static flag -static works... yes checking if x86_64-pld-linux-gnux32-gcc supports -c -o file.o... yes checking if x86_64-pld-linux-gnux32-gcc supports -c -o file.o... (cached) yes checking whether the x86_64-pld-linux-gnux32-gcc linker (/usr/bin/ld -m elf32_x86_64) supports shared libraries... yes checking whether -lc should be explicitly linked in... no checking dynamic linker characteristics... GNU/Linux ld.so checking how to hardcode library paths into programs... immediate checking whether stripping libraries is possible... yes checking if libtool supports shared libraries... yes checking whether to build shared libraries... yes checking whether to build static libraries... no checking linux/netfilter/x_tables.h usability... yes checking linux/netfilter/x_tables.h presence... yes checking for linux/netfilter/x_tables.h... yes checking for x86_64-pld-linux-gnux32-pkg-config... /usr/bin/x86_64-pld-linux-gnux32-pkg-config checking pkg-config is at least version 0.9.0... yes checking for libxtables... yes checking Xtables module directory... /usr/libx32/xtables checking that generated files are newer than configure... done configure: creating ./config.status config.status: creating Makefile config.status: creating Makefile.iptrules config.status: creating Makefile.mans config.status: creating geoip/Makefile config.status: creating extensions/Makefile config.status: creating extensions/ACCOUNT/Makefile config.status: creating extensions/pknock/Makefile config.status: creating config.h config.status: executing depfiles commands config.status: executing libtool commands + srcdir=/tmp/B.Y7FwVw/BUILD/xtables-addons-3.13 + cd extensions + compile 'XA_ABSTOPSRCDIR=/tmp/B.Y7FwVw/BUILD/xtables-addons-3.13' + typeset 'L=<' PATCH_SH + set -e -x + '[' -r /usr/src/linux/.config ']' + rm -rf o + install -d o/include/linux o/include/generated o/arch/x86/include o/arch/powerpc/lib + ln -sf /usr/src/linux/.config o/.config + ln -sf /usr/src/linux/Module.symvers o/Module.symvers + '[' -f /usr/src/linux/include/generated/autoconf.h ']' + ln -sf /usr/src/linux/include/generated/autoconf.h o/include/generated/autoconf.h + ln -s ../generated/autoconf.h o/include/linux/autoconf.h + '[' -d /usr/src/linux/arch/x86/include/generated ']' + ln -s /usr/src/linux/arch/x86/include/generated o/arch/x86/include + set +x + install -d o/include/config + touch o/include/config/MARKER + ln -sf /usr/src/linux/include/config/auto.conf o/include/config/auto.conf + ln -sf /usr/src/linux/scripts o/scripts + /usr/bin/make -Otarget -j9 -C /usr/src/linux clean 'RCS_FIND_IGNORE=-name '\''*.[ks]o'\'' -o' 'XA_ABSTOPSRCDIR=/tmp/B.Y7FwVw/BUILD/xtables-addons-3.13' 'M=/tmp/B.Y7FwVw/BUILD/xtables-addons-3.13/extensions' 'HOSTCC=x86_64-pld-linux-gnux32-gcc' 'SYSSRC=/usr/src/linux' 'SYSOUT=/tmp/B.Y7FwVw/BUILD/xtables-addons-3.13/extensions/o' 'ARCH=x86_64' + CC=x86_64-pld-linux-gnux32-gcc + /usr/bin/make -Otarget -j9 -C /usr/src/linux modules 'XA_ABSTOPSRCDIR=/tmp/B.Y7FwVw/BUILD/xtables-addons-3.13' 'M=/tmp/B.Y7FwVw/BUILD/xtables-addons-3.13/extensions' 'CONSTIFY_PLUGIN=' 'HOSTCC=x86_64-pld-linux-gnux32-gcc' 'SYSSRC=/usr/src/linux' 'SYSOUT=/tmp/B.Y7FwVw/BUILD/xtables-addons-3.13/extensions/o' 'ARCH=x86_64' CC [M] /tmp/B.Y7FwVw/BUILD/xtables-addons-3.13/extensions/xt_ECHO.o /tmp/B.Y7FwVw/BUILD/xtables-addons-3.13/extensions/xt_ECHO.c: In function 'echo_tg6': /tmp/B.Y7FwVw/BUILD/xtables-addons-3.13/extensions/xt_ECHO.c:100:55: error: passing argument 2 of 'security_skb_classify_flow' from incompatible pointer type [-Werror=incompatible-pointer-types] 100 | security_skb_classify_flow((struct sk_buff *)oldskb, flowi6_to_flowi(&fl)); | ^~~~~~~~~~~~~~~~~~~~ | | | struct flowi * In file included from ./include/net/scm.h:8, from ./include/linux/netlink.h:9, from ./include/uapi/linux/neighbour.h:6, from ./include/linux/netdevice.h:45, from ./include/net/inet_sock.h:19, from ./include/linux/udp.h:16, from /tmp/B.Y7FwVw/BUILD/xtables-addons-3.13/extensions/xt_ECHO.c:15: ./include/linux/security.h:1647:75: note: expected 'struct flowi_common *' but argument is of type 'struct flowi *' 1647 | void security_skb_classify_flow(struct sk_buff *skb, struct flowi_common *flic); | ~~~~~~~~~~~~~~~~~~~~~^~~~ cc1: some warnings being treated as errors make[1]: *** [scripts/Makefile.build:279: /tmp/B.Y7FwVw/BUILD/xtables-addons-3.13/extensions/xt_ECHO.o] Error 1 make[1]: *** Waiting for unfinished jobs.... CC [M] /tmp/B.Y7FwVw/BUILD/xtables-addons-3.13/extensions/xt_DHCPMAC.o CC [M] /tmp/B.Y7FwVw/BUILD/xtables-addons-3.13/extensions/xt_CHAOS.o CC [M] /tmp/B.Y7FwVw/BUILD/xtables-addons-3.13/extensions/xt_IPMARK.o CC [M] /tmp/B.Y7FwVw/BUILD/xtables-addons-3.13/extensions/pknock/xt_pknock.o In file included from ./include/linux/kernel.h:15, from ./include/linux/list.h:9, from ./include/linux/module.h:12, from /tmp/B.Y7FwVw/BUILD/xtables-addons-3.13/extensions/pknock/xt_pknock.c:10: /tmp/B.Y7FwVw/BUILD/xtables-addons-3.13/extensions/pknock/xt_pknock.c: In function 'pknock_seq_show': /tmp/B.Y7FwVw/BUILD/xtables-addons-3.13/extensions/pknock/xt_pknock.c:251:20: error: implicit declaration of function 'get_seconds' [-Werror=implicit-function-declaration] 251 | if (time_before(get_seconds(), peer->login_sec + | ^~~~~~~~~~~ ./include/linux/typecheck.h:11:9: note: in definition of macro 'typecheck' 11 | typeof(x) __dummy2; \ | ^ ./include/linux/jiffies.h:108:26: note: in expansion of macro 'time_after' 108 | #define time_before(a,b) time_after(b,a) | ^~~~~~~~~~ /tmp/B.Y7FwVw/BUILD/xtables-addons-3.13/extensions/pknock/xt_pknock.c:251:8: note: in expansion of macro 'time_before' 251 | if (time_before(get_seconds(), peer->login_sec + | ^~~~~~~~~~~ ./include/linux/typecheck.h:12:18: warning: comparison of distinct pointer types lacks a cast 12 | (void)(&__dummy == &__dummy2); \ | ^~ ./include/linux/jiffies.h:106:3: note: in expansion of macro 'typecheck' 106 | typecheck(unsigned long, b) && \ | ^~~~~~~~~ ./include/linux/jiffies.h:108:26: note: in expansion of macro 'time_after' 108 | #define time_before(a,b) time_after(b,a) | ^~~~~~~~~~ /tmp/B.Y7FwVw/BUILD/xtables-addons-3.13/extensions/pknock/xt_pknock.c:251:8: note: in expansion of macro 'time_before' 251 | if (time_before(get_seconds(), peer->login_sec + | ^~~~~~~~~~~ /tmp/B.Y7FwVw/BUILD/xtables-addons-3.13/extensions/pknock/xt_pknock.c: In function 'autoclose_time_passed': ./include/linux/typecheck.h:12:18: warning: comparison of distinct pointer types lacks a cast 12 | (void)(&__dummy == &__dummy2); \ | ^~ ./include/linux/jiffies.h:105:3: note: in expansion of macro 'typecheck' 105 | (typecheck(unsigned long, a) && \ | ^~~~~~~~~ /tmp/B.Y7FwVw/BUILD/xtables-addons-3.13/extensions/pknock/xt_pknock.c:315:48: note: in expansion of macro 'time_after' 315 | return peer != NULL && autoclose_time != 0 && time_after(get_seconds(), | ^~~~~~~~~~ cc1: some warnings being treated as errors make[2]: *** [scripts/Makefile.build:279: /tmp/B.Y7FwVw/BUILD/xtables-addons-3.13/extensions/pknock/xt_pknock.o] Error 1 make[1]: *** [scripts/Makefile.build:496: /tmp/B.Y7FwVw/BUILD/xtables-addons-3.13/extensions/pknock] Error 2 CC [M] /tmp/B.Y7FwVw/BUILD/xtables-addons-3.13/extensions/xt_DELUDE.o CC [M] /tmp/B.Y7FwVw/BUILD/xtables-addons-3.13/extensions/xt_DNETMAP.o CC [M] /tmp/B.Y7FwVw/BUILD/xtables-addons-3.13/extensions/ACCOUNT/xt_ACCOUNT.o CC [M] /tmp/B.Y7FwVw/BUILD/xtables-addons-3.13/extensions/compat_xtables.o make: *** [Makefile:1800: /tmp/B.Y7FwVw/BUILD/xtables-addons-3.13/extensions] Error 2 error: Bad exit status from /tmp/B.Y7FwVw/BUILD/tmp/rpm-tmp.k0iqXR (%build) RPM build errors: line 46: It's not recommended to have unversioned Obsoletes: Obsoletes: iptables-ipp2p Could not canonicalize hostname: naiad Bad exit status from /tmp/B.Y7FwVw/BUILD/tmp/rpm-tmp.k0iqXR (%build) ended at: Tue Feb 23 13:41:41 2021, done in 0:00:10.262338 error: No files produced. + chmod -R u+rwX /tmp/B.Y7FwVw/BUILD + rm -rf /tmp/B.Y7FwVw/tmp /tmp/B.Y7FwVw/BUILD + rm -rf /tmp/B.Y7FwVw Begin-PLD-Builder-Info Build-Time: user:24.40s sys:11.14s real:24.66s (faults io:6 non-io:2128818) End-PLD-Builder-Info
[Back to list of logs] [View rpm -qa of builder]