FailedOk

th/SRPMS[OK]
th/x32[OK]
th/i686[OK]
th/x86_64[OK]

ac/SRPMS[OK]
ac/i386[OK]
ac/i586[OK]
ac/i686[OK]
ac/alpha[OK]
ac/amd64[OK]
ac/athlon[OK]
ac/ppc[OK]
ac/sparc[OK]
ac/sparc64[OK]

Advanced Search
main()
Powered by PLD Linux
(c) 2002-2017 PLD Team
$Revision: 1.37 $
Powered by brain.
Your IP: 54.224.99.49

zxing-cpp 4efeb5e1-8ba0-43bd-9f3f-382d2a22adda

Status:Failed
Source URL:ftp://buildlogs.pld-linux.org/th/x32/FAIL/zxing-cpp,4efeb5e1-8ba0-43bd-9f3f-382d2a22adda.bz2
text/plain URL:View!
rpm -qa of builder:View!
Date:2017/04/17 10:01:09
Runtime:0:00:19.615013

Toc:

  • prep
  • Executing(%prep): /bin/sh -e /tmp/B.DiEiOw/BUILD/tmp/rpm-tmp.689
  • build
  • Executing(%build): /bin/sh -e /tmp/B.DiEiOw/BUILD/tmp/rpm-tmp.689
  • error 1
  • libzxing.so.0: undefined reference to `cv::fastFree(void*)'
  • error 2
  • libzxing.so.0: undefined reference to `cv::Mat::copyTo(cv::_OutputArray const&) const'
  • error 3
  • libzxing.so.0: undefined reference to `cv::Mat::deallocate()'
  • error 4
  • collect2: error: ld returned 1 exit status
  • error 5
  • libzxing.so.0: undefined reference to `cv::fastFree(void*)'
  • error 6
  • libzxing.so.0: undefined reference to `cv::Mat::copyTo(cv::_OutputArray const&) const'
  • error 7
  • libzxing.so.0: undefined reference to `cv::Mat::deallocate()'
  • error 8
  • collect2: error: ld returned 1 exit status
  • error 9
  • error: Bad exit status from /tmp/B.DiEiOw/BUILD/tmp/rpm-tmp.689 (%build)
  • error 10
  • RPM build errors:
  • error 11
  • error: No files produced.

Content:

request from: baggins
checking if we should skip the build
started at: Mon Apr 17 10:00:46 2017
fetching https://srcbuilder.pld-linux.org/th//srpms/4efeb5e1-8ba0-43bd-9f3f-382d2a22adda/zxing-cpp-2.3.0-0.20161123.1.src.rpm
fetched 322848 bytes, 479.0 K/s
installing srpm: zxing-cpp-2.3.0-0.20161123.1.src.rpm
+ install -d /tmp/B.DiEiOw/BUILD /tmp/B.DiEiOw/RPMS
+ LC_ALL=en_US.UTF-8
+ rpm -qp --changelog zxing-cpp-2.3.0-0.20161123.1.src.rpm
* Mon Apr 17 2017 PLD Linux Team <feedback@pld-linux.org>
- For complete changelog see: http://git.pld-linux.org/?p=packages/zxing-cpp.git;a=log;h=master
* Sun Apr 16 2017 Jakub Bogusz <qboosh@pld-linux.org> 5a042a4
- new + rpm -Uhv --nodeps --define '_topdir /tmp/B.DiEiOw' --define '_specdir %{_topdir}' --define '_sourcedir %{_specdir}' --define '_rpmdir %{_topdir}/RPMS' --define '_builddir %{_topdir}/BUILD' zxing-cpp-2.3.0-0.20161123.1.src.rpm Preparing... ################################################## zxing-cpp ################################################## + rm -f zxing-cpp-2.3.0-0.20161123.1.src.rpm + install -m 700 -d /tmp/B.DiEiOw/BUILD/tmp + TMPDIR=/tmp/B.DiEiOw/BUILD/tmp + exec nice -n 0 rpmbuild -bp --short-circuit --nodeps --define '_topdir /tmp/B.DiEiOw' --define '_specdir %{_topdir}' --define '_sourcedir %{_specdir}' --define '_rpmdir %{_topdir}/RPMS' --define '_builddir %{_topdir}/BUILD' --target x32-pld-linux --define 'prep exit 0' /tmp/B.DiEiOw/zxing-cpp.spec Building target platforms: x32-pld-linux checking BuildConflict-ing packages no BuildConflicts found checking BR rpm: Building target platforms: x32-pld-linux no BR needed building RPM using: set -ex; : build-id: 4efeb5e1-8ba0-43bd-9f3f-382d2a22adda; TMPDIR=/tmp/B.DiEiOw/BUILD/tmp exec nice -n 0 rpmbuild -bb --define '_smp_mflags -j9' --define '_make_opts -Otarget' --define '_pld_builder 1' --define '_topdir /tmp/B.DiEiOw' --define '_specdir %{_topdir}' --define '_sourcedir %{_specdir}' --define '_rpmdir %{_topdir}/RPMS' --define '_builddir %{_topdir}/BUILD' --target x32-pld-linux /tmp/B.DiEiOw/zxing-cpp.spec + : build-id: 4efeb5e1-8ba0-43bd-9f3f-382d2a22adda + TMPDIR=/tmp/B.DiEiOw/BUILD/tmp + exec nice -n 0 rpmbuild -bb --define '_smp_mflags -j9' --define '_make_opts -Otarget' --define '_pld_builder 1' --define '_topdir /tmp/B.DiEiOw' --define '_specdir %{_topdir}' --define '_sourcedir %{_specdir}' --define '_rpmdir %{_topdir}/RPMS' --define '_builddir %{_topdir}/BUILD' --target x32-pld-linux /tmp/B.DiEiOw/zxing-cpp.spec Building target platforms: x32-pld-linux Executing(%prep): /bin/sh -e /tmp/B.DiEiOw/BUILD/tmp/rpm-tmp.689 + umask 022 + cd /tmp/B.DiEiOw/BUILD + cd /tmp/B.DiEiOw/BUILD + rm -rf zxing-cpp-6b3cbe02a332bff0f5ba0416f221d3d3876afdc2 + /usr/bin/gzip -dc /tmp/B.DiEiOw/zxing-cpp-20161123.tar.gz + /bin/tar -xf - + STATUS=0 + '[' 0 -ne 0 ']' + cd zxing-cpp-6b3cbe02a332bff0f5ba0416f221d3d3876afdc2 + /bin/id -u + '[' 1000 '=' 0 ']' + /bin/id -u + '[' 1000 '=' 0 ']' + /bin/chmod -Rf a+rX,u+w,g-w,o-w . + echo 'Patch #0 (zxing-cpp-cmake.patch):' Patch #0 (zxing-cpp-cmake.patch): + '[' -f /tmp/B.DiEiOw/zxing-cpp-cmake.patch ']' + /bin/cat /tmp/B.DiEiOw/zxing-cpp-cmake.patch + /usr/bin/patch -s -p1 + exit 0 Executing(%build): /bin/sh -e /tmp/B.DiEiOw/BUILD/tmp/rpm-tmp.689 HOME=/home/users/builder PATH=/home/users/builder/GNUstep/Tools:/usr/local/bin:/usr/bin:/bin TMPDIR=/tmp/B.DiEiOw/BUILD/tmp + umask 022 + cd /tmp/B.DiEiOw/BUILD + cd zxing-cpp-6b3cbe02a332bff0f5ba0416f221d3d3876afdc2 + install -d build + cd build + CC=x86_64-pld-linux-gnux32-gcc CXX=x86_64-pld-linux-gnux32-g++ CPPFLAGS= /usr/bin/cmake '-DCMAKE_VERBOSE_MAKEFILE=ON' '-DCMAKE_BUILD_TYPE=PLD' '-DCMAKE_INSTALL_BINDIR:PATH=/usr/bin' '-DCMAKE_INSTALL_SBINDIR:PATH=/usr/sbin' '-DCMAKE_INSTALL_LIBEXECDIR:PATH=/usr/libx32' '-DCMAKE_INSTALL_SYSCONFDIR:PATH=/etc' '-DCMAKE_INSTALL_SHAREDSTATEDIRPATH:PATH=/var/lib' '-DCMAKE_INSTALL_LOCALSTATEDIRPATH:PATH=/var' '-DCMAKE_INSTALL_LIBDIR:PATH=/usr/libx32' '-DCMAKE_INSTALL_INCLUDEDIR:PATH=/usr/include' '-DCMAKE_INSTALL_OLDINCLUDEDIR:PATH=/usr/include' '-DCMAKE_INSTALL_DATAROOTDIR:PATH=/usr/share' '-DCMAKE_INSTALL_DATADIR:PATH=/usr/share' '-DCMAKE_INSTALL_INFODIR:PATH=/usr/share/info' '-DCMAKE_INSTALL_LOCALEDIR:PATH=/usr/share/locale' '-DCMAKE_INSTALL_MANDIR:PATH=/usr/share/man' '-DCMAKE_INSTALL_DOCDIR:PATH=/usr/share/doc' '-DCMAKE_INSTALL_PREFIX:PATH=/usr' '-DSYSCONF_INSTALL_DIR:PATH=/etc' '-DCMAKE_CXX_FLAGS_PLD=-O2 -fwrapv -pipe -Wformat -Werror=format-security -gdwarf-4 -fno-debug-types-section -fvar-tracking-assignments -g2 -Wp,-D_FORTIFY_SOURCE=2 -fstack-protector-strong --param=ssp-buffer-size=4 -fPIC -mtune=generic -march=x86-64 -gdwarf-4 -fno-debug-types-section -fvar-tracking-assignments -g2 -DNDEBUG -DQT_NO_DEBUG' '-DCMAKE_C_FLAGS_PLD=-O2 -fwrapv -pipe -Wformat -Werror=format-security -gdwarf-4 -fno-debug-types-section -fvar-tracking-assignments -g2 -Wp,-D_FORTIFY_SOURCE=2 -fstack-protector-strong --param=ssp-buffer-size=4 -fPIC -mtune=generic -march=x86-64 -gdwarf-4 -fno-debug-types-section -fvar-tracking-assignments -g2 -DNDEBUG -DQT_NO_DEBUG' '-DCMAKE_Fortran_FLAGS_PLD=-O2 -fwrapv -pipe -Wformat -Werror=format-security -gdwarf-4 -fno-debug-types-section -fvar-tracking-assignments -g2 -Wp,-D_FORTIFY_SOURCE=2 -fstack-protector-strong --param=ssp-buffer-size=4 -fPIC -mtune=generic -march=x86-64 -gdwarf-4 -fno-debug-types-section -fvar-tracking-assignments -g2 -DNDEBUG -DQT_NO_DEBUG' '-DCMAKE_EXE_LINKER_FLAGS_PLD=-Wl,--as-needed -Wl,--no-copy-dt-needed-entries -Wl,-z,relro -Wl,-z,combreloc ' '-DCMAKE_SHARED_LINKER_FLAGS_PLD=-Wl,--as-needed -Wl,--no-copy-dt-needed-entries -Wl,-z,relro -Wl,-z,combreloc ' '-DCMAKE_MODULE_LINKER_FLAGS_PLD=-Wl,--as-needed -Wl,--no-copy-dt-needed-entries -Wl,-z,relro -Wl,-z,combreloc ' '-DLIB_SUFFIX=x32' '-DBUILD_SHARED_LIBS:BOOL=ON' .. -- The C compiler identification is GNU 6.3.0 -- The CXX compiler identification is GNU 6.3.0 -- Check for working C compiler: /usr/bin/x86_64-pld-linux-gnux32-gcc -- Check for working C compiler: /usr/bin/x86_64-pld-linux-gnux32-gcc -- works -- Detecting C compiler ABI info -- Detecting C compiler ABI info - done -- Detecting C compile features -- Detecting C compile features - done -- Check for working CXX compiler: /usr/bin/x86_64-pld-linux-gnux32-g++ -- Check for working CXX compiler: /usr/bin/x86_64-pld-linux-gnux32-g++ -- works -- Detecting CXX compiler ABI info -- Detecting CXX compiler ABI info - done -- Detecting CXX compile features -- Detecting CXX compile features - done -- Performing Test ICONV_SECOND_ARGUMENT_IS_CONST -- Performing Test ICONV_SECOND_ARGUMENT_IS_CONST - Success -- Found Iconv: /usr/libx32/libc.so -- Configuring done -- Generating done CMake Warning: Manually-specified variables were not used by the project: CMAKE_C_FLAGS_PLD CMAKE_Fortran_FLAGS_PLD CMAKE_INSTALL_BINDIR CMAKE_INSTALL_DATADIR CMAKE_INSTALL_DATAROOTDIR CMAKE_INSTALL_DOCDIR CMAKE_INSTALL_INCLUDEDIR CMAKE_INSTALL_INFODIR CMAKE_INSTALL_LIBDIR CMAKE_INSTALL_LIBEXECDIR CMAKE_INSTALL_LOCALEDIR CMAKE_INSTALL_LOCALSTATEDIRPATH CMAKE_INSTALL_MANDIR CMAKE_INSTALL_OLDINCLUDEDIR CMAKE_INSTALL_SBINDIR CMAKE_INSTALL_SHAREDSTATEDIRPATH CMAKE_INSTALL_SYSCONFDIR CMAKE_MODULE_LINKER_FLAGS_PLD SYSCONF_INSTALL_DIR -- Build files have been written to: /tmp/B.DiEiOw/BUILD/zxing-cpp-6b3cbe02a332bff0f5ba0416f221d3d3876afdc2/build + /usr/bin/make -Otarget -j9 /usr/bin/cmake -H/tmp/B.DiEiOw/BUILD/zxing-cpp-6b3cbe02a332bff0f5ba0416f221d3d3876afdc2 -B/tmp/B.DiEiOw/BUILD/zxing-cpp-6b3cbe02a332bff0f5ba0416f221d3d3876afdc2/build --check-build-system CMakeFiles/Makefile.cmake 0 /usr/bin/cmake -E cmake_progress_start /tmp/B.DiEiOw/BUILD/zxing-cpp-6b3cbe02a332bff0f5ba0416f221d3d3876afdc2/build/CMakeFiles /tmp/B.DiEiOw/BUILD/zxing-cpp-6b3cbe02a332bff0f5ba0416f221d3d3876afdc2/build/CMakeFiles/progress.marks /usr/bin/make -f CMakeFiles/Makefile2 all /usr/bin/make -f CMakeFiles/libzxing.dir/build.make CMakeFiles/libzxing.dir/depend make[2]: Entering directory '/tmp/B.DiEiOw/BUILD/zxing-cpp-6b3cbe02a332bff0f5ba0416f221d3d3876afdc2/build' cd /tmp/B.DiEiOw/BUILD/zxing-cpp-6b3cbe02a332bff0f5ba0416f221d3d3876afdc2/build && /usr/bin/cmake -E cmake_depends "Unix Makefiles" /tmp/B.DiEiOw/BUILD/zxing-cpp-6b3cbe02a332bff0f5ba0416f221d3d3876afdc2 /tmp/B.DiEiOw/BUILD/zxing-cpp-6b3cbe02a332bff0f5ba0416f221d3d3876afdc2 /tmp/B.DiEiOw/BUILD/zxing-cpp-6b3cbe02a332bff0f5ba0416f221d3d3876afdc2/build /tmp/B.DiEiOw/BUILD/zxing-cpp-6b3cbe02a332bff0f5ba0416f221d3d3876afdc2/build /tmp/B.DiEiOw/BUILD/zxing-cpp-6b3cbe02a332bff0f5ba0416f221d3d3876afdc2/build/CMakeFiles/libzxing.dir/DependInfo.cmake --color= Scanning dependencies of target libzxing make[2]: Leaving directory '/tmp/B.DiEiOw/BUILD/zxing-cpp-6b3cbe02a332bff0f5ba0416f221d3d3876afdc2/build' /usr/bin/make -f CMakeFiles/libzxing.dir/build.make CMakeFiles/libzxing.dir/build make[2]: Entering directory '/tmp/B.DiEiOw/BUILD/zxing-cpp-6b3cbe02a332bff0f5ba0416f221d3d3876afdc2/build' [ 0%] Building CXX object CMakeFiles/libzxing.dir/core/src/zxing/BarcodeFormat.cpp.o /usr/bin/x86_64-pld-linux-gnux32-g++ -Dlibzxing_EXPORTS -I/usr/include/opencv -I/tmp/B.DiEiOw/BUILD/zxing-cpp-6b3cbe02a332bff0f5ba0416f221d3d3876afdc2/./opencv/src -I/tmp/B.DiEiOw/BUILD/zxing-cpp-6b3cbe02a332bff0f5ba0416f221d3d3876afdc2/./core/src -O2 -fwrapv -pipe -Wformat -Werror=format-security -gdwarf-4 -fno-debug-types-section -fvar-tracking-assignments -g2 -Wp,-D_FORTIFY_SOURCE=2 -fstack-protector-strong --param=ssp-buffer-size=4 -fPIC -mtune=generic -march=x86-64 -gdwarf-4 -fno-debug-types-section -fvar-tracking-assignments -g2 -DNDEBUG -DQT_NO_DEBUG -fPIC -o CMakeFiles/libzxing.dir/core/src/zxing/BarcodeFormat.cpp.o -c /tmp/B.DiEiOw/BUILD/zxing-cpp-6b3cbe02a332bff0f5ba0416f221d3d3876afdc2/core/src/zxing/BarcodeFormat.cpp make[2]: Leaving directory '/tmp/B.DiEiOw/BUILD/zxing-cpp-6b3cbe02a332bff0f5ba0416f221d3d3876afdc2/build' make[2]: Entering directory '/tmp/B.DiEiOw/BUILD/zxing-cpp-6b3cbe02a332bff0f5ba0416f221d3d3876afdc2/build' [ 3%] Building CXX object CMakeFiles/libzxing.dir/core/src/zxing/ChecksumException.cpp.o /usr/bin/x86_64-pld-linux-gnux32-g++ -Dlibzxing_EXPORTS -I/usr/include/opencv -I/tmp/B.DiEiOw/BUILD/zxing-cpp-6b3cbe02a332bff0f5ba0416f221d3d3876afdc2/./opencv/src -I/tmp/B.DiEiOw/BUILD/zxing-cpp-6b3cbe02a332bff0f5ba0416f221d3d3876afdc2/./core/src -O2 -fwrapv -pipe -Wformat -Werror=format-security -gdwarf-4 -fno-debug-types-section -fvar-tracking-assignments -g2 -Wp,-D_FORTIFY_SOURCE=2 -fstack-protector-strong --param=ssp-buffer-size=4 -fPIC -mtune=generic -march=x86-64 -gdwarf-4 -fno-debug-types-section -fvar-tracking-assignments -g2 -DNDEBUG -DQT_NO_DEBUG -fPIC -o CMakeFiles/libzxing.dir/core/src/zxing/ChecksumException.cpp.o -c /tmp/B.DiEiOw/BUILD/zxing-cpp-6b3cbe02a332bff0f5ba0416f221d3d3876afdc2/core/src/zxing/ChecksumException.cpp make[2]: Leaving directory '/tmp/B.DiEiOw/BUILD/zxing-cpp-6b3cbe02a332bff0f5ba0416f221d3d3876afdc2/build' make[2]: Entering directory '/tmp/B.DiEiOw/BUILD/zxing-cpp-6b3cbe02a332bff0f5ba0416f221d3d3876afdc2/build' [ 4%] Building CXX object CMakeFiles/libzxing.dir/core/src/zxing/Exception.cpp.o /usr/bin/x86_64-pld-linux-gnux32-g++ -Dlibzxing_EXPORTS -I/usr/include/opencv -I/tmp/B.DiEiOw/BUILD/zxing-cpp-6b3cbe02a332bff0f5ba0416f221d3d3876afdc2/./opencv/src -I/tmp/B.DiEiOw/BUILD/zxing-cpp-6b3cbe02a332bff0f5ba0416f221d3d3876afdc2/./core/src -O2 -fwrapv -pipe -Wformat -Werror=format-security -gdwarf-4 -fno-debug-types-section -fvar-tracking-assignments -g2 -Wp,-D_FORTIFY_SOURCE=2 -fstack-protector-strong --param=ssp-buffer-size=4 -fPIC -mtune=generic -march=x86-64 -gdwarf-4 -fno-debug-types-section -fvar-tracking-assignments -g2 -DNDEBUG -DQT_NO_DEBUG -fPIC -o CMakeFiles/libzxing.dir/core/src/zxing/Exception.cpp.o -c /tmp/B.DiEiOw/BUILD/zxing-cpp-6b3cbe02a332bff0f5ba0416f221d3d3876afdc2/core/src/zxing/Exception.cpp make[2]: Leaving directory '/tmp/B.DiEiOw/BUILD/zxing-cpp-6b3cbe02a332bff0f5ba0416f221d3d3876afdc2/build' make[2]: Entering directory '/tmp/B.DiEiOw/BUILD/zxing-cpp-6b3cbe02a332bff0f5ba0416f221d3d3876afdc2/build' [ 5%] Building CXX object CMakeFiles/libzxing.dir/core/src/zxing/FormatException.cpp.o /usr/bin/x86_64-pld-linux-gnux32-g++ -Dlibzxing_EXPORTS -I/usr/include/opencv -I/tmp/B.DiEiOw/BUILD/zxing-cpp-6b3cbe02a332bff0f5ba0416f221d3d3876afdc2/./opencv/src -I/tmp/B.DiEiOw/BUILD/zxing-cpp-6b3cbe02a332bff0f5ba0416f221d3d3876afdc2/./core/src -O2 -fwrapv -pipe -Wformat -Werror=format-security -gdwarf-4 -fno-debug-types-section -fvar-tracking-assignments -g2 -Wp,-D_FORTIFY_SOURCE=2 -fstack-protector-strong --param=ssp-buffer-size=4 -fPIC -mtune=generic -march=x86-64 -gdwarf-4 -fno-debug-types-section -fvar-tracking-assignments -g2 -DNDEBUG -DQT_NO_DEBUG -fPIC -o CMakeFiles/libzxing.dir/core/src/zxing/FormatException.cpp.o -c /tmp/B.DiEiOw/BUILD/zxing-cpp-6b3cbe02a332bff0f5ba0416f221d3d3876afdc2/core/src/zxing/FormatException.cpp make[2]: Leaving directory '/tmp/B.DiEiOw/BUILD/zxing-cpp-6b3cbe02a332bff0f5ba0416f221d3d3876afdc2/build' make[2]: Entering directory '/tmp/B.DiEiOw/BUILD/zxing-cpp-6b3cbe02a332bff0f5ba0416f221d3d3876afdc2/build' [ 4%] Building CXX object CMakeFiles/libzxing.dir/core/src/zxing/DecodeHints.cpp.o /usr/bin/x86_64-pld-linux-gnux32-g++ -Dlibzxing_EXPORTS -I/usr/include/opencv -I/tmp/B.DiEiOw/BUILD/zxing-cpp-6b3cbe02a332bff0f5ba0416f221d3d3876afdc2/./opencv/src -I/tmp/B.DiEiOw/BUILD/zxing-cpp-6b3cbe02a332bff0f5ba0416f221d3d3876afdc2/./core/src -O2 -fwrapv -pipe -Wformat -Werror=format-security -gdwarf-4 -fno-debug-types-section -fvar-tracking-assignments -g2 -Wp,-D_FORTIFY_SOURCE=2 -fstack-protector-strong --param=ssp-buffer-size=4 -fPIC -mtune=generic -march=x86-64 -gdwarf-4 -fno-debug-types-section -fvar-tracking-assignments -g2 -DNDEBUG -DQT_NO_DEBUG -fPIC -o CMakeFiles/libzxing.dir/core/src/zxing/DecodeHints.cpp.o -c /tmp/B.DiEiOw/BUILD/zxing-cpp-6b3cbe02a332bff0f5ba0416f221d3d3876afdc2/core/src/zxing/DecodeHints.cpp make[2]: Leaving directory '/tmp/B.DiEiOw/BUILD/zxing-cpp-6b3cbe02a332bff0f5ba0416f221d3d3876afdc2/build' make[2]: Entering directory '/tmp/B.DiEiOw/BUILD/zxing-cpp-6b3cbe02a332bff0f5ba0416f221d3d3876afdc2/build' [ 1%] Building CXX object CMakeFiles/libzxing.dir/core/src/zxing/BinaryBitmap.cpp.o /usr/bin/x86_64-pld-linux-gnux32-g++ -Dlibzxing_EXPORTS -I/usr/include/opencv -I/tmp/B.DiEiOw/BUILD/zxing-cpp-6b3cbe02a332bff0f5ba0416f221d3d3876afdc2/./opencv/src -I/tmp/B.DiEiOw/BUILD/zxing-cpp-6b3cbe02a332bff0f5ba0416f221d3d3876afdc2/./core/src -O2 -fwrapv -pipe -Wformat -Werror=format-security -gdwarf-4 -fno-debug-types-section -fvar-tracking-assignments -g2 -Wp,-D_FORTIFY_SOURCE=2 -fstack-protector-strong --param=ssp-buffer-size=4 -fPIC -mtune=generic -march=x86-64 -gdwarf-4 -fno-debug-types-section -fvar-tracking-assignments -g2 -DNDEBUG -DQT_NO_DEBUG -fPIC -o CMakeFiles/libzxing.dir/core/src/zxing/BinaryBitmap.cpp.o -c /tmp/B.DiEiOw/BUILD/zxing-cpp-6b3cbe02a332bff0f5ba0416f221d3d3876afdc2/core/src/zxing/BinaryBitmap.cpp make[2]: Leaving directory '/tmp/B.DiEiOw/BUILD/zxing-cpp-6b3cbe02a332bff0f5ba0416f221d3d3876afdc2/build' make[2]: Entering directory '/tmp/B.DiEiOw/BUILD/zxing-cpp-6b3cbe02a332bff0f5ba0416f221d3d3876afdc2/build' [ 2%] Building CXX object CMakeFiles/libzxing.dir/core/src/zxing/Binarizer.cpp.o /usr/bin/x86_64-pld-linux-gnux32-g++ -Dlibzxing_EXPORTS -I/usr/include/opencv -I/tmp/B.DiEiOw/BUILD/zxing-cpp-6b3cbe02a332bff0f5ba0416f221d3d3876afdc2/./opencv/src -I/tmp/B.DiEiOw/BUILD/zxing-cpp-6b3cbe02a332bff0f5ba0416f221d3d3876afdc2/./core/src -O2 -fwrapv -pipe -Wformat -Werror=format-security -gdwarf-4 -fno-debug-types-section -fvar-tracking-assignments -g2 -Wp,-D_FORTIFY_SOURCE=2 -fstack-protector-strong --param=ssp-buffer-size=4 -fPIC -mtune=generic -march=x86-64 -gdwarf-4 -fno-debug-types-section -fvar-tracking-assignments -g2 -DNDEBUG -DQT_NO_DEBUG -fPIC -o CMakeFiles/libzxing.dir/core/src/zxing/Binarizer.cpp.o -c /tmp/B.DiEiOw/BUILD/zxing-cpp-6b3cbe02a332bff0f5ba0416f221d3d3876afdc2/core/src/zxing/Binarizer.cpp make[2]: Leaving directory '/tmp/B.DiEiOw/BUILD/zxing-cpp-6b3cbe02a332bff0f5ba0416f221d3d3876afdc2/build' make[2]: Entering directory '/tmp/B.DiEiOw/BUILD/zxing-cpp-6b3cbe02a332bff0f5ba0416f221d3d3876afdc2/build' [ 6%] Building CXX object CMakeFiles/libzxing.dir/core/src/zxing/InvertedLuminanceSource.cpp.o /usr/bin/x86_64-pld-linux-gnux32-g++ -Dlibzxing_EXPORTS -I/usr/include/opencv -I/tmp/B.DiEiOw/BUILD/zxing-cpp-6b3cbe02a332bff0f5ba0416f221d3d3876afdc2/./opencv/src -I/tmp/B.DiEiOw/BUILD/zxing-cpp-6b3cbe02a332bff0f5ba0416f221d3d3876afdc2/./core/src -O2 -fwrapv -pipe -Wformat -Werror=format-security -gdwarf-4 -fno-debug-types-section -fvar-tracking-assignments -g2 -Wp,-D_FORTIFY_SOURCE=2 -fstack-protector-strong --param=ssp-buffer-size=4 -fPIC -mtune=generic -march=x86-64 -gdwarf-4 -fno-debug-types-section -fvar-tracking-assignments -g2 -DNDEBUG -DQT_NO_DEBUG -fPIC -o CMakeFiles/libzxing.dir/core/src/zxing/InvertedLuminanceSource.cpp.o -c /tmp/B.DiEiOw/BUILD/zxing-cpp-6b3cbe02a332bff0f5ba0416f221d3d3876afdc2/core/src/zxing/InvertedLuminanceSource.cpp make[2]: Leaving directory '/tmp/B.DiEiOw/BUILD/zxing-cpp-6b3cbe02a332bff0f5ba0416f221d3d3876afdc2/build' make[2]: Entering directory '/tmp/B.DiEiOw/BUILD/zxing-cpp-6b3cbe02a332bff0f5ba0416f221d3d3876afdc2/build' [ 7%] Building CXX object CMakeFiles/libzxing.dir/core/src/zxing/LuminanceSource.cpp.o /usr/bin/x86_64-pld-linux-gnux32-g++ -Dlibzxing_EXPORTS -I/usr/include/opencv -I/tmp/B.DiEiOw/BUILD/zxing-cpp-6b3cbe02a332bff0f5ba0416f221d3d3876afdc2/./opencv/src -I/tmp/B.DiEiOw/BUILD/zxing-cpp-6b3cbe02a332bff0f5ba0416f221d3d3876afdc2/./core/src -O2 -fwrapv -pipe -Wformat -Werror=format-security -gdwarf-4 -fno-debug-types-section -fvar-tracking-assignments -g2 -Wp,-D_FORTIFY_SOURCE=2 -fstack-protector-strong --param=ssp-buffer-size=4 -fPIC -mtune=generic -march=x86-64 -gdwarf-4 -fno-debug-types-section -fvar-tracking-assignments -g2 -DNDEBUG -DQT_NO_DEBUG -fPIC -o CMakeFiles/libzxing.dir/core/src/zxing/LuminanceSource.cpp.o -c /tmp/B.DiEiOw/BUILD/zxing-cpp-6b3cbe02a332bff0f5ba0416f221d3d3876afdc2/core/src/zxing/LuminanceSource.cpp make[2]: Leaving directory '/tmp/B.DiEiOw/BUILD/zxing-cpp-6b3cbe02a332bff0f5ba0416f221d3d3876afdc2/build' make[2]: Entering directory '/tmp/B.DiEiOw/BUILD/zxing-cpp-6b3cbe02a332bff0f5ba0416f221d3d3876afdc2/build' [ 9%] Building CXX object CMakeFiles/libzxing.dir/core/src/zxing/Reader.cpp.o /usr/bin/x86_64-pld-linux-gnux32-g++ -Dlibzxing_EXPORTS -I/usr/include/opencv -I/tmp/B.DiEiOw/BUILD/zxing-cpp-6b3cbe02a332bff0f5ba0416f221d3d3876afdc2/./opencv/src -I/tmp/B.DiEiOw/BUILD/zxing-cpp-6b3cbe02a332bff0f5ba0416f221d3d3876afdc2/./core/src -O2 -fwrapv -pipe -Wformat -Werror=format-security -gdwarf-4 -fno-debug-types-section -fvar-tracking-assignments -g2 -Wp,-D_FORTIFY_SOURCE=2 -fstack-protector-strong --param=ssp-buffer-size=4 -fPIC -mtune=generic -march=x86-64 -gdwarf-4 -fno-debug-types-section -fvar-tracking-assignments -g2 -DNDEBUG -DQT_NO_DEBUG -fPIC -o CMakeFiles/libzxing.dir/core/src/zxing/Reader.cpp.o -c /tmp/B.DiEiOw/BUILD/zxing-cpp-6b3cbe02a332bff0f5ba0416f221d3d3876afdc2/core/src/zxing/Reader.cpp make[2]: Leaving directory '/tmp/B.DiEiOw/BUILD/zxing-cpp-6b3cbe02a332bff0f5ba0416f221d3d3876afdc2/build' make[2]: Entering directory '/tmp/B.DiEiOw/BUILD/zxing-cpp-6b3cbe02a332bff0f5ba0416f221d3d3876afdc2/build' [ 9%] Building CXX object CMakeFiles/libzxing.dir/core/src/zxing/Result.cpp.o /usr/bin/x86_64-pld-linux-gnux32-g++ -Dlibzxing_EXPORTS -I/usr/include/opencv -I/tmp/B.DiEiOw/BUILD/zxing-cpp-6b3cbe02a332bff0f5ba0416f221d3d3876afdc2/./opencv/src -I/tmp/B.DiEiOw/BUILD/zxing-cpp-6b3cbe02a332bff0f5ba0416f221d3d3876afdc2/./core/src -O2 -fwrapv -pipe -Wformat -Werror=format-security -gdwarf-4 -fno-debug-types-section -fvar-tracking-assignments -g2 -Wp,-D_FORTIFY_SOURCE=2 -fstack-protector-strong --param=ssp-buffer-size=4 -fPIC -mtune=generic -march=x86-64 -gdwarf-4 -fno-debug-types-section -fvar-tracking-assignments -g2 -DNDEBUG -DQT_NO_DEBUG -fPIC -o CMakeFiles/libzxing.dir/core/src/zxing/Result.cpp.o -c /tmp/B.DiEiOw/BUILD/zxing-cpp-6b3cbe02a332bff0f5ba0416f221d3d3876afdc2/core/src/zxing/Result.cpp make[2]: Leaving directory '/tmp/B.DiEiOw/BUILD/zxing-cpp-6b3cbe02a332bff0f5ba0416f221d3d3876afdc2/build' make[2]: Entering directory '/tmp/B.DiEiOw/BUILD/zxing-cpp-6b3cbe02a332bff0f5ba0416f221d3d3876afdc2/build' [ 10%] Building CXX object CMakeFiles/libzxing.dir/core/src/zxing/ResultIO.cpp.o /usr/bin/x86_64-pld-linux-gnux32-g++ -Dlibzxing_EXPORTS -I/usr/include/opencv -I/tmp/B.DiEiOw/BUILD/zxing-cpp-6b3cbe02a332bff0f5ba0416f221d3d3876afdc2/./opencv/src -I/tmp/B.DiEiOw/BUILD/zxing-cpp-6b3cbe02a332bff0f5ba0416f221d3d3876afdc2/./core/src -O2 -fwrapv -pipe -Wformat -Werror=format-security -gdwarf-4 -fno-debug-types-section -fvar-tracking-assignments -g2 -Wp,-D_FORTIFY_SOURCE=2 -fstack-protector-strong --param=ssp-buffer-size=4 -fPIC -mtune=generic -march=x86-64 -gdwarf-4 -fno-debug-types-section -fvar-tracking-assignments -g2 -DNDEBUG -DQT_NO_DEBUG -fPIC -o CMakeFiles/libzxing.dir/core/src/zxing/ResultIO.cpp.o -c /tmp/B.DiEiOw/BUILD/zxing-cpp-6b3cbe02a332bff0f5ba0416f221d3d3876afdc2/core/src/zxing/ResultIO.cpp /tmp/B.DiEiOw/BUILD/zxing-cpp-6b3cbe02a332bff0f5ba0416f221d3d3876afdc2/core/src/zxing/ResultIO.cpp:27:10: warning: 'std::ostream& zxing::operator<<(std::ostream&, zxing::Result&)' has not been declared within zxing ostream& zxing::operator<<(ostream &out, Result& result) { ^~~~~ In file included from /tmp/B.DiEiOw/BUILD/zxing-cpp-6b3cbe02a332bff0f5ba0416f221d3d3876afdc2/core/src/zxing/ResultIO.cpp:22:0: /tmp/B.DiEiOw/BUILD/zxing-cpp-6b3cbe02a332bff0f5ba0416f221d3d3876afdc2/./core/src/zxing/Result.h:51:24: note: only here as a friend friend std::ostream& operator<<(std::ostream &out, Result& result); ^~~~~~~~ make[2]: Leaving directory '/tmp/B.DiEiOw/BUILD/zxing-cpp-6b3cbe02a332bff0f5ba0416f221d3d3876afdc2/build' make[2]: Entering directory '/tmp/B.DiEiOw/BUILD/zxing-cpp-6b3cbe02a332bff0f5ba0416f221d3d3876afdc2/build' [ 13%] Building CXX object CMakeFiles/libzxing.dir/core/src/zxing/ResultPointCallback.cpp.o /usr/bin/x86_64-pld-linux-gnux32-g++ -Dlibzxing_EXPORTS -I/usr/include/opencv -I/tmp/B.DiEiOw/BUILD/zxing-cpp-6b3cbe02a332bff0f5ba0416f221d3d3876afdc2/./opencv/src -I/tmp/B.DiEiOw/BUILD/zxing-cpp-6b3cbe02a332bff0f5ba0416f221d3d3876afdc2/./core/src -O2 -fwrapv -pipe -Wformat -Werror=format-security -gdwarf-4 -fno-debug-types-section -fvar-tracking-assignments -g2 -Wp,-D_FORTIFY_SOURCE=2 -fstack-protector-strong --param=ssp-buffer-size=4 -fPIC -mtune=generic -march=x86-64 -gdwarf-4 -fno-debug-types-section -fvar-tracking-assignments -g2 -DNDEBUG -DQT_NO_DEBUG -fPIC -o CMakeFiles/libzxing.dir/core/src/zxing/ResultPointCallback.cpp.o -c /tmp/B.DiEiOw/BUILD/zxing-cpp-6b3cbe02a332bff0f5ba0416f221d3d3876afdc2/core/src/zxing/ResultPointCallback.cpp make[2]: Leaving directory '/tmp/B.DiEiOw/BUILD/zxing-cpp-6b3cbe02a332bff0f5ba0416f221d3d3876afdc2/build' make[2]: Entering directory '/tmp/B.DiEiOw/BUILD/zxing-cpp-6b3cbe02a332bff0f5ba0416f221d3d3876afdc2/build' [ 8%] Building CXX object CMakeFiles/libzxing.dir/core/src/zxing/MultiFormatReader.cpp.o /usr/bin/x86_64-pld-linux-gnux32-g++ -Dlibzxing_EXPORTS -I/usr/include/opencv -I/tmp/B.DiEiOw/BUILD/zxing-cpp-6b3cbe02a332bff0f5ba0416f221d3d3876afdc2/./opencv/src -I/tmp/B.DiEiOw/BUILD/zxing-cpp-6b3cbe02a332bff0f5ba0416f221d3d3876afdc2/./core/src -O2 -fwrapv -pipe -Wformat -Werror=format-security -gdwarf-4 -fno-debug-types-section -fvar-tracking-assignments -g2 -Wp,-D_FORTIFY_SOURCE=2 -fstack-protector-strong --param=ssp-buffer-size=4 -fPIC -mtune=generic -march=x86-64 -gdwarf-4 -fno-debug-types-section -fvar-tracking-assignments -g2 -DNDEBUG -DQT_NO_DEBUG -fPIC -o CMakeFiles/libzxing.dir/core/src/zxing/MultiFormatReader.cpp.o -c /tmp/B.DiEiOw/BUILD/zxing-cpp-6b3cbe02a332bff0f5ba0416f221d3d3876afdc2/core/src/zxing/MultiFormatReader.cpp make[2]: Leaving directory '/tmp/B.DiEiOw/BUILD/zxing-cpp-6b3cbe02a332bff0f5ba0416f221d3d3876afdc2/build' make[2]: Entering directory '/tmp/B.DiEiOw/BUILD/zxing-cpp-6b3cbe02a332bff0f5ba0416f221d3d3876afdc2/build' [ 12%] Building CXX object CMakeFiles/libzxing.dir/core/src/zxing/aztec/AztecDetectorResult.cpp.o /usr/bin/x86_64-pld-linux-gnux32-g++ -Dlibzxing_EXPORTS -I/usr/include/opencv -I/tmp/B.DiEiOw/BUILD/zxing-cpp-6b3cbe02a332bff0f5ba0416f221d3d3876afdc2/./opencv/src -I/tmp/B.DiEiOw/BUILD/zxing-cpp-6b3cbe02a332bff0f5ba0416f221d3d3876afdc2/./core/src -O2 -fwrapv -pipe -Wformat -Werror=format-security -gdwarf-4 -fno-debug-types-section -fvar-tracking-assignments -g2 -Wp,-D_FORTIFY_SOURCE=2 -fstack-protector-strong --param=ssp-buffer-size=4 -fPIC -mtune=generic -march=x86-64 -gdwarf-4 -fno-debug-types-section -fvar-tracking-assignments -g2 -DNDEBUG -DQT_NO_DEBUG -fPIC -o CMakeFiles/libzxing.dir/core/src/zxing/aztec/AztecDetectorResult.cpp.o -c /tmp/B.DiEiOw/BUILD/zxing-cpp-6b3cbe02a332bff0f5ba0416f221d3d3876afdc2/core/src/zxing/aztec/AztecDetectorResult.cpp make[2]: Leaving directory '/tmp/B.DiEiOw/BUILD/zxing-cpp-6b3cbe02a332bff0f5ba0416f221d3d3876afdc2/build' make[2]: Entering directory '/tmp/B.DiEiOw/BUILD/zxing-cpp-6b3cbe02a332bff0f5ba0416f221d3d3876afdc2/build' [ 11%] Building CXX object CMakeFiles/libzxing.dir/core/src/zxing/ResultPoint.cpp.o /usr/bin/x86_64-pld-linux-gnux32-g++ -Dlibzxing_EXPORTS -I/usr/include/opencv -I/tmp/B.DiEiOw/BUILD/zxing-cpp-6b3cbe02a332bff0f5ba0416f221d3d3876afdc2/./opencv/src -I/tmp/B.DiEiOw/BUILD/zxing-cpp-6b3cbe02a332bff0f5ba0416f221d3d3876afdc2/./core/src -O2 -fwrapv -pipe -Wformat -Werror=format-security -gdwarf-4 -fno-debug-types-section -fvar-tracking-assignments -g2 -Wp,-D_FORTIFY_SOURCE=2 -fstack-protector-strong --param=ssp-buffer-size=4 -fPIC -mtune=generic -march=x86-64 -gdwarf-4 -fno-debug-types-section -fvar-tracking-assignments -g2 -DNDEBUG -DQT_NO_DEBUG -fPIC -o CMakeFiles/libzxing.dir/core/src/zxing/ResultPoint.cpp.o -c /tmp/B.DiEiOw/BUILD/zxing-cpp-6b3cbe02a332bff0f5ba0416f221d3d3876afdc2/core/src/zxing/ResultPoint.cpp make[2]: Leaving directory '/tmp/B.DiEiOw/BUILD/zxing-cpp-6b3cbe02a332bff0f5ba0416f221d3d3876afdc2/build' make[2]: Entering directory '/tmp/B.DiEiOw/BUILD/zxing-cpp-6b3cbe02a332bff0f5ba0416f221d3d3876afdc2/build' [ 17%] Building CXX object CMakeFiles/libzxing.dir/core/src/zxing/common/BitArrayIO.cpp.o /usr/bin/x86_64-pld-linux-gnux32-g++ -Dlibzxing_EXPORTS -I/usr/include/opencv -I/tmp/B.DiEiOw/BUILD/zxing-cpp-6b3cbe02a332bff0f5ba0416f221d3d3876afdc2/./opencv/src -I/tmp/B.DiEiOw/BUILD/zxing-cpp-6b3cbe02a332bff0f5ba0416f221d3d3876afdc2/./core/src -O2 -fwrapv -pipe -Wformat -Werror=format-security -gdwarf-4 -fno-debug-types-section -fvar-tracking-assignments -g2 -Wp,-D_FORTIFY_SOURCE=2 -fstack-protector-strong --param=ssp-buffer-size=4 -fPIC -mtune=generic -march=x86-64 -gdwarf-4 -fno-debug-types-section -fvar-tracking-assignments -g2 -DNDEBUG -DQT_NO_DEBUG -fPIC -o CMakeFiles/libzxing.dir/core/src/zxing/common/BitArrayIO.cpp.o -c /tmp/B.DiEiOw/BUILD/zxing-cpp-6b3cbe02a332bff0f5ba0416f221d3d3876afdc2/core/src/zxing/common/BitArrayIO.cpp make[2]: Leaving directory '/tmp/B.DiEiOw/BUILD/zxing-cpp-6b3cbe02a332bff0f5ba0416f221d3d3876afdc2/build' make[2]: Entering directory '/tmp/B.DiEiOw/BUILD/zxing-cpp-6b3cbe02a332bff0f5ba0416f221d3d3876afdc2/build' [ 13%] Building CXX object CMakeFiles/libzxing.dir/core/src/zxing/aztec/AztecReader.cpp.o /usr/bin/x86_64-pld-linux-gnux32-g++ -Dlibzxing_EXPORTS -I/usr/include/opencv -I/tmp/B.DiEiOw/BUILD/zxing-cpp-6b3cbe02a332bff0f5ba0416f221d3d3876afdc2/./opencv/src -I/tmp/B.DiEiOw/BUILD/zxing-cpp-6b3cbe02a332bff0f5ba0416f221d3d3876afdc2/./core/src -O2 -fwrapv -pipe -Wformat -Werror=format-security -gdwarf-4 -fno-debug-types-section -fvar-tracking-assignments -g2 -Wp,-D_FORTIFY_SOURCE=2 -fstack-protector-strong --param=ssp-buffer-size=4 -fPIC -mtune=generic -march=x86-64 -gdwarf-4 -fno-debug-types-section -fvar-tracking-assignments -g2 -DNDEBUG -DQT_NO_DEBUG -fPIC -o CMakeFiles/libzxing.dir/core/src/zxing/aztec/AztecReader.cpp.o -c /tmp/B.DiEiOw/BUILD/zxing-cpp-6b3cbe02a332bff0f5ba0416f221d3d3876afdc2/core/src/zxing/aztec/AztecReader.cpp make[2]: Leaving directory '/tmp/B.DiEiOw/BUILD/zxing-cpp-6b3cbe02a332bff0f5ba0416f221d3d3876afdc2/build' make[2]: Entering directory '/tmp/B.DiEiOw/BUILD/zxing-cpp-6b3cbe02a332bff0f5ba0416f221d3d3876afdc2/build' [ 16%] Building CXX object CMakeFiles/libzxing.dir/core/src/zxing/common/BitArray.cpp.o /usr/bin/x86_64-pld-linux-gnux32-g++ -Dlibzxing_EXPORTS -I/usr/include/opencv -I/tmp/B.DiEiOw/BUILD/zxing-cpp-6b3cbe02a332bff0f5ba0416f221d3d3876afdc2/./opencv/src -I/tmp/B.DiEiOw/BUILD/zxing-cpp-6b3cbe02a332bff0f5ba0416f221d3d3876afdc2/./core/src -O2 -fwrapv -pipe -Wformat -Werror=format-security -gdwarf-4 -fno-debug-types-section -fvar-tracking-assignments -g2 -Wp,-D_FORTIFY_SOURCE=2 -fstack-protector-strong --param=ssp-buffer-size=4 -fPIC -mtune=generic -march=x86-64 -gdwarf-4 -fno-debug-types-section -fvar-tracking-assignments -g2 -DNDEBUG -DQT_NO_DEBUG -fPIC -o CMakeFiles/libzxing.dir/core/src/zxing/common/BitArray.cpp.o -c /tmp/B.DiEiOw/BUILD/zxing-cpp-6b3cbe02a332bff0f5ba0416f221d3d3876afdc2/core/src/zxing/common/BitArray.cpp make[2]: Leaving directory '/tmp/B.DiEiOw/BUILD/zxing-cpp-6b3cbe02a332bff0f5ba0416f221d3d3876afdc2/build' make[2]: Entering directory '/tmp/B.DiEiOw/BUILD/zxing-cpp-6b3cbe02a332bff0f5ba0416f221d3d3876afdc2/build' [ 18%] Building CXX object CMakeFiles/libzxing.dir/core/src/zxing/common/BitSource.cpp.o /usr/bin/x86_64-pld-linux-gnux32-g++ -Dlibzxing_EXPORTS -I/usr/include/opencv -I/tmp/B.DiEiOw/BUILD/zxing-cpp-6b3cbe02a332bff0f5ba0416f221d3d3876afdc2/./opencv/src -I/tmp/B.DiEiOw/BUILD/zxing-cpp-6b3cbe02a332bff0f5ba0416f221d3d3876afdc2/./core/src -O2 -fwrapv -pipe -Wformat -Werror=format-security -gdwarf-4 -fno-debug-types-section -fvar-tracking-assignments -g2 -Wp,-D_FORTIFY_SOURCE=2 -fstack-protector-strong --param=ssp-buffer-size=4 -fPIC -mtune=generic -march=x86-64 -gdwarf-4 -fno-debug-types-section -fvar-tracking-assignments -g2 -DNDEBUG -DQT_NO_DEBUG -fPIC -o CMakeFiles/libzxing.dir/core/src/zxing/common/BitSource.cpp.o -c /tmp/B.DiEiOw/BUILD/zxing-cpp-6b3cbe02a332bff0f5ba0416f221d3d3876afdc2/core/src/zxing/common/BitSource.cpp make[2]: Leaving directory '/tmp/B.DiEiOw/BUILD/zxing-cpp-6b3cbe02a332bff0f5ba0416f221d3d3876afdc2/build' make[2]: Entering directory '/tmp/B.DiEiOw/BUILD/zxing-cpp-6b3cbe02a332bff0f5ba0416f221d3d3876afdc2/build' [ 18%] Building CXX object CMakeFiles/libzxing.dir/core/src/zxing/common/BitMatrix.cpp.o /usr/bin/x86_64-pld-linux-gnux32-g++ -Dlibzxing_EXPORTS -I/usr/include/opencv -I/tmp/B.DiEiOw/BUILD/zxing-cpp-6b3cbe02a332bff0f5ba0416f221d3d3876afdc2/./opencv/src -I/tmp/B.DiEiOw/BUILD/zxing-cpp-6b3cbe02a332bff0f5ba0416f221d3d3876afdc2/./core/src -O2 -fwrapv -pipe -Wformat -Werror=format-security -gdwarf-4 -fno-debug-types-section -fvar-tracking-assignments -g2 -Wp,-D_FORTIFY_SOURCE=2 -fstack-protector-strong --param=ssp-buffer-size=4 -fPIC -mtune=generic -march=x86-64 -gdwarf-4 -fno-debug-types-section -fvar-tracking-assignments -g2 -DNDEBUG -DQT_NO_DEBUG -fPIC -o CMakeFiles/libzxing.dir/core/src/zxing/common/BitMatrix.cpp.o -c /tmp/B.DiEiOw/BUILD/zxing-cpp-6b3cbe02a332bff0f5ba0416f221d3d3876afdc2/core/src/zxing/common/BitMatrix.cpp make[2]: Leaving directory '/tmp/B.DiEiOw/BUILD/zxing-cpp-6b3cbe02a332bff0f5ba0416f221d3d3876afdc2/build' make[2]: Entering directory '/tmp/B.DiEiOw/BUILD/zxing-cpp-6b3cbe02a332bff0f5ba0416f221d3d3876afdc2/build' [ 20%] Building CXX object CMakeFiles/libzxing.dir/core/src/zxing/common/DecoderResult.cpp.o /usr/bin/x86_64-pld-linux-gnux32-g++ -Dlibzxing_EXPORTS -I/usr/include/opencv -I/tmp/B.DiEiOw/BUILD/zxing-cpp-6b3cbe02a332bff0f5ba0416f221d3d3876afdc2/./opencv/src -I/tmp/B.DiEiOw/BUILD/zxing-cpp-6b3cbe02a332bff0f5ba0416f221d3d3876afdc2/./core/src -O2 -fwrapv -pipe -Wformat -Werror=format-security -gdwarf-4 -fno-debug-types-section -fvar-tracking-assignments -g2 -Wp,-D_FORTIFY_SOURCE=2 -fstack-protector-strong --param=ssp-buffer-size=4 -fPIC -mtune=generic -march=x86-64 -gdwarf-4 -fno-debug-types-section -fvar-tracking-assignments -g2 -DNDEBUG -DQT_NO_DEBUG -fPIC -o CMakeFiles/libzxing.dir/core/src/zxing/common/DecoderResult.cpp.o -c /tmp/B.DiEiOw/BUILD/zxing-cpp-6b3cbe02a332bff0f5ba0416f221d3d3876afdc2/core/src/zxing/common/DecoderResult.cpp make[2]: Leaving directory '/tmp/B.DiEiOw/BUILD/zxing-cpp-6b3cbe02a332bff0f5ba0416f221d3d3876afdc2/build' make[2]: Entering directory '/tmp/B.DiEiOw/BUILD/zxing-cpp-6b3cbe02a332bff0f5ba0416f221d3d3876afdc2/build' [ 14%] Building CXX object CMakeFiles/libzxing.dir/core/src/zxing/aztec/decoder/Decoder.cpp.o /usr/bin/x86_64-pld-linux-gnux32-g++ -Dlibzxing_EXPORTS -I/usr/include/opencv -I/tmp/B.DiEiOw/BUILD/zxing-cpp-6b3cbe02a332bff0f5ba0416f221d3d3876afdc2/./opencv/src -I/tmp/B.DiEiOw/BUILD/zxing-cpp-6b3cbe02a332bff0f5ba0416f221d3d3876afdc2/./core/src -O2 -fwrapv -pipe -Wformat -Werror=format-security -gdwarf-4 -fno-debug-types-section -fvar-tracking-assignments -g2 -Wp,-D_FORTIFY_SOURCE=2 -fstack-protector-strong --param=ssp-buffer-size=4 -fPIC -mtune=generic -march=x86-64 -gdwarf-4 -fno-debug-types-section -fvar-tracking-assignments -g2 -DNDEBUG -DQT_NO_DEBUG -fPIC -o CMakeFiles/libzxing.dir/core/src/zxing/aztec/decoder/Decoder.cpp.o -c /tmp/B.DiEiOw/BUILD/zxing-cpp-6b3cbe02a332bff0f5ba0416f221d3d3876afdc2/core/src/zxing/aztec/decoder/Decoder.cpp make[2]: Leaving directory '/tmp/B.DiEiOw/BUILD/zxing-cpp-6b3cbe02a332bff0f5ba0416f221d3d3876afdc2/build' make[2]: Entering directory '/tmp/B.DiEiOw/BUILD/zxing-cpp-6b3cbe02a332bff0f5ba0416f221d3d3876afdc2/build' [ 22%] Building CXX object CMakeFiles/libzxing.dir/core/src/zxing/common/DetectorResult.cpp.o /usr/bin/x86_64-pld-linux-gnux32-g++ -Dlibzxing_EXPORTS -I/usr/include/opencv -I/tmp/B.DiEiOw/BUILD/zxing-cpp-6b3cbe02a332bff0f5ba0416f221d3d3876afdc2/./opencv/src -I/tmp/B.DiEiOw/BUILD/zxing-cpp-6b3cbe02a332bff0f5ba0416f221d3d3876afdc2/./core/src -O2 -fwrapv -pipe -Wformat -Werror=format-security -gdwarf-4 -fno-debug-types-section -fvar-tracking-assignments -g2 -Wp,-D_FORTIFY_SOURCE=2 -fstack-protector-strong --param=ssp-buffer-size=4 -fPIC -mtune=generic -march=x86-64 -gdwarf-4 -fno-debug-types-section -fvar-tracking-assignments -g2 -DNDEBUG -DQT_NO_DEBUG -fPIC -o CMakeFiles/libzxing.dir/core/src/zxing/common/DetectorResult.cpp.o -c /tmp/B.DiEiOw/BUILD/zxing-cpp-6b3cbe02a332bff0f5ba0416f221d3d3876afdc2/core/src/zxing/common/DetectorResult.cpp make[2]: Leaving directory '/tmp/B.DiEiOw/BUILD/zxing-cpp-6b3cbe02a332bff0f5ba0416f221d3d3876afdc2/build' make[2]: Entering directory '/tmp/B.DiEiOw/BUILD/zxing-cpp-6b3cbe02a332bff0f5ba0416f221d3d3876afdc2/build' [ 23%] Building CXX object CMakeFiles/libzxing.dir/core/src/zxing/common/GreyscaleRotatedLuminanceSource.cpp.o /usr/bin/x86_64-pld-linux-gnux32-g++ -Dlibzxing_EXPORTS -I/usr/include/opencv -I/tmp/B.DiEiOw/BUILD/zxing-cpp-6b3cbe02a332bff0f5ba0416f221d3d3876afdc2/./opencv/src -I/tmp/B.DiEiOw/BUILD/zxing-cpp-6b3cbe02a332bff0f5ba0416f221d3d3876afdc2/./core/src -O2 -fwrapv -pipe -Wformat -Werror=format-security -gdwarf-4 -fno-debug-types-section -fvar-tracking-assignments -g2 -Wp,-D_FORTIFY_SOURCE=2 -fstack-protector-strong --param=ssp-buffer-size=4 -fPIC -mtune=generic -march=x86-64 -gdwarf-4 -fno-debug-types-section -fvar-tracking-assignments -g2 -DNDEBUG -DQT_NO_DEBUG -fPIC -o CMakeFiles/libzxing.dir/core/src/zxing/common/GreyscaleRotatedLuminanceSource.cpp.o -c /tmp/B.DiEiOw/BUILD/zxing-cpp-6b3cbe02a332bff0f5ba0416f221d3d3876afdc2/core/src/zxing/common/GreyscaleRotatedLuminanceSource.cpp make[2]: Leaving directory '/tmp/B.DiEiOw/BUILD/zxing-cpp-6b3cbe02a332bff0f5ba0416f221d3d3876afdc2/build' make[2]: Entering directory '/tmp/B.DiEiOw/BUILD/zxing-cpp-6b3cbe02a332bff0f5ba0416f221d3d3876afdc2/build' [ 23%] Building CXX object CMakeFiles/libzxing.dir/core/src/zxing/common/GreyscaleLuminanceSource.cpp.o /usr/bin/x86_64-pld-linux-gnux32-g++ -Dlibzxing_EXPORTS -I/usr/include/opencv -I/tmp/B.DiEiOw/BUILD/zxing-cpp-6b3cbe02a332bff0f5ba0416f221d3d3876afdc2/./opencv/src -I/tmp/B.DiEiOw/BUILD/zxing-cpp-6b3cbe02a332bff0f5ba0416f221d3d3876afdc2/./core/src -O2 -fwrapv -pipe -Wformat -Werror=format-security -gdwarf-4 -fno-debug-types-section -fvar-tracking-assignments -g2 -Wp,-D_FORTIFY_SOURCE=2 -fstack-protector-strong --param=ssp-buffer-size=4 -fPIC -mtune=generic -march=x86-64 -gdwarf-4 -fno-debug-types-section -fvar-tracking-assignments -g2 -DNDEBUG -DQT_NO_DEBUG -fPIC -o CMakeFiles/libzxing.dir/core/src/zxing/common/GreyscaleLuminanceSource.cpp.o -c /tmp/B.DiEiOw/BUILD/zxing-cpp-6b3cbe02a332bff0f5ba0416f221d3d3876afdc2/core/src/zxing/common/GreyscaleLuminanceSource.cpp make[2]: Leaving directory '/tmp/B.DiEiOw/BUILD/zxing-cpp-6b3cbe02a332bff0f5ba0416f221d3d3876afdc2/build' make[2]: Entering directory '/tmp/B.DiEiOw/BUILD/zxing-cpp-6b3cbe02a332bff0f5ba0416f221d3d3876afdc2/build' [ 19%] Building CXX object CMakeFiles/libzxing.dir/core/src/zxing/common/CharacterSetECI.cpp.o /usr/bin/x86_64-pld-linux-gnux32-g++ -Dlibzxing_EXPORTS -I/usr/include/opencv -I/tmp/B.DiEiOw/BUILD/zxing-cpp-6b3cbe02a332bff0f5ba0416f221d3d3876afdc2/./opencv/src -I/tmp/B.DiEiOw/BUILD/zxing-cpp-6b3cbe02a332bff0f5ba0416f221d3d3876afdc2/./core/src -O2 -fwrapv -pipe -Wformat -Werror=format-security -gdwarf-4 -fno-debug-types-section -fvar-tracking-assignments -g2 -Wp,-D_FORTIFY_SOURCE=2 -fstack-protector-strong --param=ssp-buffer-size=4 -fPIC -mtune=generic -march=x86-64 -gdwarf-4 -fno-debug-types-section -fvar-tracking-assignments -g2 -DNDEBUG -DQT_NO_DEBUG -fPIC -o CMakeFiles/libzxing.dir/core/src/zxing/common/CharacterSetECI.cpp.o -c /tmp/B.DiEiOw/BUILD/zxing-cpp-6b3cbe02a332bff0f5ba0416f221d3d3876afdc2/core/src/zxing/common/CharacterSetECI.cpp make[2]: Leaving directory '/tmp/B.DiEiOw/BUILD/zxing-cpp-6b3cbe02a332bff0f5ba0416f221d3d3876afdc2/build' make[2]: Entering directory '/tmp/B.DiEiOw/BUILD/zxing-cpp-6b3cbe02a332bff0f5ba0416f221d3d3876afdc2/build' [ 21%] Building CXX object CMakeFiles/libzxing.dir/core/src/zxing/common/GlobalHistogramBinarizer.cpp.o /usr/bin/x86_64-pld-linux-gnux32-g++ -Dlibzxing_EXPORTS -I/usr/include/opencv -I/tmp/B.DiEiOw/BUILD/zxing-cpp-6b3cbe02a332bff0f5ba0416f221d3d3876afdc2/./opencv/src -I/tmp/B.DiEiOw/BUILD/zxing-cpp-6b3cbe02a332bff0f5ba0416f221d3d3876afdc2/./core/src -O2 -fwrapv -pipe -Wformat -Werror=format-security -gdwarf-4 -fno-debug-types-section -fvar-tracking-assignments -g2 -Wp,-D_FORTIFY_SOURCE=2 -fstack-protector-strong --param=ssp-buffer-size=4 -fPIC -mtune=generic -march=x86-64 -gdwarf-4 -fno-debug-types-section -fvar-tracking-assignments -g2 -DNDEBUG -DQT_NO_DEBUG -fPIC -o CMakeFiles/libzxing.dir/core/src/zxing/common/GlobalHistogramBinarizer.cpp.o -c /tmp/B.DiEiOw/BUILD/zxing-cpp-6b3cbe02a332bff0f5ba0416f221d3d3876afdc2/core/src/zxing/common/GlobalHistogramBinarizer.cpp make[2]: Leaving directory '/tmp/B.DiEiOw/BUILD/zxing-cpp-6b3cbe02a332bff0f5ba0416f221d3d3876afdc2/build' make[2]: Entering directory '/tmp/B.DiEiOw/BUILD/zxing-cpp-6b3cbe02a332bff0f5ba0416f221d3d3876afdc2/build' [ 26%] Building CXX object CMakeFiles/libzxing.dir/core/src/zxing/common/IllegalArgumentException.cpp.o /usr/bin/x86_64-pld-linux-gnux32-g++ -Dlibzxing_EXPORTS -I/usr/include/opencv -I/tmp/B.DiEiOw/BUILD/zxing-cpp-6b3cbe02a332bff0f5ba0416f221d3d3876afdc2/./opencv/src -I/tmp/B.DiEiOw/BUILD/zxing-cpp-6b3cbe02a332bff0f5ba0416f221d3d3876afdc2/./core/src -O2 -fwrapv -pipe -Wformat -Werror=format-security -gdwarf-4 -fno-debug-types-section -fvar-tracking-assignments -g2 -Wp,-D_FORTIFY_SOURCE=2 -fstack-protector-strong --param=ssp-buffer-size=4 -fPIC -mtune=generic -march=x86-64 -gdwarf-4 -fno-debug-types-section -fvar-tracking-assignments -g2 -DNDEBUG -DQT_NO_DEBUG -fPIC -o CMakeFiles/libzxing.dir/core/src/zxing/common/IllegalArgumentException.cpp.o -c /tmp/B.DiEiOw/BUILD/zxing-cpp-6b3cbe02a332bff0f5ba0416f221d3d3876afdc2/core/src/zxing/common/IllegalArgumentException.cpp make[2]: Leaving directory '/tmp/B.DiEiOw/BUILD/zxing-cpp-6b3cbe02a332bff0f5ba0416f221d3d3876afdc2/build' make[2]: Entering directory '/tmp/B.DiEiOw/BUILD/zxing-cpp-6b3cbe02a332bff0f5ba0416f221d3d3876afdc2/build' [ 24%] Building CXX object CMakeFiles/libzxing.dir/core/src/zxing/common/GridSampler.cpp.o /usr/bin/x86_64-pld-linux-gnux32-g++ -Dlibzxing_EXPORTS -I/usr/include/opencv -I/tmp/B.DiEiOw/BUILD/zxing-cpp-6b3cbe02a332bff0f5ba0416f221d3d3876afdc2/./opencv/src -I/tmp/B.DiEiOw/BUILD/zxing-cpp-6b3cbe02a332bff0f5ba0416f221d3d3876afdc2/./core/src -O2 -fwrapv -pipe -Wformat -Werror=format-security -gdwarf-4 -fno-debug-types-section -fvar-tracking-assignments -g2 -Wp,-D_FORTIFY_SOURCE=2 -fstack-protector-strong --param=ssp-buffer-size=4 -fPIC -mtune=generic -march=x86-64 -gdwarf-4 -fno-debug-types-section -fvar-tracking-assignments -g2 -DNDEBUG -DQT_NO_DEBUG -fPIC -o CMakeFiles/libzxing.dir/core/src/zxing/common/GridSampler.cpp.o -c /tmp/B.DiEiOw/BUILD/zxing-cpp-6b3cbe02a332bff0f5ba0416f221d3d3876afdc2/core/src/zxing/common/GridSampler.cpp make[2]: Leaving directory '/tmp/B.DiEiOw/BUILD/zxing-cpp-6b3cbe02a332bff0f5ba0416f221d3d3876afdc2/build' make[2]: Entering directory '/tmp/B.DiEiOw/BUILD/zxing-cpp-6b3cbe02a332bff0f5ba0416f221d3d3876afdc2/build' [ 27%] Building CXX object CMakeFiles/libzxing.dir/core/src/zxing/common/PerspectiveTransform.cpp.o /usr/bin/x86_64-pld-linux-gnux32-g++ -Dlibzxing_EXPORTS -I/usr/include/opencv -I/tmp/B.DiEiOw/BUILD/zxing-cpp-6b3cbe02a332bff0f5ba0416f221d3d3876afdc2/./opencv/src -I/tmp/B.DiEiOw/BUILD/zxing-cpp-6b3cbe02a332bff0f5ba0416f221d3d3876afdc2/./core/src -O2 -fwrapv -pipe -Wformat -Werror=format-security -gdwarf-4 -fno-debug-types-section -fvar-tracking-assignments -g2 -Wp,-D_FORTIFY_SOURCE=2 -fstack-protector-strong --param=ssp-buffer-size=4 -fPIC -mtune=generic -march=x86-64 -gdwarf-4 -fno-debug-types-section -fvar-tracking-assignments -g2 -DNDEBUG -DQT_NO_DEBUG -fPIC -o CMakeFiles/libzxing.dir/core/src/zxing/common/PerspectiveTransform.cpp.o -c /tmp/B.DiEiOw/BUILD/zxing-cpp-6b3cbe02a332bff0f5ba0416f221d3d3876afdc2/core/src/zxing/common/PerspectiveTransform.cpp make[2]: Leaving directory '/tmp/B.DiEiOw/BUILD/zxing-cpp-6b3cbe02a332bff0f5ba0416f221d3d3876afdc2/build' make[2]: Entering directory '/tmp/B.DiEiOw/BUILD/zxing-cpp-6b3cbe02a332bff0f5ba0416f221d3d3876afdc2/build' [ 27%] Building CXX object CMakeFiles/libzxing.dir/core/src/zxing/common/Str.cpp.o /usr/bin/x86_64-pld-linux-gnux32-g++ -Dlibzxing_EXPORTS -I/usr/include/opencv -I/tmp/B.DiEiOw/BUILD/zxing-cpp-6b3cbe02a332bff0f5ba0416f221d3d3876afdc2/./opencv/src -I/tmp/B.DiEiOw/BUILD/zxing-cpp-6b3cbe02a332bff0f5ba0416f221d3d3876afdc2/./core/src -O2 -fwrapv -pipe -Wformat -Werror=format-security -gdwarf-4 -fno-debug-types-section -fvar-tracking-assignments -g2 -Wp,-D_FORTIFY_SOURCE=2 -fstack-protector-strong --param=ssp-buffer-size=4 -fPIC -mtune=generic -march=x86-64 -gdwarf-4 -fno-debug-types-section -fvar-tracking-assignments -g2 -DNDEBUG -DQT_NO_DEBUG -fPIC -o CMakeFiles/libzxing.dir/core/src/zxing/common/Str.cpp.o -c /tmp/B.DiEiOw/BUILD/zxing-cpp-6b3cbe02a332bff0f5ba0416f221d3d3876afdc2/core/src/zxing/common/Str.cpp make[2]: Leaving directory '/tmp/B.DiEiOw/BUILD/zxing-cpp-6b3cbe02a332bff0f5ba0416f221d3d3876afdc2/build' make[2]: Entering directory '/tmp/B.DiEiOw/BUILD/zxing-cpp-6b3cbe02a332bff0f5ba0416f221d3d3876afdc2/build' [ 25%] Building CXX object CMakeFiles/libzxing.dir/core/src/zxing/common/HybridBinarizer.cpp.o /usr/bin/x86_64-pld-linux-gnux32-g++ -Dlibzxing_EXPORTS -I/usr/include/opencv -I/tmp/B.DiEiOw/BUILD/zxing-cpp-6b3cbe02a332bff0f5ba0416f221d3d3876afdc2/./opencv/src -I/tmp/B.DiEiOw/BUILD/zxing-cpp-6b3cbe02a332bff0f5ba0416f221d3d3876afdc2/./core/src -O2 -fwrapv -pipe -Wformat -Werror=format-security -gdwarf-4 -fno-debug-types-section -fvar-tracking-assignments -g2 -Wp,-D_FORTIFY_SOURCE=2 -fstack-protector-strong --param=ssp-buffer-size=4 -fPIC -mtune=generic -march=x86-64 -gdwarf-4 -fno-debug-types-section -fvar-tracking-assignments -g2 -DNDEBUG -DQT_NO_DEBUG -fPIC -o CMakeFiles/libzxing.dir/core/src/zxing/common/HybridBinarizer.cpp.o -c /tmp/B.DiEiOw/BUILD/zxing-cpp-6b3cbe02a332bff0f5ba0416f221d3d3876afdc2/core/src/zxing/common/HybridBinarizer.cpp make[2]: Leaving directory '/tmp/B.DiEiOw/BUILD/zxing-cpp-6b3cbe02a332bff0f5ba0416f221d3d3876afdc2/build' make[2]: Entering directory '/tmp/B.DiEiOw/BUILD/zxing-cpp-6b3cbe02a332bff0f5ba0416f221d3d3876afdc2/build' [ 28%] Building CXX object CMakeFiles/libzxing.dir/core/src/zxing/common/StringUtils.cpp.o /usr/bin/x86_64-pld-linux-gnux32-g++ -Dlibzxing_EXPORTS -I/usr/include/opencv -I/tmp/B.DiEiOw/BUILD/zxing-cpp-6b3cbe02a332bff0f5ba0416f221d3d3876afdc2/./opencv/src -I/tmp/B.DiEiOw/BUILD/zxing-cpp-6b3cbe02a332bff0f5ba0416f221d3d3876afdc2/./core/src -O2 -fwrapv -pipe -Wformat -Werror=format-security -gdwarf-4 -fno-debug-types-section -fvar-tracking-assignments -g2 -Wp,-D_FORTIFY_SOURCE=2 -fstack-protector-strong --param=ssp-buffer-size=4 -fPIC -mtune=generic -march=x86-64 -gdwarf-4 -fno-debug-types-section -fvar-tracking-assignments -g2 -DNDEBUG -DQT_NO_DEBUG -fPIC -o CMakeFiles/libzxing.dir/core/src/zxing/common/StringUtils.cpp.o -c /tmp/B.DiEiOw/BUILD/zxing-cpp-6b3cbe02a332bff0f5ba0416f221d3d3876afdc2/core/src/zxing/common/StringUtils.cpp make[2]: Leaving directory '/tmp/B.DiEiOw/BUILD/zxing-cpp-6b3cbe02a332bff0f5ba0416f221d3d3876afdc2/build' make[2]: Entering directory '/tmp/B.DiEiOw/BUILD/zxing-cpp-6b3cbe02a332bff0f5ba0416f221d3d3876afdc2/build' [ 29%] Building CXX object CMakeFiles/libzxing.dir/core/src/zxing/common/detector/MonochromeRectangleDetector.cpp.o /usr/bin/x86_64-pld-linux-gnux32-g++ -Dlibzxing_EXPORTS -I/usr/include/opencv -I/tmp/B.DiEiOw/BUILD/zxing-cpp-6b3cbe02a332bff0f5ba0416f221d3d3876afdc2/./opencv/src -I/tmp/B.DiEiOw/BUILD/zxing-cpp-6b3cbe02a332bff0f5ba0416f221d3d3876afdc2/./core/src -O2 -fwrapv -pipe -Wformat -Werror=format-security -gdwarf-4 -fno-debug-types-section -fvar-tracking-assignments -g2 -Wp,-D_FORTIFY_SOURCE=2 -fstack-protector-strong --param=ssp-buffer-size=4 -fPIC -mtune=generic -march=x86-64 -gdwarf-4 -fno-debug-types-section -fvar-tracking-assignments -g2 -DNDEBUG -DQT_NO_DEBUG -fPIC -o CMakeFiles/libzxing.dir/core/src/zxing/common/detector/MonochromeRectangleDetector.cpp.o -c /tmp/B.DiEiOw/BUILD/zxing-cpp-6b3cbe02a332bff0f5ba0416f221d3d3876afdc2/core/src/zxing/common/detector/MonochromeRectangleDetector.cpp make[2]: Leaving directory '/tmp/B.DiEiOw/BUILD/zxing-cpp-6b3cbe02a332bff0f5ba0416f221d3d3876afdc2/build' make[2]: Entering directory '/tmp/B.DiEiOw/BUILD/zxing-cpp-6b3cbe02a332bff0f5ba0416f221d3d3876afdc2/build' [ 33%] Building CXX object CMakeFiles/libzxing.dir/core/src/zxing/common/reedsolomon/ReedSolomonException.cpp.o /usr/bin/x86_64-pld-linux-gnux32-g++ -Dlibzxing_EXPORTS -I/usr/include/opencv -I/tmp/B.DiEiOw/BUILD/zxing-cpp-6b3cbe02a332bff0f5ba0416f221d3d3876afdc2/./opencv/src -I/tmp/B.DiEiOw/BUILD/zxing-cpp-6b3cbe02a332bff0f5ba0416f221d3d3876afdc2/./core/src -O2 -fwrapv -pipe -Wformat -Werror=format-security -gdwarf-4 -fno-debug-types-section -fvar-tracking-assignments -g2 -Wp,-D_FORTIFY_SOURCE=2 -fstack-protector-strong --param=ssp-buffer-size=4 -fPIC -mtune=generic -march=x86-64 -gdwarf-4 -fno-debug-types-section -fvar-tracking-assignments -g2 -DNDEBUG -DQT_NO_DEBUG -fPIC -o CMakeFiles/libzxing.dir/core/src/zxing/common/reedsolomon/ReedSolomonException.cpp.o -c /tmp/B.DiEiOw/BUILD/zxing-cpp-6b3cbe02a332bff0f5ba0416f221d3d3876afdc2/core/src/zxing/common/reedsolomon/ReedSolomonException.cpp make[2]: Leaving directory '/tmp/B.DiEiOw/BUILD/zxing-cpp-6b3cbe02a332bff0f5ba0416f221d3d3876afdc2/build' make[2]: Entering directory '/tmp/B.DiEiOw/BUILD/zxing-cpp-6b3cbe02a332bff0f5ba0416f221d3d3876afdc2/build' [ 31%] Building CXX object CMakeFiles/libzxing.dir/core/src/zxing/common/reedsolomon/GenericGF.cpp.o /usr/bin/x86_64-pld-linux-gnux32-g++ -Dlibzxing_EXPORTS -I/usr/include/opencv -I/tmp/B.DiEiOw/BUILD/zxing-cpp-6b3cbe02a332bff0f5ba0416f221d3d3876afdc2/./opencv/src -I/tmp/B.DiEiOw/BUILD/zxing-cpp-6b3cbe02a332bff0f5ba0416f221d3d3876afdc2/./core/src -O2 -fwrapv -pipe -Wformat -Werror=format-security -gdwarf-4 -fno-debug-types-section -fvar-tracking-assignments -g2 -Wp,-D_FORTIFY_SOURCE=2 -fstack-protector-strong --param=ssp-buffer-size=4 -fPIC -mtune=generic -march=x86-64 -gdwarf-4 -fno-debug-types-section -fvar-tracking-assignments -g2 -DNDEBUG -DQT_NO_DEBUG -fPIC -o CMakeFiles/libzxing.dir/core/src/zxing/common/reedsolomon/GenericGF.cpp.o -c /tmp/B.DiEiOw/BUILD/zxing-cpp-6b3cbe02a332bff0f5ba0416f221d3d3876afdc2/core/src/zxing/common/reedsolomon/GenericGF.cpp make[2]: Leaving directory '/tmp/B.DiEiOw/BUILD/zxing-cpp-6b3cbe02a332bff0f5ba0416f221d3d3876afdc2/build' make[2]: Entering directory '/tmp/B.DiEiOw/BUILD/zxing-cpp-6b3cbe02a332bff0f5ba0416f221d3d3876afdc2/build' [ 15%] Building CXX object CMakeFiles/libzxing.dir/core/src/zxing/aztec/detector/Detector.cpp.o /usr/bin/x86_64-pld-linux-gnux32-g++ -Dlibzxing_EXPORTS -I/usr/include/opencv -I/tmp/B.DiEiOw/BUILD/zxing-cpp-6b3cbe02a332bff0f5ba0416f221d3d3876afdc2/./opencv/src -I/tmp/B.DiEiOw/BUILD/zxing-cpp-6b3cbe02a332bff0f5ba0416f221d3d3876afdc2/./core/src -O2 -fwrapv -pipe -Wformat -Werror=format-security -gdwarf-4 -fno-debug-types-section -fvar-tracking-assignments -g2 -Wp,-D_FORTIFY_SOURCE=2 -fstack-protector-strong --param=ssp-buffer-size=4 -fPIC -mtune=generic -march=x86-64 -gdwarf-4 -fno-debug-types-section -fvar-tracking-assignments -g2 -DNDEBUG -DQT_NO_DEBUG -fPIC -o CMakeFiles/libzxing.dir/core/src/zxing/aztec/detector/Detector.cpp.o -c /tmp/B.DiEiOw/BUILD/zxing-cpp-6b3cbe02a332bff0f5ba0416f221d3d3876afdc2/core/src/zxing/aztec/detector/Detector.cpp make[2]: Leaving directory '/tmp/B.DiEiOw/BUILD/zxing-cpp-6b3cbe02a332bff0f5ba0416f221d3d3876afdc2/build' make[2]: Entering directory '/tmp/B.DiEiOw/BUILD/zxing-cpp-6b3cbe02a332bff0f5ba0416f221d3d3876afdc2/build' [ 30%] Building CXX object CMakeFiles/libzxing.dir/core/src/zxing/common/detector/WhiteRectangleDetector.cpp.o /usr/bin/x86_64-pld-linux-gnux32-g++ -Dlibzxing_EXPORTS -I/usr/include/opencv -I/tmp/B.DiEiOw/BUILD/zxing-cpp-6b3cbe02a332bff0f5ba0416f221d3d3876afdc2/./opencv/src -I/tmp/B.DiEiOw/BUILD/zxing-cpp-6b3cbe02a332bff0f5ba0416f221d3d3876afdc2/./core/src -O2 -fwrapv -pipe -Wformat -Werror=format-security -gdwarf-4 -fno-debug-types-section -fvar-tracking-assignments -g2 -Wp,-D_FORTIFY_SOURCE=2 -fstack-protector-strong --param=ssp-buffer-size=4 -fPIC -mtune=generic -march=x86-64 -gdwarf-4 -fno-debug-types-section -fvar-tracking-assignments -g2 -DNDEBUG -DQT_NO_DEBUG -fPIC -o CMakeFiles/libzxing.dir/core/src/zxing/common/detector/WhiteRectangleDetector.cpp.o -c /tmp/B.DiEiOw/BUILD/zxing-cpp-6b3cbe02a332bff0f5ba0416f221d3d3876afdc2/core/src/zxing/common/detector/WhiteRectangleDetector.cpp make[2]: Leaving directory '/tmp/B.DiEiOw/BUILD/zxing-cpp-6b3cbe02a332bff0f5ba0416f221d3d3876afdc2/build' make[2]: Entering directory '/tmp/B.DiEiOw/BUILD/zxing-cpp-6b3cbe02a332bff0f5ba0416f221d3d3876afdc2/build' [ 34%] Building CXX object CMakeFiles/libzxing.dir/core/src/zxing/datamatrix/DataMatrixReader.cpp.o /usr/bin/x86_64-pld-linux-gnux32-g++ -Dlibzxing_EXPORTS -I/usr/include/opencv -I/tmp/B.DiEiOw/BUILD/zxing-cpp-6b3cbe02a332bff0f5ba0416f221d3d3876afdc2/./opencv/src -I/tmp/B.DiEiOw/BUILD/zxing-cpp-6b3cbe02a332bff0f5ba0416f221d3d3876afdc2/./core/src -O2 -fwrapv -pipe -Wformat -Werror=format-security -gdwarf-4 -fno-debug-types-section -fvar-tracking-assignments -g2 -Wp,-D_FORTIFY_SOURCE=2 -fstack-protector-strong --param=ssp-buffer-size=4 -fPIC -mtune=generic -march=x86-64 -gdwarf-4 -fno-debug-types-section -fvar-tracking-assignments -g2 -DNDEBUG -DQT_NO_DEBUG -fPIC -o CMakeFiles/libzxing.dir/core/src/zxing/datamatrix/DataMatrixReader.cpp.o -c /tmp/B.DiEiOw/BUILD/zxing-cpp-6b3cbe02a332bff0f5ba0416f221d3d3876afdc2/core/src/zxing/datamatrix/DataMatrixReader.cpp make[2]: Leaving directory '/tmp/B.DiEiOw/BUILD/zxing-cpp-6b3cbe02a332bff0f5ba0416f221d3d3876afdc2/build' make[2]: Entering directory '/tmp/B.DiEiOw/BUILD/zxing-cpp-6b3cbe02a332bff0f5ba0416f221d3d3876afdc2/build' [ 31%] Building CXX object CMakeFiles/libzxing.dir/core/src/zxing/common/reedsolomon/GenericGFPoly.cpp.o /usr/bin/x86_64-pld-linux-gnux32-g++ -Dlibzxing_EXPORTS -I/usr/include/opencv -I/tmp/B.DiEiOw/BUILD/zxing-cpp-6b3cbe02a332bff0f5ba0416f221d3d3876afdc2/./opencv/src -I/tmp/B.DiEiOw/BUILD/zxing-cpp-6b3cbe02a332bff0f5ba0416f221d3d3876afdc2/./core/src -O2 -fwrapv -pipe -Wformat -Werror=format-security -gdwarf-4 -fno-debug-types-section -fvar-tracking-assignments -g2 -Wp,-D_FORTIFY_SOURCE=2 -fstack-protector-strong --param=ssp-buffer-size=4 -fPIC -mtune=generic -march=x86-64 -gdwarf-4 -fno-debug-types-section -fvar-tracking-assignments -g2 -DNDEBUG -DQT_NO_DEBUG -fPIC -o CMakeFiles/libzxing.dir/core/src/zxing/common/reedsolomon/GenericGFPoly.cpp.o -c /tmp/B.DiEiOw/BUILD/zxing-cpp-6b3cbe02a332bff0f5ba0416f221d3d3876afdc2/core/src/zxing/common/reedsolomon/GenericGFPoly.cpp make[2]: Leaving directory '/tmp/B.DiEiOw/BUILD/zxing-cpp-6b3cbe02a332bff0f5ba0416f221d3d3876afdc2/build' make[2]: Entering directory '/tmp/B.DiEiOw/BUILD/zxing-cpp-6b3cbe02a332bff0f5ba0416f221d3d3876afdc2/build' [ 39%] Building CXX object CMakeFiles/libzxing.dir/core/src/zxing/datamatrix/detector/CornerPoint.cpp.o /usr/bin/x86_64-pld-linux-gnux32-g++ -Dlibzxing_EXPORTS -I/usr/include/opencv -I/tmp/B.DiEiOw/BUILD/zxing-cpp-6b3cbe02a332bff0f5ba0416f221d3d3876afdc2/./opencv/src -I/tmp/B.DiEiOw/BUILD/zxing-cpp-6b3cbe02a332bff0f5ba0416f221d3d3876afdc2/./core/src -O2 -fwrapv -pipe -Wformat -Werror=format-security -gdwarf-4 -fno-debug-types-section -fvar-tracking-assignments -g2 -Wp,-D_FORTIFY_SOURCE=2 -fstack-protector-strong --param=ssp-buffer-size=4 -fPIC -mtune=generic -march=x86-64 -gdwarf-4 -fno-debug-types-section -fvar-tracking-assignments -g2 -DNDEBUG -DQT_NO_DEBUG -fPIC -o CMakeFiles/libzxing.dir/core/src/zxing/datamatrix/detector/CornerPoint.cpp.o -c /tmp/B.DiEiOw/BUILD/zxing-cpp-6b3cbe02a332bff0f5ba0416f221d3d3876afdc2/core/src/zxing/datamatrix/detector/CornerPoint.cpp make[2]: Leaving directory '/tmp/B.DiEiOw/BUILD/zxing-cpp-6b3cbe02a332bff0f5ba0416f221d3d3876afdc2/build' make[2]: Entering directory '/tmp/B.DiEiOw/BUILD/zxing-cpp-6b3cbe02a332bff0f5ba0416f221d3d3876afdc2/build' [ 36%] Building CXX object CMakeFiles/libzxing.dir/core/src/zxing/datamatrix/decoder/DataBlock.cpp.o /usr/bin/x86_64-pld-linux-gnux32-g++ -Dlibzxing_EXPORTS -I/usr/include/opencv -I/tmp/B.DiEiOw/BUILD/zxing-cpp-6b3cbe02a332bff0f5ba0416f221d3d3876afdc2/./opencv/src -I/tmp/B.DiEiOw/BUILD/zxing-cpp-6b3cbe02a332bff0f5ba0416f221d3d3876afdc2/./core/src -O2 -fwrapv -pipe -Wformat -Werror=format-security -gdwarf-4 -fno-debug-types-section -fvar-tracking-assignments -g2 -Wp,-D_FORTIFY_SOURCE=2 -fstack-protector-strong --param=ssp-buffer-size=4 -fPIC -mtune=generic -march=x86-64 -gdwarf-4 -fno-debug-types-section -fvar-tracking-assignments -g2 -DNDEBUG -DQT_NO_DEBUG -fPIC -o CMakeFiles/libzxing.dir/core/src/zxing/datamatrix/decoder/DataBlock.cpp.o -c /tmp/B.DiEiOw/BUILD/zxing-cpp-6b3cbe02a332bff0f5ba0416f221d3d3876afdc2/core/src/zxing/datamatrix/decoder/DataBlock.cpp make[2]: Leaving directory '/tmp/B.DiEiOw/BUILD/zxing-cpp-6b3cbe02a332bff0f5ba0416f221d3d3876afdc2/build' make[2]: Entering directory '/tmp/B.DiEiOw/BUILD/zxing-cpp-6b3cbe02a332bff0f5ba0416f221d3d3876afdc2/build' [ 35%] Building CXX object CMakeFiles/libzxing.dir/core/src/zxing/datamatrix/Version.cpp.o /usr/bin/x86_64-pld-linux-gnux32-g++ -Dlibzxing_EXPORTS -I/usr/include/opencv -I/tmp/B.DiEiOw/BUILD/zxing-cpp-6b3cbe02a332bff0f5ba0416f221d3d3876afdc2/./opencv/src -I/tmp/B.DiEiOw/BUILD/zxing-cpp-6b3cbe02a332bff0f5ba0416f221d3d3876afdc2/./core/src -O2 -fwrapv -pipe -Wformat -Werror=format-security -gdwarf-4 -fno-debug-types-section -fvar-tracking-assignments -g2 -Wp,-D_FORTIFY_SOURCE=2 -fstack-protector-strong --param=ssp-buffer-size=4 -fPIC -mtune=generic -march=x86-64 -gdwarf-4 -fno-debug-types-section -fvar-tracking-assignments -g2 -DNDEBUG -DQT_NO_DEBUG -fPIC -o CMakeFiles/libzxing.dir/core/src/zxing/datamatrix/Version.cpp.o -c /tmp/B.DiEiOw/BUILD/zxing-cpp-6b3cbe02a332bff0f5ba0416f221d3d3876afdc2/core/src/zxing/datamatrix/Version.cpp make[2]: Leaving directory '/tmp/B.DiEiOw/BUILD/zxing-cpp-6b3cbe02a332bff0f5ba0416f221d3d3876afdc2/build' make[2]: Entering directory '/tmp/B.DiEiOw/BUILD/zxing-cpp-6b3cbe02a332bff0f5ba0416f221d3d3876afdc2/build' [ 32%] Building CXX object CMakeFiles/libzxing.dir/core/src/zxing/common/reedsolomon/ReedSolomonDecoder.cpp.o /usr/bin/x86_64-pld-linux-gnux32-g++ -Dlibzxing_EXPORTS -I/usr/include/opencv -I/tmp/B.DiEiOw/BUILD/zxing-cpp-6b3cbe02a332bff0f5ba0416f221d3d3876afdc2/./opencv/src -I/tmp/B.DiEiOw/BUILD/zxing-cpp-6b3cbe02a332bff0f5ba0416f221d3d3876afdc2/./core/src -O2 -fwrapv -pipe -Wformat -Werror=format-security -gdwarf-4 -fno-debug-types-section -fvar-tracking-assignments -g2 -Wp,-D_FORTIFY_SOURCE=2 -fstack-protector-strong --param=ssp-buffer-size=4 -fPIC -mtune=generic -march=x86-64 -gdwarf-4 -fno-debug-types-section -fvar-tracking-assignments -g2 -DNDEBUG -DQT_NO_DEBUG -fPIC -o CMakeFiles/libzxing.dir/core/src/zxing/common/reedsolomon/ReedSolomonDecoder.cpp.o -c /tmp/B.DiEiOw/BUILD/zxing-cpp-6b3cbe02a332bff0f5ba0416f221d3d3876afdc2/core/src/zxing/common/reedsolomon/ReedSolomonDecoder.cpp make[2]: Leaving directory '/tmp/B.DiEiOw/BUILD/zxing-cpp-6b3cbe02a332bff0f5ba0416f221d3d3876afdc2/build' make[2]: Entering directory '/tmp/B.DiEiOw/BUILD/zxing-cpp-6b3cbe02a332bff0f5ba0416f221d3d3876afdc2/build' [ 36%] Building CXX object CMakeFiles/libzxing.dir/core/src/zxing/datamatrix/decoder/BitMatrixParser.cpp.o /usr/bin/x86_64-pld-linux-gnux32-g++ -Dlibzxing_EXPORTS -I/usr/include/opencv -I/tmp/B.DiEiOw/BUILD/zxing-cpp-6b3cbe02a332bff0f5ba0416f221d3d3876afdc2/./opencv/src -I/tmp/B.DiEiOw/BUILD/zxing-cpp-6b3cbe02a332bff0f5ba0416f221d3d3876afdc2/./core/src -O2 -fwrapv -pipe -Wformat -Werror=format-security -gdwarf-4 -fno-debug-types-section -fvar-tracking-assignments -g2 -Wp,-D_FORTIFY_SOURCE=2 -fstack-protector-strong --param=ssp-buffer-size=4 -fPIC -mtune=generic -march=x86-64 -gdwarf-4 -fno-debug-types-section -fvar-tracking-assignments -g2 -DNDEBUG -DQT_NO_DEBUG -fPIC -o CMakeFiles/libzxing.dir/core/src/zxing/datamatrix/decoder/BitMatrixParser.cpp.o -c /tmp/B.DiEiOw/BUILD/zxing-cpp-6b3cbe02a332bff0f5ba0416f221d3d3876afdc2/core/src/zxing/datamatrix/decoder/BitMatrixParser.cpp make[2]: Leaving directory '/tmp/B.DiEiOw/BUILD/zxing-cpp-6b3cbe02a332bff0f5ba0416f221d3d3876afdc2/build' make[2]: Entering directory '/tmp/B.DiEiOw/BUILD/zxing-cpp-6b3cbe02a332bff0f5ba0416f221d3d3876afdc2/build' [ 40%] Building CXX object CMakeFiles/libzxing.dir/core/src/zxing/datamatrix/detector/DetectorException.cpp.o /usr/bin/x86_64-pld-linux-gnux32-g++ -Dlibzxing_EXPORTS -I/usr/include/opencv -I/tmp/B.DiEiOw/BUILD/zxing-cpp-6b3cbe02a332bff0f5ba0416f221d3d3876afdc2/./opencv/src -I/tmp/B.DiEiOw/BUILD/zxing-cpp-6b3cbe02a332bff0f5ba0416f221d3d3876afdc2/./core/src -O2 -fwrapv -pipe -Wformat -Werror=format-security -gdwarf-4 -fno-debug-types-section -fvar-tracking-assignments -g2 -Wp,-D_FORTIFY_SOURCE=2 -fstack-protector-strong --param=ssp-buffer-size=4 -fPIC -mtune=generic -march=x86-64 -gdwarf-4 -fno-debug-types-section -fvar-tracking-assignments -g2 -DNDEBUG -DQT_NO_DEBUG -fPIC -o CMakeFiles/libzxing.dir/core/src/zxing/datamatrix/detector/DetectorException.cpp.o -c /tmp/B.DiEiOw/BUILD/zxing-cpp-6b3cbe02a332bff0f5ba0416f221d3d3876afdc2/core/src/zxing/datamatrix/detector/DetectorException.cpp make[2]: Leaving directory '/tmp/B.DiEiOw/BUILD/zxing-cpp-6b3cbe02a332bff0f5ba0416f221d3d3876afdc2/build' make[2]: Entering directory '/tmp/B.DiEiOw/BUILD/zxing-cpp-6b3cbe02a332bff0f5ba0416f221d3d3876afdc2/build' [ 37%] Building CXX object CMakeFiles/libzxing.dir/core/src/zxing/datamatrix/decoder/DecodedBitStreamParser.cpp.o /usr/bin/x86_64-pld-linux-gnux32-g++ -Dlibzxing_EXPORTS -I/usr/include/opencv -I/tmp/B.DiEiOw/BUILD/zxing-cpp-6b3cbe02a332bff0f5ba0416f221d3d3876afdc2/./opencv/src -I/tmp/B.DiEiOw/BUILD/zxing-cpp-6b3cbe02a332bff0f5ba0416f221d3d3876afdc2/./core/src -O2 -fwrapv -pipe -Wformat -Werror=format-security -gdwarf-4 -fno-debug-types-section -fvar-tracking-assignments -g2 -Wp,-D_FORTIFY_SOURCE=2 -fstack-protector-strong --param=ssp-buffer-size=4 -fPIC -mtune=generic -march=x86-64 -gdwarf-4 -fno-debug-types-section -fvar-tracking-assignments -g2 -DNDEBUG -DQT_NO_DEBUG -fPIC -o CMakeFiles/libzxing.dir/core/src/zxing/datamatrix/decoder/DecodedBitStreamParser.cpp.o -c /tmp/B.DiEiOw/BUILD/zxing-cpp-6b3cbe02a332bff0f5ba0416f221d3d3876afdc2/core/src/zxing/datamatrix/decoder/DecodedBitStreamParser.cpp make[2]: Leaving directory '/tmp/B.DiEiOw/BUILD/zxing-cpp-6b3cbe02a332bff0f5ba0416f221d3d3876afdc2/build' make[2]: Entering directory '/tmp/B.DiEiOw/BUILD/zxing-cpp-6b3cbe02a332bff0f5ba0416f221d3d3876afdc2/build' [ 38%] Building CXX object CMakeFiles/libzxing.dir/core/src/zxing/datamatrix/decoder/Decoder.cpp.o /usr/bin/x86_64-pld-linux-gnux32-g++ -Dlibzxing_EXPORTS -I/usr/include/opencv -I/tmp/B.DiEiOw/BUILD/zxing-cpp-6b3cbe02a332bff0f5ba0416f221d3d3876afdc2/./opencv/src -I/tmp/B.DiEiOw/BUILD/zxing-cpp-6b3cbe02a332bff0f5ba0416f221d3d3876afdc2/./core/src -O2 -fwrapv -pipe -Wformat -Werror=format-security -gdwarf-4 -fno-debug-types-section -fvar-tracking-assignments -g2 -Wp,-D_FORTIFY_SOURCE=2 -fstack-protector-strong --param=ssp-buffer-size=4 -fPIC -mtune=generic -march=x86-64 -gdwarf-4 -fno-debug-types-section -fvar-tracking-assignments -g2 -DNDEBUG -DQT_NO_DEBUG -fPIC -o CMakeFiles/libzxing.dir/core/src/zxing/datamatrix/decoder/Decoder.cpp.o -c /tmp/B.DiEiOw/BUILD/zxing-cpp-6b3cbe02a332bff0f5ba0416f221d3d3876afdc2/core/src/zxing/datamatrix/decoder/Decoder.cpp make[2]: Leaving directory '/tmp/B.DiEiOw/BUILD/zxing-cpp-6b3cbe02a332bff0f5ba0416f221d3d3876afdc2/build' make[2]: Entering directory '/tmp/B.DiEiOw/BUILD/zxing-cpp-6b3cbe02a332bff0f5ba0416f221d3d3876afdc2/build' [ 43%] Building CXX object CMakeFiles/libzxing.dir/core/src/zxing/multi/MultipleBarcodeReader.cpp.o /usr/bin/x86_64-pld-linux-gnux32-g++ -Dlibzxing_EXPORTS -I/usr/include/opencv -I/tmp/B.DiEiOw/BUILD/zxing-cpp-6b3cbe02a332bff0f5ba0416f221d3d3876afdc2/./opencv/src -I/tmp/B.DiEiOw/BUILD/zxing-cpp-6b3cbe02a332bff0f5ba0416f221d3d3876afdc2/./core/src -O2 -fwrapv -pipe -Wformat -Werror=format-security -gdwarf-4 -fno-debug-types-section -fvar-tracking-assignments -g2 -Wp,-D_FORTIFY_SOURCE=2 -fstack-protector-strong --param=ssp-buffer-size=4 -fPIC -mtune=generic -march=x86-64 -gdwarf-4 -fno-debug-types-section -fvar-tracking-assignments -g2 -DNDEBUG -DQT_NO_DEBUG -fPIC -o CMakeFiles/libzxing.dir/core/src/zxing/multi/MultipleBarcodeReader.cpp.o -c /tmp/B.DiEiOw/BUILD/zxing-cpp-6b3cbe02a332bff0f5ba0416f221d3d3876afdc2/core/src/zxing/multi/MultipleBarcodeReader.cpp make[2]: Leaving directory '/tmp/B.DiEiOw/BUILD/zxing-cpp-6b3cbe02a332bff0f5ba0416f221d3d3876afdc2/build' make[2]: Entering directory '/tmp/B.DiEiOw/BUILD/zxing-cpp-6b3cbe02a332bff0f5ba0416f221d3d3876afdc2/build' [ 41%] Building CXX object CMakeFiles/libzxing.dir/core/src/zxing/multi/ByQuadrantReader.cpp.o /usr/bin/x86_64-pld-linux-gnux32-g++ -Dlibzxing_EXPORTS -I/usr/include/opencv -I/tmp/B.DiEiOw/BUILD/zxing-cpp-6b3cbe02a332bff0f5ba0416f221d3d3876afdc2/./opencv/src -I/tmp/B.DiEiOw/BUILD/zxing-cpp-6b3cbe02a332bff0f5ba0416f221d3d3876afdc2/./core/src -O2 -fwrapv -pipe -Wformat -Werror=format-security -gdwarf-4 -fno-debug-types-section -fvar-tracking-assignments -g2 -Wp,-D_FORTIFY_SOURCE=2 -fstack-protector-strong --param=ssp-buffer-size=4 -fPIC -mtune=generic -march=x86-64 -gdwarf-4 -fno-debug-types-section -fvar-tracking-assignments -g2 -DNDEBUG -DQT_NO_DEBUG -fPIC -o CMakeFiles/libzxing.dir/core/src/zxing/multi/ByQuadrantReader.cpp.o -c /tmp/B.DiEiOw/BUILD/zxing-cpp-6b3cbe02a332bff0f5ba0416f221d3d3876afdc2/core/src/zxing/multi/ByQuadrantReader.cpp make[2]: Leaving directory '/tmp/B.DiEiOw/BUILD/zxing-cpp-6b3cbe02a332bff0f5ba0416f221d3d3876afdc2/build' make[2]: Entering directory '/tmp/B.DiEiOw/BUILD/zxing-cpp-6b3cbe02a332bff0f5ba0416f221d3d3876afdc2/build' [ 45%] Building CXX object CMakeFiles/libzxing.dir/core/src/zxing/multi/qrcode/detector/MultiDetector.cpp.o /usr/bin/x86_64-pld-linux-gnux32-g++ -Dlibzxing_EXPORTS -I/usr/include/opencv -I/tmp/B.DiEiOw/BUILD/zxing-cpp-6b3cbe02a332bff0f5ba0416f221d3d3876afdc2/./opencv/src -I/tmp/B.DiEiOw/BUILD/zxing-cpp-6b3cbe02a332bff0f5ba0416f221d3d3876afdc2/./core/src -O2 -fwrapv -pipe -Wformat -Werror=format-security -gdwarf-4 -fno-debug-types-section -fvar-tracking-assignments -g2 -Wp,-D_FORTIFY_SOURCE=2 -fstack-protector-strong --param=ssp-buffer-size=4 -fPIC -mtune=generic -march=x86-64 -gdwarf-4 -fno-debug-types-section -fvar-tracking-assignments -g2 -DNDEBUG -DQT_NO_DEBUG -fPIC -o CMakeFiles/libzxing.dir/core/src/zxing/multi/qrcode/detector/MultiDetector.cpp.o -c /tmp/B.DiEiOw/BUILD/zxing-cpp-6b3cbe02a332bff0f5ba0416f221d3d3876afdc2/core/src/zxing/multi/qrcode/detector/MultiDetector.cpp make[2]: Leaving directory '/tmp/B.DiEiOw/BUILD/zxing-cpp-6b3cbe02a332bff0f5ba0416f221d3d3876afdc2/build' make[2]: Entering directory '/tmp/B.DiEiOw/BUILD/zxing-cpp-6b3cbe02a332bff0f5ba0416f221d3d3876afdc2/build' [ 44%] Building CXX object CMakeFiles/libzxing.dir/core/src/zxing/multi/qrcode/QRCodeMultiReader.cpp.o /usr/bin/x86_64-pld-linux-gnux32-g++ -Dlibzxing_EXPORTS -I/usr/include/opencv -I/tmp/B.DiEiOw/BUILD/zxing-cpp-6b3cbe02a332bff0f5ba0416f221d3d3876afdc2/./opencv/src -I/tmp/B.DiEiOw/BUILD/zxing-cpp-6b3cbe02a332bff0f5ba0416f221d3d3876afdc2/./core/src -O2 -fwrapv -pipe -Wformat -Werror=format-security -gdwarf-4 -fno-debug-types-section -fvar-tracking-assignments -g2 -Wp,-D_FORTIFY_SOURCE=2 -fstack-protector-strong --param=ssp-buffer-size=4 -fPIC -mtune=generic -march=x86-64 -gdwarf-4 -fno-debug-types-section -fvar-tracking-assignments -g2 -DNDEBUG -DQT_NO_DEBUG -fPIC -o CMakeFiles/libzxing.dir/core/src/zxing/multi/qrcode/QRCodeMultiReader.cpp.o -c /tmp/B.DiEiOw/BUILD/zxing-cpp-6b3cbe02a332bff0f5ba0416f221d3d3876afdc2/core/src/zxing/multi/qrcode/QRCodeMultiReader.cpp make[2]: Leaving directory '/tmp/B.DiEiOw/BUILD/zxing-cpp-6b3cbe02a332bff0f5ba0416f221d3d3876afdc2/build' make[2]: Entering directory '/tmp/B.DiEiOw/BUILD/zxing-cpp-6b3cbe02a332bff0f5ba0416f221d3d3876afdc2/build' [ 42%] Building CXX object CMakeFiles/libzxing.dir/core/src/zxing/multi/GenericMultipleBarcodeReader.cpp.o /usr/bin/x86_64-pld-linux-gnux32-g++ -Dlibzxing_EXPORTS -I/usr/include/opencv -I/tmp/B.DiEiOw/BUILD/zxing-cpp-6b3cbe02a332bff0f5ba0416f221d3d3876afdc2/./opencv/src -I/tmp/B.DiEiOw/BUILD/zxing-cpp-6b3cbe02a332bff0f5ba0416f221d3d3876afdc2/./core/src -O2 -fwrapv -pipe -Wformat -Werror=format-security -gdwarf-4 -fno-debug-types-section -fvar-tracking-assignments -g2 -Wp,-D_FORTIFY_SOURCE=2 -fstack-protector-strong --param=ssp-buffer-size=4 -fPIC -mtune=generic -march=x86-64 -gdwarf-4 -fno-debug-types-section -fvar-tracking-assignments -g2 -DNDEBUG -DQT_NO_DEBUG -fPIC -o CMakeFiles/libzxing.dir/core/src/zxing/multi/GenericMultipleBarcodeReader.cpp.o -c /tmp/B.DiEiOw/BUILD/zxing-cpp-6b3cbe02a332bff0f5ba0416f221d3d3876afdc2/core/src/zxing/multi/GenericMultipleBarcodeReader.cpp make[2]: Leaving directory '/tmp/B.DiEiOw/BUILD/zxing-cpp-6b3cbe02a332bff0f5ba0416f221d3d3876afdc2/build' make[2]: Entering directory '/tmp/B.DiEiOw/BUILD/zxing-cpp-6b3cbe02a332bff0f5ba0416f221d3d3876afdc2/build' [ 46%] Building CXX object CMakeFiles/libzxing.dir/core/src/zxing/oned/CodaBarReader.cpp.o /usr/bin/x86_64-pld-linux-gnux32-g++ -Dlibzxing_EXPORTS -I/usr/include/opencv -I/tmp/B.DiEiOw/BUILD/zxing-cpp-6b3cbe02a332bff0f5ba0416f221d3d3876afdc2/./opencv/src -I/tmp/B.DiEiOw/BUILD/zxing-cpp-6b3cbe02a332bff0f5ba0416f221d3d3876afdc2/./core/src -O2 -fwrapv -pipe -Wformat -Werror=format-security -gdwarf-4 -fno-debug-types-section -fvar-tracking-assignments -g2 -Wp,-D_FORTIFY_SOURCE=2 -fstack-protector-strong --param=ssp-buffer-size=4 -fPIC -mtune=generic -march=x86-64 -gdwarf-4 -fno-debug-types-section -fvar-tracking-assignments -g2 -DNDEBUG -DQT_NO_DEBUG -fPIC -o CMakeFiles/libzxing.dir/core/src/zxing/oned/CodaBarReader.cpp.o -c /tmp/B.DiEiOw/BUILD/zxing-cpp-6b3cbe02a332bff0f5ba0416f221d3d3876afdc2/core/src/zxing/oned/CodaBarReader.cpp make[2]: Leaving directory '/tmp/B.DiEiOw/BUILD/zxing-cpp-6b3cbe02a332bff0f5ba0416f221d3d3876afdc2/build' make[2]: Entering directory '/tmp/B.DiEiOw/BUILD/zxing-cpp-6b3cbe02a332bff0f5ba0416f221d3d3876afdc2/build' [ 50%] Building CXX object CMakeFiles/libzxing.dir/core/src/zxing/oned/EAN13Reader.cpp.o /usr/bin/x86_64-pld-linux-gnux32-g++ -Dlibzxing_EXPORTS -I/usr/include/opencv -I/tmp/B.DiEiOw/BUILD/zxing-cpp-6b3cbe02a332bff0f5ba0416f221d3d3876afdc2/./opencv/src -I/tmp/B.DiEiOw/BUILD/zxing-cpp-6b3cbe02a332bff0f5ba0416f221d3d3876afdc2/./core/src -O2 -fwrapv -pipe -Wformat -Werror=format-security -gdwarf-4 -fno-debug-types-section -fvar-tracking-assignments -g2 -Wp,-D_FORTIFY_SOURCE=2 -fstack-protector-strong --param=ssp-buffer-size=4 -fPIC -mtune=generic -march=x86-64 -gdwarf-4 -fno-debug-types-section -fvar-tracking-assignments -g2 -DNDEBUG -DQT_NO_DEBUG -fPIC -o CMakeFiles/libzxing.dir/core/src/zxing/oned/EAN13Reader.cpp.o -c /tmp/B.DiEiOw/BUILD/zxing-cpp-6b3cbe02a332bff0f5ba0416f221d3d3876afdc2/core/src/zxing/oned/EAN13Reader.cpp make[2]: Leaving directory '/tmp/B.DiEiOw/BUILD/zxing-cpp-6b3cbe02a332bff0f5ba0416f221d3d3876afdc2/build' make[2]: Entering directory '/tmp/B.DiEiOw/BUILD/zxing-cpp-6b3cbe02a332bff0f5ba0416f221d3d3876afdc2/build' [ 50%] Building CXX object CMakeFiles/libzxing.dir/core/src/zxing/oned/EAN8Reader.cpp.o /usr/bin/x86_64-pld-linux-gnux32-g++ -Dlibzxing_EXPORTS -I/usr/include/opencv -I/tmp/B.DiEiOw/BUILD/zxing-cpp-6b3cbe02a332bff0f5ba0416f221d3d3876afdc2/./opencv/src -I/tmp/B.DiEiOw/BUILD/zxing-cpp-6b3cbe02a332bff0f5ba0416f221d3d3876afdc2/./core/src -O2 -fwrapv -pipe -Wformat -Werror=format-security -gdwarf-4 -fno-debug-types-section -fvar-tracking-assignments -g2 -Wp,-D_FORTIFY_SOURCE=2 -fstack-protector-strong --param=ssp-buffer-size=4 -fPIC -mtune=generic -march=x86-64 -gdwarf-4 -fno-debug-types-section -fvar-tracking-assignments -g2 -DNDEBUG -DQT_NO_DEBUG -fPIC -o CMakeFiles/libzxing.dir/core/src/zxing/oned/EAN8Reader.cpp.o -c /tmp/B.DiEiOw/BUILD/zxing-cpp-6b3cbe02a332bff0f5ba0416f221d3d3876afdc2/core/src/zxing/oned/EAN8Reader.cpp make[2]: Leaving directory '/tmp/B.DiEiOw/BUILD/zxing-cpp-6b3cbe02a332bff0f5ba0416f221d3d3876afdc2/build' make[2]: Entering directory '/tmp/B.DiEiOw/BUILD/zxing-cpp-6b3cbe02a332bff0f5ba0416f221d3d3876afdc2/build' [ 47%] Building CXX object CMakeFiles/libzxing.dir/core/src/zxing/oned/Code128Reader.cpp.o /usr/bin/x86_64-pld-linux-gnux32-g++ -Dlibzxing_EXPORTS -I/usr/include/opencv -I/tmp/B.DiEiOw/BUILD/zxing-cpp-6b3cbe02a332bff0f5ba0416f221d3d3876afdc2/./opencv/src -I/tmp/B.DiEiOw/BUILD/zxing-cpp-6b3cbe02a332bff0f5ba0416f221d3d3876afdc2/./core/src -O2 -fwrapv -pipe -Wformat -Werror=format-security -gdwarf-4 -fno-debug-types-section -fvar-tracking-assignments -g2 -Wp,-D_FORTIFY_SOURCE=2 -fstack-protector-strong --param=ssp-buffer-size=4 -fPIC -mtune=generic -march=x86-64 -gdwarf-4 -fno-debug-types-section -fvar-tracking-assignments -g2 -DNDEBUG -DQT_NO_DEBUG -fPIC -o CMakeFiles/libzxing.dir/core/src/zxing/oned/Code128Reader.cpp.o -c /tmp/B.DiEiOw/BUILD/zxing-cpp-6b3cbe02a332bff0f5ba0416f221d3d3876afdc2/core/src/zxing/oned/Code128Reader.cpp make[2]: Leaving directory '/tmp/B.DiEiOw/BUILD/zxing-cpp-6b3cbe02a332bff0f5ba0416f221d3d3876afdc2/build' make[2]: Entering directory '/tmp/B.DiEiOw/BUILD/zxing-cpp-6b3cbe02a332bff0f5ba0416f221d3d3876afdc2/build' [ 48%] Building CXX object CMakeFiles/libzxing.dir/core/src/zxing/oned/Code39Reader.cpp.o /usr/bin/x86_64-pld-linux-gnux32-g++ -Dlibzxing_EXPORTS -I/usr/include/opencv -I/tmp/B.DiEiOw/BUILD/zxing-cpp-6b3cbe02a332bff0f5ba0416f221d3d3876afdc2/./opencv/src -I/tmp/B.DiEiOw/BUILD/zxing-cpp-6b3cbe02a332bff0f5ba0416f221d3d3876afdc2/./core/src -O2 -fwrapv -pipe -Wformat -Werror=format-security -gdwarf-4 -fno-debug-types-section -fvar-tracking-assignments -g2 -Wp,-D_FORTIFY_SOURCE=2 -fstack-protector-strong --param=ssp-buffer-size=4 -fPIC -mtune=generic -march=x86-64 -gdwarf-4 -fno-debug-types-section -fvar-tracking-assignments -g2 -DNDEBUG -DQT_NO_DEBUG -fPIC -o CMakeFiles/libzxing.dir/core/src/zxing/oned/Code39Reader.cpp.o -c /tmp/B.DiEiOw/BUILD/zxing-cpp-6b3cbe02a332bff0f5ba0416f221d3d3876afdc2/core/src/zxing/oned/Code39Reader.cpp make[2]: Leaving directory '/tmp/B.DiEiOw/BUILD/zxing-cpp-6b3cbe02a332bff0f5ba0416f221d3d3876afdc2/build' make[2]: Entering directory '/tmp/B.DiEiOw/BUILD/zxing-cpp-6b3cbe02a332bff0f5ba0416f221d3d3876afdc2/build' [ 49%] Building CXX object CMakeFiles/libzxing.dir/core/src/zxing/oned/Code93Reader.cpp.o /usr/bin/x86_64-pld-linux-gnux32-g++ -Dlibzxing_EXPORTS -I/usr/include/opencv -I/tmp/B.DiEiOw/BUILD/zxing-cpp-6b3cbe02a332bff0f5ba0416f221d3d3876afdc2/./opencv/src -I/tmp/B.DiEiOw/BUILD/zxing-cpp-6b3cbe02a332bff0f5ba0416f221d3d3876afdc2/./core/src -O2 -fwrapv -pipe -Wformat -Werror=format-security -gdwarf-4 -fno-debug-types-section -fvar-tracking-assignments -g2 -Wp,-D_FORTIFY_SOURCE=2 -fstack-protector-strong --param=ssp-buffer-size=4 -fPIC -mtune=generic -march=x86-64 -gdwarf-4 -fno-debug-types-section -fvar-tracking-assignments -g2 -DNDEBUG -DQT_NO_DEBUG -fPIC -o CMakeFiles/libzxing.dir/core/src/zxing/oned/Code93Reader.cpp.o -c /tmp/B.DiEiOw/BUILD/zxing-cpp-6b3cbe02a332bff0f5ba0416f221d3d3876afdc2/core/src/zxing/oned/Code93Reader.cpp make[2]: Leaving directory '/tmp/B.DiEiOw/BUILD/zxing-cpp-6b3cbe02a332bff0f5ba0416f221d3d3876afdc2/build' make[2]: Entering directory '/tmp/B.DiEiOw/BUILD/zxing-cpp-6b3cbe02a332bff0f5ba0416f221d3d3876afdc2/build' [ 55%] Building CXX object CMakeFiles/libzxing.dir/core/src/zxing/oned/OneDResultPoint.cpp.o /usr/bin/x86_64-pld-linux-gnux32-g++ -Dlibzxing_EXPORTS -I/usr/include/opencv -I/tmp/B.DiEiOw/BUILD/zxing-cpp-6b3cbe02a332bff0f5ba0416f221d3d3876afdc2/./opencv/src -I/tmp/B.DiEiOw/BUILD/zxing-cpp-6b3cbe02a332bff0f5ba0416f221d3d3876afdc2/./core/src -O2 -fwrapv -pipe -Wformat -Werror=format-security -gdwarf-4 -fno-debug-types-section -fvar-tracking-assignments -g2 -Wp,-D_FORTIFY_SOURCE=2 -fstack-protector-strong --param=ssp-buffer-size=4 -fPIC -mtune=generic -march=x86-64 -gdwarf-4 -fno-debug-types-section -fvar-tracking-assignments -g2 -DNDEBUG -DQT_NO_DEBUG -fPIC -o CMakeFiles/libzxing.dir/core/src/zxing/oned/OneDResultPoint.cpp.o -c /tmp/B.DiEiOw/BUILD/zxing-cpp-6b3cbe02a332bff0f5ba0416f221d3d3876afdc2/core/src/zxing/oned/OneDResultPoint.cpp make[2]: Leaving directory '/tmp/B.DiEiOw/BUILD/zxing-cpp-6b3cbe02a332bff0f5ba0416f221d3d3876afdc2/build' make[2]: Entering directory '/tmp/B.DiEiOw/BUILD/zxing-cpp-6b3cbe02a332bff0f5ba0416f221d3d3876afdc2/build' [ 45%] Building CXX object CMakeFiles/libzxing.dir/core/src/zxing/multi/qrcode/detector/MultiFinderPatternFinder.cpp.o /usr/bin/x86_64-pld-linux-gnux32-g++ -Dlibzxing_EXPORTS -I/usr/include/opencv -I/tmp/B.DiEiOw/BUILD/zxing-cpp-6b3cbe02a332bff0f5ba0416f221d3d3876afdc2/./opencv/src -I/tmp/B.DiEiOw/BUILD/zxing-cpp-6b3cbe02a332bff0f5ba0416f221d3d3876afdc2/./core/src -O2 -fwrapv -pipe -Wformat -Werror=format-security -gdwarf-4 -fno-debug-types-section -fvar-tracking-assignments -g2 -Wp,-D_FORTIFY_SOURCE=2 -fstack-protector-strong --param=ssp-buffer-size=4 -fPIC -mtune=generic -march=x86-64 -gdwarf-4 -fno-debug-types-section -fvar-tracking-assignments -g2 -DNDEBUG -DQT_NO_DEBUG -fPIC -o CMakeFiles/libzxing.dir/core/src/zxing/multi/qrcode/detector/MultiFinderPatternFinder.cpp.o -c /tmp/B.DiEiOw/BUILD/zxing-cpp-6b3cbe02a332bff0f5ba0416f221d3d3876afdc2/core/src/zxing/multi/qrcode/detector/MultiFinderPatternFinder.cpp make[2]: Leaving directory '/tmp/B.DiEiOw/BUILD/zxing-cpp-6b3cbe02a332bff0f5ba0416f221d3d3876afdc2/build' make[2]: Entering directory '/tmp/B.DiEiOw/BUILD/zxing-cpp-6b3cbe02a332bff0f5ba0416f221d3d3876afdc2/build' [ 52%] Building CXX object CMakeFiles/libzxing.dir/core/src/zxing/oned/MultiFormatOneDReader.cpp.o /usr/bin/x86_64-pld-linux-gnux32-g++ -Dlibzxing_EXPORTS -I/usr/include/opencv -I/tmp/B.DiEiOw/BUILD/zxing-cpp-6b3cbe02a332bff0f5ba0416f221d3d3876afdc2/./opencv/src -I/tmp/B.DiEiOw/BUILD/zxing-cpp-6b3cbe02a332bff0f5ba0416f221d3d3876afdc2/./core/src -O2 -fwrapv -pipe -Wformat -Werror=format-security -gdwarf-4 -fno-debug-types-section -fvar-tracking-assignments -g2 -Wp,-D_FORTIFY_SOURCE=2 -fstack-protector-strong --param=ssp-buffer-size=4 -fPIC -mtune=generic -march=x86-64 -gdwarf-4 -fno-debug-types-section -fvar-tracking-assignments -g2 -DNDEBUG -DQT_NO_DEBUG -fPIC -o CMakeFiles/libzxing.dir/core/src/zxing/oned/MultiFormatOneDReader.cpp.o -c /tmp/B.DiEiOw/BUILD/zxing-cpp-6b3cbe02a332bff0f5ba0416f221d3d3876afdc2/core/src/zxing/oned/MultiFormatOneDReader.cpp make[2]: Leaving directory '/tmp/B.DiEiOw/BUILD/zxing-cpp-6b3cbe02a332bff0f5ba0416f221d3d3876afdc2/build' make[2]: Entering directory '/tmp/B.DiEiOw/BUILD/zxing-cpp-6b3cbe02a332bff0f5ba0416f221d3d3876afdc2/build' [ 55%] Building CXX object CMakeFiles/libzxing.dir/core/src/zxing/oned/UPCAReader.cpp.o /usr/bin/x86_64-pld-linux-gnux32-g++ -Dlibzxing_EXPORTS -I/usr/include/opencv -I/tmp/B.DiEiOw/BUILD/zxing-cpp-6b3cbe02a332bff0f5ba0416f221d3d3876afdc2/./opencv/src -I/tmp/B.DiEiOw/BUILD/zxing-cpp-6b3cbe02a332bff0f5ba0416f221d3d3876afdc2/./core/src -O2 -fwrapv -pipe -Wformat -Werror=format-security -gdwarf-4 -fno-debug-types-section -fvar-tracking-assignments -g2 -Wp,-D_FORTIFY_SOURCE=2 -fstack-protector-strong --param=ssp-buffer-size=4 -fPIC -mtune=generic -march=x86-64 -gdwarf-4 -fno-debug-types-section -fvar-tracking-assignments -g2 -DNDEBUG -DQT_NO_DEBUG -fPIC -o CMakeFiles/libzxing.dir/core/src/zxing/oned/UPCAReader.cpp.o -c /tmp/B.DiEiOw/BUILD/zxing-cpp-6b3cbe02a332bff0f5ba0416f221d3d3876afdc2/core/src/zxing/oned/UPCAReader.cpp make[2]: Leaving directory '/tmp/B.DiEiOw/BUILD/zxing-cpp-6b3cbe02a332bff0f5ba0416f221d3d3876afdc2/build' make[2]: Entering directory '/tmp/B.DiEiOw/BUILD/zxing-cpp-6b3cbe02a332bff0f5ba0416f221d3d3876afdc2/build' [ 51%] Building CXX object CMakeFiles/libzxing.dir/core/src/zxing/oned/ITFReader.cpp.o /usr/bin/x86_64-pld-linux-gnux32-g++ -Dlibzxing_EXPORTS -I/usr/include/opencv -I/tmp/B.DiEiOw/BUILD/zxing-cpp-6b3cbe02a332bff0f5ba0416f221d3d3876afdc2/./opencv/src -I/tmp/B.DiEiOw/BUILD/zxing-cpp-6b3cbe02a332bff0f5ba0416f221d3d3876afdc2/./core/src -O2 -fwrapv -pipe -Wformat -Werror=format-security -gdwarf-4 -fno-debug-types-section -fvar-tracking-assignments -g2 -Wp,-D_FORTIFY_SOURCE=2 -fstack-protector-strong --param=ssp-buffer-size=4 -fPIC -mtune=generic -march=x86-64 -gdwarf-4 -fno-debug-types-section -fvar-tracking-assignments -g2 -DNDEBUG -DQT_NO_DEBUG -fPIC -o CMakeFiles/libzxing.dir/core/src/zxing/oned/ITFReader.cpp.o -c /tmp/B.DiEiOw/BUILD/zxing-cpp-6b3cbe02a332bff0f5ba0416f221d3d3876afdc2/core/src/zxing/oned/ITFReader.cpp make[2]: Leaving directory '/tmp/B.DiEiOw/BUILD/zxing-cpp-6b3cbe02a332bff0f5ba0416f221d3d3876afdc2/build' make[2]: Entering directory '/tmp/B.DiEiOw/BUILD/zxing-cpp-6b3cbe02a332bff0f5ba0416f221d3d3876afdc2/build' [ 54%] Building CXX object CMakeFiles/libzxing.dir/core/src/zxing/oned/OneDReader.cpp.o /usr/bin/x86_64-pld-linux-gnux32-g++ -Dlibzxing_EXPORTS -I/usr/include/opencv -I/tmp/B.DiEiOw/BUILD/zxing-cpp-6b3cbe02a332bff0f5ba0416f221d3d3876afdc2/./opencv/src -I/tmp/B.DiEiOw/BUILD/zxing-cpp-6b3cbe02a332bff0f5ba0416f221d3d3876afdc2/./core/src -O2 -fwrapv -pipe -Wformat -Werror=format-security -gdwarf-4 -fno-debug-types-section -fvar-tracking-assignments -g2 -Wp,-D_FORTIFY_SOURCE=2 -fstack-protector-strong --param=ssp-buffer-size=4 -fPIC -mtune=generic -march=x86-64 -gdwarf-4 -fno-debug-types-section -fvar-tracking-assignments -g2 -DNDEBUG -DQT_NO_DEBUG -fPIC -o CMakeFiles/libzxing.dir/core/src/zxing/oned/OneDReader.cpp.o -c /tmp/B.DiEiOw/BUILD/zxing-cpp-6b3cbe02a332bff0f5ba0416f221d3d3876afdc2/core/src/zxing/oned/OneDReader.cpp make[2]: Leaving directory '/tmp/B.DiEiOw/BUILD/zxing-cpp-6b3cbe02a332bff0f5ba0416f221d3d3876afdc2/build' make[2]: Entering directory '/tmp/B.DiEiOw/BUILD/zxing-cpp-6b3cbe02a332bff0f5ba0416f221d3d3876afdc2/build' [ 53%] Building CXX object CMakeFiles/libzxing.dir/core/src/zxing/oned/MultiFormatUPCEANReader.cpp.o /usr/bin/x86_64-pld-linux-gnux32-g++ -Dlibzxing_EXPORTS -I/usr/include/opencv -I/tmp/B.DiEiOw/BUILD/zxing-cpp-6b3cbe02a332bff0f5ba0416f221d3d3876afdc2/./opencv/src -I/tmp/B.DiEiOw/BUILD/zxing-cpp-6b3cbe02a332bff0f5ba0416f221d3d3876afdc2/./core/src -O2 -fwrapv -pipe -Wformat -Werror=format-security -gdwarf-4 -fno-debug-types-section -fvar-tracking-assignments -g2 -Wp,-D_FORTIFY_SOURCE=2 -fstack-protector-strong --param=ssp-buffer-size=4 -fPIC -mtune=generic -march=x86-64 -gdwarf-4 -fno-debug-types-section -fvar-tracking-assignments -g2 -DNDEBUG -DQT_NO_DEBUG -fPIC -o CMakeFiles/libzxing.dir/core/src/zxing/oned/MultiFormatUPCEANReader.cpp.o -c /tmp/B.DiEiOw/BUILD/zxing-cpp-6b3cbe02a332bff0f5ba0416f221d3d3876afdc2/core/src/zxing/oned/MultiFormatUPCEANReader.cpp make[2]: Leaving directory '/tmp/B.DiEiOw/BUILD/zxing-cpp-6b3cbe02a332bff0f5ba0416f221d3d3876afdc2/build' make[2]: Entering directory '/tmp/B.DiEiOw/BUILD/zxing-cpp-6b3cbe02a332bff0f5ba0416f221d3d3876afdc2/build' [ 40%] Building CXX object CMakeFiles/libzxing.dir/core/src/zxing/datamatrix/detector/Detector.cpp.o /usr/bin/x86_64-pld-linux-gnux32-g++ -Dlibzxing_EXPORTS -I/usr/include/opencv -I/tmp/B.DiEiOw/BUILD/zxing-cpp-6b3cbe02a332bff0f5ba0416f221d3d3876afdc2/./opencv/src -I/tmp/B.DiEiOw/BUILD/zxing-cpp-6b3cbe02a332bff0f5ba0416f221d3d3876afdc2/./core/src -O2 -fwrapv -pipe -Wformat -Werror=format-security -gdwarf-4 -fno-debug-types-section -fvar-tracking-assignments -g2 -Wp,-D_FORTIFY_SOURCE=2 -fstack-protector-strong --param=ssp-buffer-size=4 -fPIC -mtune=generic -march=x86-64 -gdwarf-4 -fno-debug-types-section -fvar-tracking-assignments -g2 -DNDEBUG -DQT_NO_DEBUG -fPIC -o CMakeFiles/libzxing.dir/core/src/zxing/datamatrix/detector/Detector.cpp.o -c /tmp/B.DiEiOw/BUILD/zxing-cpp-6b3cbe02a332bff0f5ba0416f221d3d3876afdc2/core/src/zxing/datamatrix/detector/Detector.cpp make[2]: Leaving directory '/tmp/B.DiEiOw/BUILD/zxing-cpp-6b3cbe02a332bff0f5ba0416f221d3d3876afdc2/build' make[2]: Entering directory '/tmp/B.DiEiOw/BUILD/zxing-cpp-6b3cbe02a332bff0f5ba0416f221d3d3876afdc2/build' [ 56%] Building CXX object CMakeFiles/libzxing.dir/core/src/zxing/oned/UPCEANReader.cpp.o /usr/bin/x86_64-pld-linux-gnux32-g++ -Dlibzxing_EXPORTS -I/usr/include/opencv -I/tmp/B.DiEiOw/BUILD/zxing-cpp-6b3cbe02a332bff0f5ba0416f221d3d3876afdc2/./opencv/src -I/tmp/B.DiEiOw/BUILD/zxing-cpp-6b3cbe02a332bff0f5ba0416f221d3d3876afdc2/./core/src -O2 -fwrapv -pipe -Wformat -Werror=format-security -gdwarf-4 -fno-debug-types-section -fvar-tracking-assignments -g2 -Wp,-D_FORTIFY_SOURCE=2 -fstack-protector-strong --param=ssp-buffer-size=4 -fPIC -mtune=generic -march=x86-64 -gdwarf-4 -fno-debug-types-section -fvar-tracking-assignments -g2 -DNDEBUG -DQT_NO_DEBUG -fPIC -o CMakeFiles/libzxing.dir/core/src/zxing/oned/UPCEANReader.cpp.o -c /tmp/B.DiEiOw/BUILD/zxing-cpp-6b3cbe02a332bff0f5ba0416f221d3d3876afdc2/core/src/zxing/oned/UPCEANReader.cpp make[2]: Leaving directory '/tmp/B.DiEiOw/BUILD/zxing-cpp-6b3cbe02a332bff0f5ba0416f221d3d3876afdc2/build' make[2]: Entering directory '/tmp/B.DiEiOw/BUILD/zxing-cpp-6b3cbe02a332bff0f5ba0416f221d3d3876afdc2/build' [ 57%] Building CXX object CMakeFiles/libzxing.dir/core/src/zxing/oned/UPCEReader.cpp.o /usr/bin/x86_64-pld-linux-gnux32-g++ -Dlibzxing_EXPORTS -I/usr/include/opencv -I/tmp/B.DiEiOw/BUILD/zxing-cpp-6b3cbe02a332bff0f5ba0416f221d3d3876afdc2/./opencv/src -I/tmp/B.DiEiOw/BUILD/zxing-cpp-6b3cbe02a332bff0f5ba0416f221d3d3876afdc2/./core/src -O2 -fwrapv -pipe -Wformat -Werror=format-security -gdwarf-4 -fno-debug-types-section -fvar-tracking-assignments -g2 -Wp,-D_FORTIFY_SOURCE=2 -fstack-protector-strong --param=ssp-buffer-size=4 -fPIC -mtune=generic -march=x86-64 -gdwarf-4 -fno-debug-types-section -fvar-tracking-assignments -g2 -DNDEBUG -DQT_NO_DEBUG -fPIC -o CMakeFiles/libzxing.dir/core/src/zxing/oned/UPCEReader.cpp.o -c /tmp/B.DiEiOw/BUILD/zxing-cpp-6b3cbe02a332bff0f5ba0416f221d3d3876afdc2/core/src/zxing/oned/UPCEReader.cpp make[2]: Leaving directory '/tmp/B.DiEiOw/BUILD/zxing-cpp-6b3cbe02a332bff0f5ba0416f221d3d3876afdc2/build' make[2]: Entering directory '/tmp/B.DiEiOw/BUILD/zxing-cpp-6b3cbe02a332bff0f5ba0416f221d3d3876afdc2/build' [ 58%] Building CXX object CMakeFiles/libzxing.dir/core/src/zxing/pdf417/PDF417Reader.cpp.o /usr/bin/x86_64-pld-linux-gnux32-g++ -Dlibzxing_EXPORTS -I/usr/include/opencv -I/tmp/B.DiEiOw/BUILD/zxing-cpp-6b3cbe02a332bff0f5ba0416f221d3d3876afdc2/./opencv/src -I/tmp/B.DiEiOw/BUILD/zxing-cpp-6b3cbe02a332bff0f5ba0416f221d3d3876afdc2/./core/src -O2 -fwrapv -pipe -Wformat -Werror=format-security -gdwarf-4 -fno-debug-types-section -fvar-tracking-assignments -g2 -Wp,-D_FORTIFY_SOURCE=2 -fstack-protector-strong --param=ssp-buffer-size=4 -fPIC -mtune=generic -march=x86-64 -gdwarf-4 -fno-debug-types-section -fvar-tracking-assignments -g2 -DNDEBUG -DQT_NO_DEBUG -fPIC -o CMakeFiles/libzxing.dir/core/src/zxing/pdf417/PDF417Reader.cpp.o -c /tmp/B.DiEiOw/BUILD/zxing-cpp-6b3cbe02a332bff0f5ba0416f221d3d3876afdc2/core/src/zxing/pdf417/PDF417Reader.cpp make[2]: Leaving directory '/tmp/B.DiEiOw/BUILD/zxing-cpp-6b3cbe02a332bff0f5ba0416f221d3d3876afdc2/build' make[2]: Entering directory '/tmp/B.DiEiOw/BUILD/zxing-cpp-6b3cbe02a332bff0f5ba0416f221d3d3876afdc2/build' [ 60%] Building CXX object CMakeFiles/libzxing.dir/core/src/zxing/pdf417/decoder/Decoder.cpp.o /usr/bin/x86_64-pld-linux-gnux32-g++ -Dlibzxing_EXPORTS -I/usr/include/opencv -I/tmp/B.DiEiOw/BUILD/zxing-cpp-6b3cbe02a332bff0f5ba0416f221d3d3876afdc2/./opencv/src -I/tmp/B.DiEiOw/BUILD/zxing-cpp-6b3cbe02a332bff0f5ba0416f221d3d3876afdc2/./core/src -O2 -fwrapv -pipe -Wformat -Werror=format-security -gdwarf-4 -fno-debug-types-section -fvar-tracking-assignments -g2 -Wp,-D_FORTIFY_SOURCE=2 -fstack-protector-strong --param=ssp-buffer-size=4 -fPIC -mtune=generic -march=x86-64 -gdwarf-4 -fno-debug-types-section -fvar-tracking-assignments -g2 -DNDEBUG -DQT_NO_DEBUG -fPIC -o CMakeFiles/libzxing.dir/core/src/zxing/pdf417/decoder/Decoder.cpp.o -c /tmp/B.DiEiOw/BUILD/zxing-cpp-6b3cbe02a332bff0f5ba0416f221d3d3876afdc2/core/src/zxing/pdf417/decoder/Decoder.cpp make[2]: Leaving directory '/tmp/B.DiEiOw/BUILD/zxing-cpp-6b3cbe02a332bff0f5ba0416f221d3d3876afdc2/build' make[2]: Entering directory '/tmp/B.DiEiOw/BUILD/zxing-cpp-6b3cbe02a332bff0f5ba0416f221d3d3876afdc2/build' [ 59%] Building CXX object CMakeFiles/libzxing.dir/core/src/zxing/pdf417/decoder/BitMatrixParser.cpp.o /usr/bin/x86_64-pld-linux-gnux32-g++ -Dlibzxing_EXPORTS -I/usr/include/opencv -I/tmp/B.DiEiOw/BUILD/zxing-cpp-6b3cbe02a332bff0f5ba0416f221d3d3876afdc2/./opencv/src -I/tmp/B.DiEiOw/BUILD/zxing-cpp-6b3cbe02a332bff0f5ba0416f221d3d3876afdc2/./core/src -O2 -fwrapv -pipe -Wformat -Werror=format-security -gdwarf-4 -fno-debug-types-section -fvar-tracking-assignments -g2 -Wp,-D_FORTIFY_SOURCE=2 -fstack-protector-strong --param=ssp-buffer-size=4 -fPIC -mtune=generic -march=x86-64 -gdwarf-4 -fno-debug-types-section -fvar-tracking-assignments -g2 -DNDEBUG -DQT_NO_DEBUG -fPIC -o CMakeFiles/libzxing.dir/core/src/zxing/pdf417/decoder/BitMatrixParser.cpp.o -c /tmp/B.DiEiOw/BUILD/zxing-cpp-6b3cbe02a332bff0f5ba0416f221d3d3876afdc2/core/src/zxing/pdf417/decoder/BitMatrixParser.cpp make[2]: Leaving directory '/tmp/B.DiEiOw/BUILD/zxing-cpp-6b3cbe02a332bff0f5ba0416f221d3d3876afdc2/build' make[2]: Entering directory '/tmp/B.DiEiOw/BUILD/zxing-cpp-6b3cbe02a332bff0f5ba0416f221d3d3876afdc2/build' [ 62%] Building CXX object CMakeFiles/libzxing.dir/core/src/zxing/pdf417/decoder/ec/ModulusGF.cpp.o /usr/bin/x86_64-pld-linux-gnux32-g++ -Dlibzxing_EXPORTS -I/usr/include/opencv -I/tmp/B.DiEiOw/BUILD/zxing-cpp-6b3cbe02a332bff0f5ba0416f221d3d3876afdc2/./opencv/src -I/tmp/B.DiEiOw/BUILD/zxing-cpp-6b3cbe02a332bff0f5ba0416f221d3d3876afdc2/./core/src -O2 -fwrapv -pipe -Wformat -Werror=format-security -gdwarf-4 -fno-debug-types-section -fvar-tracking-assignments -g2 -Wp,-D_FORTIFY_SOURCE=2 -fstack-protector-strong --param=ssp-buffer-size=4 -fPIC -mtune=generic -march=x86-64 -gdwarf-4 -fno-debug-types-section -fvar-tracking-assignments -g2 -DNDEBUG -DQT_NO_DEBUG -fPIC -o CMakeFiles/libzxing.dir/core/src/zxing/pdf417/decoder/ec/ModulusGF.cpp.o -c /tmp/B.DiEiOw/BUILD/zxing-cpp-6b3cbe02a332bff0f5ba0416f221d3d3876afdc2/core/src/zxing/pdf417/decoder/ec/ModulusGF.cpp make[2]: Leaving directory '/tmp/B.DiEiOw/BUILD/zxing-cpp-6b3cbe02a332bff0f5ba0416f221d3d3876afdc2/build' make[2]: Entering directory '/tmp/B.DiEiOw/BUILD/zxing-cpp-6b3cbe02a332bff0f5ba0416f221d3d3876afdc2/build' [ 66%] Building CXX object CMakeFiles/libzxing.dir/core/src/zxing/qrcode/FormatInformation.cpp.o /usr/bin/x86_64-pld-linux-gnux32-g++ -Dlibzxing_EXPORTS -I/usr/include/opencv -I/tmp/B.DiEiOw/BUILD/zxing-cpp-6b3cbe02a332bff0f5ba0416f221d3d3876afdc2/./opencv/src -I/tmp/B.DiEiOw/BUILD/zxing-cpp-6b3cbe02a332bff0f5ba0416f221d3d3876afdc2/./core/src -O2 -fwrapv -pipe -Wformat -Werror=format-security -gdwarf-4 -fno-debug-types-section -fvar-tracking-assignments -g2 -Wp,-D_FORTIFY_SOURCE=2 -fstack-protector-strong --param=ssp-buffer-size=4 -fPIC -mtune=generic -march=x86-64 -gdwarf-4 -fno-debug-types-section -fvar-tracking-assignments -g2 -DNDEBUG -DQT_NO_DEBUG -fPIC -o CMakeFiles/libzxing.dir/core/src/zxing/qrcode/FormatInformation.cpp.o -c /tmp/B.DiEiOw/BUILD/zxing-cpp-6b3cbe02a332bff0f5ba0416f221d3d3876afdc2/core/src/zxing/qrcode/FormatInformation.cpp make[2]: Leaving directory '/tmp/B.DiEiOw/BUILD/zxing-cpp-6b3cbe02a332bff0f5ba0416f221d3d3876afdc2/build' make[2]: Entering directory '/tmp/B.DiEiOw/BUILD/zxing-cpp-6b3cbe02a332bff0f5ba0416f221d3d3876afdc2/build' [ 61%] Building CXX object CMakeFiles/libzxing.dir/core/src/zxing/pdf417/decoder/ec/ErrorCorrection.cpp.o /usr/bin/x86_64-pld-linux-gnux32-g++ -Dlibzxing_EXPORTS -I/usr/include/opencv -I/tmp/B.DiEiOw/BUILD/zxing-cpp-6b3cbe02a332bff0f5ba0416f221d3d3876afdc2/./opencv/src -I/tmp/B.DiEiOw/BUILD/zxing-cpp-6b3cbe02a332bff0f5ba0416f221d3d3876afdc2/./core/src -O2 -fwrapv -pipe -Wformat -Werror=format-security -gdwarf-4 -fno-debug-types-section -fvar-tracking-assignments -g2 -Wp,-D_FORTIFY_SOURCE=2 -fstack-protector-strong --param=ssp-buffer-size=4 -fPIC -mtune=generic -march=x86-64 -gdwarf-4 -fno-debug-types-section -fvar-tracking-assignments -g2 -DNDEBUG -DQT_NO_DEBUG -fPIC -o CMakeFiles/libzxing.dir/core/src/zxing/pdf417/decoder/ec/ErrorCorrection.cpp.o -c /tmp/B.DiEiOw/BUILD/zxing-cpp-6b3cbe02a332bff0f5ba0416f221d3d3876afdc2/core/src/zxing/pdf417/decoder/ec/ErrorCorrection.cpp make[2]: Leaving directory '/tmp/B.DiEiOw/BUILD/zxing-cpp-6b3cbe02a332bff0f5ba0416f221d3d3876afdc2/build' make[2]: Entering directory '/tmp/B.DiEiOw/BUILD/zxing-cpp-6b3cbe02a332bff0f5ba0416f221d3d3876afdc2/build' [ 65%] Building CXX object CMakeFiles/libzxing.dir/core/src/zxing/qrcode/ErrorCorrectionLevel.cpp.o /usr/bin/x86_64-pld-linux-gnux32-g++ -Dlibzxing_EXPORTS -I/usr/include/opencv -I/tmp/B.DiEiOw/BUILD/zxing-cpp-6b3cbe02a332bff0f5ba0416f221d3d3876afdc2/./opencv/src -I/tmp/B.DiEiOw/BUILD/zxing-cpp-6b3cbe02a332bff0f5ba0416f221d3d3876afdc2/./core/src -O2 -fwrapv -pipe -Wformat -Werror=format-security -gdwarf-4 -fno-debug-types-section -fvar-tracking-assignments -g2 -Wp,-D_FORTIFY_SOURCE=2 -fstack-protector-strong --param=ssp-buffer-size=4 -fPIC -mtune=generic -march=x86-64 -gdwarf-4 -fno-debug-types-section -fvar-tracking-assignments -g2 -DNDEBUG -DQT_NO_DEBUG -fPIC -o CMakeFiles/libzxing.dir/core/src/zxing/qrcode/ErrorCorrectionLevel.cpp.o -c /tmp/B.DiEiOw/BUILD/zxing-cpp-6b3cbe02a332bff0f5ba0416f221d3d3876afdc2/core/src/zxing/qrcode/ErrorCorrectionLevel.cpp make[2]: Leaving directory '/tmp/B.DiEiOw/BUILD/zxing-cpp-6b3cbe02a332bff0f5ba0416f221d3d3876afdc2/build' make[2]: Entering directory '/tmp/B.DiEiOw/BUILD/zxing-cpp-6b3cbe02a332bff0f5ba0416f221d3d3876afdc2/build' [ 59%] Building CXX object CMakeFiles/libzxing.dir/core/src/zxing/pdf417/decoder/DecodedBitStreamParser.cpp.o /usr/bin/x86_64-pld-linux-gnux32-g++ -Dlibzxing_EXPORTS -I/usr/include/opencv -I/tmp/B.DiEiOw/BUILD/zxing-cpp-6b3cbe02a332bff0f5ba0416f221d3d3876afdc2/./opencv/src -I/tmp/B.DiEiOw/BUILD/zxing-cpp-6b3cbe02a332bff0f5ba0416f221d3d3876afdc2/./core/src -O2 -fwrapv -pipe -Wformat -Werror=format-security -gdwarf-4 -fno-debug-types-section -fvar-tracking-assignments -g2 -Wp,-D_FORTIFY_SOURCE=2 -fstack-protector-strong --param=ssp-buffer-size=4 -fPIC -mtune=generic -march=x86-64 -gdwarf-4 -fno-debug-types-section -fvar-tracking-assignments -g2 -DNDEBUG -DQT_NO_DEBUG -fPIC -o CMakeFiles/libzxing.dir/core/src/zxing/pdf417/decoder/DecodedBitStreamParser.cpp.o -c /tmp/B.DiEiOw/BUILD/zxing-cpp-6b3cbe02a332bff0f5ba0416f221d3d3876afdc2/core/src/zxing/pdf417/decoder/DecodedBitStreamParser.cpp make[2]: Leaving directory '/tmp/B.DiEiOw/BUILD/zxing-cpp-6b3cbe02a332bff0f5ba0416f221d3d3876afdc2/build' make[2]: Entering directory '/tmp/B.DiEiOw/BUILD/zxing-cpp-6b3cbe02a332bff0f5ba0416f221d3d3876afdc2/build' [ 67%] Building CXX object CMakeFiles/libzxing.dir/core/src/zxing/qrcode/QRCodeReader.cpp.o /usr/bin/x86_64-pld-linux-gnux32-g++ -Dlibzxing_EXPORTS -I/usr/include/opencv -I/tmp/B.DiEiOw/BUILD/zxing-cpp-6b3cbe02a332bff0f5ba0416f221d3d3876afdc2/./opencv/src -I/tmp/B.DiEiOw/BUILD/zxing-cpp-6b3cbe02a332bff0f5ba0416f221d3d3876afdc2/./core/src -O2 -fwrapv -pipe -Wformat -Werror=format-security -gdwarf-4 -fno-debug-types-section -fvar-tracking-assignments -g2 -Wp,-D_FORTIFY_SOURCE=2 -fstack-protector-strong --param=ssp-buffer-size=4 -fPIC -mtune=generic -march=x86-64 -gdwarf-4 -fno-debug-types-section -fvar-tracking-assignments -g2 -DNDEBUG -DQT_NO_DEBUG -fPIC -o CMakeFiles/libzxing.dir/core/src/zxing/qrcode/QRCodeReader.cpp.o -c /tmp/B.DiEiOw/BUILD/zxing-cpp-6b3cbe02a332bff0f5ba0416f221d3d3876afdc2/core/src/zxing/qrcode/QRCodeReader.cpp make[2]: Leaving directory '/tmp/B.DiEiOw/BUILD/zxing-cpp-6b3cbe02a332bff0f5ba0416f221d3d3876afdc2/build' make[2]: Entering directory '/tmp/B.DiEiOw/BUILD/zxing-cpp-6b3cbe02a332bff0f5ba0416f221d3d3876afdc2/build' [ 63%] Building CXX object CMakeFiles/libzxing.dir/core/src/zxing/pdf417/decoder/ec/ModulusPoly.cpp.o /usr/bin/x86_64-pld-linux-gnux32-g++ -Dlibzxing_EXPORTS -I/usr/include/opencv -I/tmp/B.DiEiOw/BUILD/zxing-cpp-6b3cbe02a332bff0f5ba0416f221d3d3876afdc2/./opencv/src -I/tmp/B.DiEiOw/BUILD/zxing-cpp-6b3cbe02a332bff0f5ba0416f221d3d3876afdc2/./core/src -O2 -fwrapv -pipe -Wformat -Werror=format-security -gdwarf-4 -fno-debug-types-section -fvar-tracking-assignments -g2 -Wp,-D_FORTIFY_SOURCE=2 -fstack-protector-strong --param=ssp-buffer-size=4 -fPIC -mtune=generic -march=x86-64 -gdwarf-4 -fno-debug-types-section -fvar-tracking-assignments -g2 -DNDEBUG -DQT_NO_DEBUG -fPIC -o CMakeFiles/libzxing.dir/core/src/zxing/pdf417/decoder/ec/ModulusPoly.cpp.o -c /tmp/B.DiEiOw/BUILD/zxing-cpp-6b3cbe02a332bff0f5ba0416f221d3d3876afdc2/core/src/zxing/pdf417/decoder/ec/ModulusPoly.cpp make[2]: Leaving directory '/tmp/B.DiEiOw/BUILD/zxing-cpp-6b3cbe02a332bff0f5ba0416f221d3d3876afdc2/build' make[2]: Entering directory '/tmp/B.DiEiOw/BUILD/zxing-cpp-6b3cbe02a332bff0f5ba0416f221d3d3876afdc2/build' [ 70%] Building CXX object CMakeFiles/libzxing.dir/core/src/zxing/qrcode/decoder/DataMask.cpp.o /usr/bin/x86_64-pld-linux-gnux32-g++ -Dlibzxing_EXPORTS -I/usr/include/opencv -I/tmp/B.DiEiOw/BUILD/zxing-cpp-6b3cbe02a332bff0f5ba0416f221d3d3876afdc2/./opencv/src -I/tmp/B.DiEiOw/BUILD/zxing-cpp-6b3cbe02a332bff0f5ba0416f221d3d3876afdc2/./core/src -O2 -fwrapv -pipe -Wformat -Werror=format-security -gdwarf-4 -fno-debug-types-section -fvar-tracking-assignments -g2 -Wp,-D_FORTIFY_SOURCE=2 -fstack-protector-strong --param=ssp-buffer-size=4 -fPIC -mtune=generic -march=x86-64 -gdwarf-4 -fno-debug-types-section -fvar-tracking-assignments -g2 -DNDEBUG -DQT_NO_DEBUG -fPIC -o CMakeFiles/libzxing.dir/core/src/zxing/qrcode/decoder/DataMask.cpp.o -c /tmp/B.DiEiOw/BUILD/zxing-cpp-6b3cbe02a332bff0f5ba0416f221d3d3876afdc2/core/src/zxing/qrcode/decoder/DataMask.cpp make[2]: Leaving directory '/tmp/B.DiEiOw/BUILD/zxing-cpp-6b3cbe02a332bff0f5ba0416f221d3d3876afdc2/build' make[2]: Entering directory '/tmp/B.DiEiOw/BUILD/zxing-cpp-6b3cbe02a332bff0f5ba0416f221d3d3876afdc2/build' [ 69%] Building CXX object CMakeFiles/libzxing.dir/core/src/zxing/qrcode/decoder/DataBlock.cpp.o /usr/bin/x86_64-pld-linux-gnux32-g++ -Dlibzxing_EXPORTS -I/usr/include/opencv -I/tmp/B.DiEiOw/BUILD/zxing-cpp-6b3cbe02a332bff0f5ba0416f221d3d3876afdc2/./opencv/src -I/tmp/B.DiEiOw/BUILD/zxing-cpp-6b3cbe02a332bff0f5ba0416f221d3d3876afdc2/./core/src -O2 -fwrapv -pipe -Wformat -Werror=format-security -gdwarf-4 -fno-debug-types-section -fvar-tracking-assignments -g2 -Wp,-D_FORTIFY_SOURCE=2 -fstack-protector-strong --param=ssp-buffer-size=4 -fPIC -mtune=generic -march=x86-64 -gdwarf-4 -fno-debug-types-section -fvar-tracking-assignments -g2 -DNDEBUG -DQT_NO_DEBUG -fPIC -o CMakeFiles/libzxing.dir/core/src/zxing/qrcode/decoder/DataBlock.cpp.o -c /tmp/B.DiEiOw/BUILD/zxing-cpp-6b3cbe02a332bff0f5ba0416f221d3d3876afdc2/core/src/zxing/qrcode/decoder/DataBlock.cpp make[2]: Leaving directory '/tmp/B.DiEiOw/BUILD/zxing-cpp-6b3cbe02a332bff0f5ba0416f221d3d3876afdc2/build' make[2]: Entering directory '/tmp/B.DiEiOw/BUILD/zxing-cpp-6b3cbe02a332bff0f5ba0416f221d3d3876afdc2/build' [ 68%] Building CXX object CMakeFiles/libzxing.dir/core/src/zxing/qrcode/decoder/BitMatrixParser.cpp.o /usr/bin/x86_64-pld-linux-gnux32-g++ -Dlibzxing_EXPORTS -I/usr/include/opencv -I/tmp/B.DiEiOw/BUILD/zxing-cpp-6b3cbe02a332bff0f5ba0416f221d3d3876afdc2/./opencv/src -I/tmp/B.DiEiOw/BUILD/zxing-cpp-6b3cbe02a332bff0f5ba0416f221d3d3876afdc2/./core/src -O2 -fwrapv -pipe -Wformat -Werror=format-security -gdwarf-4 -fno-debug-types-section -fvar-tracking-assignments -g2 -Wp,-D_FORTIFY_SOURCE=2 -fstack-protector-strong --param=ssp-buffer-size=4 -fPIC -mtune=generic -march=x86-64 -gdwarf-4 -fno-debug-types-section -fvar-tracking-assignments -g2 -DNDEBUG -DQT_NO_DEBUG -fPIC -o CMakeFiles/libzxing.dir/core/src/zxing/qrcode/decoder/BitMatrixParser.cpp.o -c /tmp/B.DiEiOw/BUILD/zxing-cpp-6b3cbe02a332bff0f5ba0416f221d3d3876afdc2/core/src/zxing/qrcode/decoder/BitMatrixParser.cpp make[2]: Leaving directory '/tmp/B.DiEiOw/BUILD/zxing-cpp-6b3cbe02a332bff0f5ba0416f221d3d3876afdc2/build' make[2]: Entering directory '/tmp/B.DiEiOw/BUILD/zxing-cpp-6b3cbe02a332bff0f5ba0416f221d3d3876afdc2/build' [ 73%] Building CXX object CMakeFiles/libzxing.dir/core/src/zxing/qrcode/detector/AlignmentPattern.cpp.o /usr/bin/x86_64-pld-linux-gnux32-g++ -Dlibzxing_EXPORTS -I/usr/include/opencv -I/tmp/B.DiEiOw/BUILD/zxing-cpp-6b3cbe02a332bff0f5ba0416f221d3d3876afdc2/./opencv/src -I/tmp/B.DiEiOw/BUILD/zxing-cpp-6b3cbe02a332bff0f5ba0416f221d3d3876afdc2/./core/src -O2 -fwrapv -pipe -Wformat -Werror=format-security -gdwarf-4 -fno-debug-types-section -fvar-tracking-assignments -g2 -Wp,-D_FORTIFY_SOURCE=2 -fstack-protector-strong --param=ssp-buffer-size=4 -fPIC -mtune=generic -march=x86-64 -gdwarf-4 -fno-debug-types-section -fvar-tracking-assignments -g2 -DNDEBUG -DQT_NO_DEBUG -fPIC -o CMakeFiles/libzxing.dir/core/src/zxing/qrcode/detector/AlignmentPattern.cpp.o -c /tmp/B.DiEiOw/BUILD/zxing-cpp-6b3cbe02a332bff0f5ba0416f221d3d3876afdc2/core/src/zxing/qrcode/detector/AlignmentPattern.cpp make[2]: Leaving directory '/tmp/B.DiEiOw/BUILD/zxing-cpp-6b3cbe02a332bff0f5ba0416f221d3d3876afdc2/build' make[2]: Entering directory '/tmp/B.DiEiOw/BUILD/zxing-cpp-6b3cbe02a332bff0f5ba0416f221d3d3876afdc2/build' [ 72%] Building CXX object CMakeFiles/libzxing.dir/core/src/zxing/qrcode/decoder/Mode.cpp.o /usr/bin/x86_64-pld-linux-gnux32-g++ -Dlibzxing_EXPORTS -I/usr/include/opencv -I/tmp/B.DiEiOw/BUILD/zxing-cpp-6b3cbe02a332bff0f5ba0416f221d3d3876afdc2/./opencv/src -I/tmp/B.DiEiOw/BUILD/zxing-cpp-6b3cbe02a332bff0f5ba0416f221d3d3876afdc2/./core/src -O2 -fwrapv -pipe -Wformat -Werror=format-security -gdwarf-4 -fno-debug-types-section -fvar-tracking-assignments -g2 -Wp,-D_FORTIFY_SOURCE=2 -fstack-protector-strong --param=ssp-buffer-size=4 -fPIC -mtune=generic -march=x86-64 -gdwarf-4 -fno-debug-types-section -fvar-tracking-assignments -g2 -DNDEBUG -DQT_NO_DEBUG -fPIC -o CMakeFiles/libzxing.dir/core/src/zxing/qrcode/decoder/Mode.cpp.o -c /tmp/B.DiEiOw/BUILD/zxing-cpp-6b3cbe02a332bff0f5ba0416f221d3d3876afdc2/core/src/zxing/qrcode/decoder/Mode.cpp make[2]: Leaving directory '/tmp/B.DiEiOw/BUILD/zxing-cpp-6b3cbe02a332bff0f5ba0416f221d3d3876afdc2/build' make[2]: Entering directory '/tmp/B.DiEiOw/BUILD/zxing-cpp-6b3cbe02a332bff0f5ba0416f221d3d3876afdc2/build' [ 63%] Building CXX object CMakeFiles/libzxing.dir/core/src/zxing/pdf417/detector/Detector.cpp.o /usr/bin/x86_64-pld-linux-gnux32-g++ -Dlibzxing_EXPORTS -I/usr/include/opencv -I/tmp/B.DiEiOw/BUILD/zxing-cpp-6b3cbe02a332bff0f5ba0416f221d3d3876afdc2/./opencv/src -I/tmp/B.DiEiOw/BUILD/zxing-cpp-6b3cbe02a332bff0f5ba0416f221d3d3876afdc2/./core/src -O2 -fwrapv -pipe -Wformat -Werror=format-security -gdwarf-4 -fno-debug-types-section -fvar-tracking-assignments -g2 -Wp,-D_FORTIFY_SOURCE=2 -fstack-protector-strong --param=ssp-buffer-size=4 -fPIC -mtune=generic -march=x86-64 -gdwarf-4 -fno-debug-types-section -fvar-tracking-assignments -g2 -DNDEBUG -DQT_NO_DEBUG -fPIC -o CMakeFiles/libzxing.dir/core/src/zxing/pdf417/detector/Detector.cpp.o -c /tmp/B.DiEiOw/BUILD/zxing-cpp-6b3cbe02a332bff0f5ba0416f221d3d3876afdc2/core/src/zxing/pdf417/detector/Detector.cpp make[2]: Leaving directory '/tmp/B.DiEiOw/BUILD/zxing-cpp-6b3cbe02a332bff0f5ba0416f221d3d3876afdc2/build' make[2]: Entering directory '/tmp/B.DiEiOw/BUILD/zxing-cpp-6b3cbe02a332bff0f5ba0416f221d3d3876afdc2/build' [ 71%] Building CXX object CMakeFiles/libzxing.dir/core/src/zxing/qrcode/decoder/DecodedBitStreamParser.cpp.o /usr/bin/x86_64-pld-linux-gnux32-g++ -Dlibzxing_EXPORTS -I/usr/include/opencv -I/tmp/B.DiEiOw/BUILD/zxing-cpp-6b3cbe02a332bff0f5ba0416f221d3d3876afdc2/./opencv/src -I/tmp/B.DiEiOw/BUILD/zxing-cpp-6b3cbe02a332bff0f5ba0416f221d3d3876afdc2/./core/src -O2 -fwrapv -pipe -Wformat -Werror=format-security -gdwarf-4 -fno-debug-types-section -fvar-tracking-assignments -g2 -Wp,-D_FORTIFY_SOURCE=2 -fstack-protector-strong --param=ssp-buffer-size=4 -fPIC -mtune=generic -march=x86-64 -gdwarf-4 -fno-debug-types-section -fvar-tracking-assignments -g2 -DNDEBUG -DQT_NO_DEBUG -fPIC -o CMakeFiles/libzxing.dir/core/src/zxing/qrcode/decoder/DecodedBitStreamParser.cpp.o -c /tmp/B.DiEiOw/BUILD/zxing-cpp-6b3cbe02a332bff0f5ba0416f221d3d3876afdc2/core/src/zxing/qrcode/decoder/DecodedBitStreamParser.cpp make[2]: Leaving directory '/tmp/B.DiEiOw/BUILD/zxing-cpp-6b3cbe02a332bff0f5ba0416f221d3d3876afdc2/build' make[2]: Entering directory '/tmp/B.DiEiOw/BUILD/zxing-cpp-6b3cbe02a332bff0f5ba0416f221d3d3876afdc2/build' [ 74%] Building CXX object CMakeFiles/libzxing.dir/core/src/zxing/qrcode/detector/AlignmentPatternFinder.cpp.o /usr/bin/x86_64-pld-linux-gnux32-g++ -Dlibzxing_EXPORTS -I/usr/include/opencv -I/tmp/B.DiEiOw/BUILD/zxing-cpp-6b3cbe02a332bff0f5ba0416f221d3d3876afdc2/./opencv/src -I/tmp/B.DiEiOw/BUILD/zxing-cpp-6b3cbe02a332bff0f5ba0416f221d3d3876afdc2/./core/src -O2 -fwrapv -pipe -Wformat -Werror=format-security -gdwarf-4 -fno-debug-types-section -fvar-tracking-assignments -g2 -Wp,-D_FORTIFY_SOURCE=2 -fstack-protector-strong --param=ssp-buffer-size=4 -fPIC -mtune=generic -march=x86-64 -gdwarf-4 -fno-debug-types-section -fvar-tracking-assignments -g2 -DNDEBUG -DQT_NO_DEBUG -fPIC -o CMakeFiles/libzxing.dir/core/src/zxing/qrcode/detector/AlignmentPatternFinder.cpp.o -c /tmp/B.DiEiOw/BUILD/zxing-cpp-6b3cbe02a332bff0f5ba0416f221d3d3876afdc2/core/src/zxing/qrcode/detector/AlignmentPatternFinder.cpp make[2]: Leaving directory '/tmp/B.DiEiOw/BUILD/zxing-cpp-6b3cbe02a332bff0f5ba0416f221d3d3876afdc2/build' make[2]: Entering directory '/tmp/B.DiEiOw/BUILD/zxing-cpp-6b3cbe02a332bff0f5ba0416f221d3d3876afdc2/build' [ 76%] Building CXX object CMakeFiles/libzxing.dir/core/src/zxing/qrcode/detector/FinderPattern.cpp.o /usr/bin/x86_64-pld-linux-gnux32-g++ -Dlibzxing_EXPORTS -I/usr/include/opencv -I/tmp/B.DiEiOw/BUILD/zxing-cpp-6b3cbe02a332bff0f5ba0416f221d3d3876afdc2/./opencv/src -I/tmp/B.DiEiOw/BUILD/zxing-cpp-6b3cbe02a332bff0f5ba0416f221d3d3876afdc2/./core/src -O2 -fwrapv -pipe -Wformat -Werror=format-security -gdwarf-4 -fno-debug-types-section -fvar-tracking-assignments -g2 -Wp,-D_FORTIFY_SOURCE=2 -fstack-protector-strong --param=ssp-buffer-size=4 -fPIC -mtune=generic -march=x86-64 -gdwarf-4 -fno-debug-types-section -fvar-tracking-assignments -g2 -DNDEBUG -DQT_NO_DEBUG -fPIC -o CMakeFiles/libzxing.dir/core/src/zxing/qrcode/detector/FinderPattern.cpp.o -c /tmp/B.DiEiOw/BUILD/zxing-cpp-6b3cbe02a332bff0f5ba0416f221d3d3876afdc2/core/src/zxing/qrcode/detector/FinderPattern.cpp make[2]: Leaving directory '/tmp/B.DiEiOw/BUILD/zxing-cpp-6b3cbe02a332bff0f5ba0416f221d3d3876afdc2/build' make[2]: Entering directory '/tmp/B.DiEiOw/BUILD/zxing-cpp-6b3cbe02a332bff0f5ba0416f221d3d3876afdc2/build' [ 72%] Building CXX object CMakeFiles/libzxing.dir/core/src/zxing/qrcode/decoder/Decoder.cpp.o /usr/bin/x86_64-pld-linux-gnux32-g++ -Dlibzxing_EXPORTS -I/usr/include/opencv -I/tmp/B.DiEiOw/BUILD/zxing-cpp-6b3cbe02a332bff0f5ba0416f221d3d3876afdc2/./opencv/src -I/tmp/B.DiEiOw/BUILD/zxing-cpp-6b3cbe02a332bff0f5ba0416f221d3d3876afdc2/./core/src -O2 -fwrapv -pipe -Wformat -Werror=format-security -gdwarf-4 -fno-debug-types-section -fvar-tracking-assignments -g2 -Wp,-D_FORTIFY_SOURCE=2 -fstack-protector-strong --param=ssp-buffer-size=4 -fPIC -mtune=generic -march=x86-64 -gdwarf-4 -fno-debug-types-section -fvar-tracking-assignments -g2 -DNDEBUG -DQT_NO_DEBUG -fPIC -o CMakeFiles/libzxing.dir/core/src/zxing/qrcode/decoder/Decoder.cpp.o -c /tmp/B.DiEiOw/BUILD/zxing-cpp-6b3cbe02a332bff0f5ba0416f221d3d3876afdc2/core/src/zxing/qrcode/decoder/Decoder.cpp make[2]: Leaving directory '/tmp/B.DiEiOw/BUILD/zxing-cpp-6b3cbe02a332bff0f5ba0416f221d3d3876afdc2/build' make[2]: Entering directory '/tmp/B.DiEiOw/BUILD/zxing-cpp-6b3cbe02a332bff0f5ba0416f221d3d3876afdc2/build' [ 79%] Building CXX object CMakeFiles/libzxing.dir/core/src/bigint/BigIntegerAlgorithms.cc.o /usr/bin/x86_64-pld-linux-gnux32-g++ -Dlibzxing_EXPORTS -I/usr/include/opencv -I/tmp/B.DiEiOw/BUILD/zxing-cpp-6b3cbe02a332bff0f5ba0416f221d3d3876afdc2/./opencv/src -I/tmp/B.DiEiOw/BUILD/zxing-cpp-6b3cbe02a332bff0f5ba0416f221d3d3876afdc2/./core/src -O2 -fwrapv -pipe -Wformat -Werror=format-security -gdwarf-4 -fno-debug-types-section -fvar-tracking-assignments -g2 -Wp,-D_FORTIFY_SOURCE=2 -fstack-protector-strong --param=ssp-buffer-size=4 -fPIC -mtune=generic -march=x86-64 -gdwarf-4 -fno-debug-types-section -fvar-tracking-assignments -g2 -DNDEBUG -DQT_NO_DEBUG -fPIC -o CMakeFiles/libzxing.dir/core/src/bigint/BigIntegerAlgorithms.cc.o -c /tmp/B.DiEiOw/BUILD/zxing-cpp-6b3cbe02a332bff0f5ba0416f221d3d3876afdc2/core/src/bigint/BigIntegerAlgorithms.cc make[2]: Leaving directory '/tmp/B.DiEiOw/BUILD/zxing-cpp-6b3cbe02a332bff0f5ba0416f221d3d3876afdc2/build' make[2]: Entering directory '/tmp/B.DiEiOw/BUILD/zxing-cpp-6b3cbe02a332bff0f5ba0416f221d3d3876afdc2/build' [ 78%] Building CXX object CMakeFiles/libzxing.dir/core/src/bigint/BigInteger.cc.o /usr/bin/x86_64-pld-linux-gnux32-g++ -Dlibzxing_EXPORTS -I/usr/include/opencv -I/tmp/B.DiEiOw/BUILD/zxing-cpp-6b3cbe02a332bff0f5ba0416f221d3d3876afdc2/./opencv/src -I/tmp/B.DiEiOw/BUILD/zxing-cpp-6b3cbe02a332bff0f5ba0416f221d3d3876afdc2/./core/src -O2 -fwrapv -pipe -Wformat -Werror=format-security -gdwarf-4 -fno-debug-types-section -fvar-tracking-assignments -g2 -Wp,-D_FORTIFY_SOURCE=2 -fstack-protector-strong --param=ssp-buffer-size=4 -fPIC -mtune=generic -march=x86-64 -gdwarf-4 -fno-debug-types-section -fvar-tracking-assignments -g2 -DNDEBUG -DQT_NO_DEBUG -fPIC -o CMakeFiles/libzxing.dir/core/src/bigint/BigInteger.cc.o -c /tmp/B.DiEiOw/BUILD/zxing-cpp-6b3cbe02a332bff0f5ba0416f221d3d3876afdc2/core/src/bigint/BigInteger.cc make[2]: Leaving directory '/tmp/B.DiEiOw/BUILD/zxing-cpp-6b3cbe02a332bff0f5ba0416f221d3d3876afdc2/build' make[2]: Entering directory '/tmp/B.DiEiOw/BUILD/zxing-cpp-6b3cbe02a332bff0f5ba0416f221d3d3876afdc2/build' [ 77%] Building CXX object CMakeFiles/libzxing.dir/core/src/zxing/qrcode/detector/FinderPatternInfo.cpp.o /usr/bin/x86_64-pld-linux-gnux32-g++ -Dlibzxing_EXPORTS -I/usr/include/opencv -I/tmp/B.DiEiOw/BUILD/zxing-cpp-6b3cbe02a332bff0f5ba0416f221d3d3876afdc2/./opencv/src -I/tmp/B.DiEiOw/BUILD/zxing-cpp-6b3cbe02a332bff0f5ba0416f221d3d3876afdc2/./core/src -O2 -fwrapv -pipe -Wformat -Werror=format-security -gdwarf-4 -fno-debug-types-section -fvar-tracking-assignments -g2 -Wp,-D_FORTIFY_SOURCE=2 -fstack-protector-strong --param=ssp-buffer-size=4 -fPIC -mtune=generic -march=x86-64 -gdwarf-4 -fno-debug-types-section -fvar-tracking-assignments -g2 -DNDEBUG -DQT_NO_DEBUG -fPIC -o CMakeFiles/libzxing.dir/core/src/zxing/qrcode/detector/FinderPatternInfo.cpp.o -c /tmp/B.DiEiOw/BUILD/zxing-cpp-6b3cbe02a332bff0f5ba0416f221d3d3876afdc2/core/src/zxing/qrcode/detector/FinderPatternInfo.cpp make[2]: Leaving directory '/tmp/B.DiEiOw/BUILD/zxing-cpp-6b3cbe02a332bff0f5ba0416f221d3d3876afdc2/build' make[2]: Entering directory '/tmp/B.DiEiOw/BUILD/zxing-cpp-6b3cbe02a332bff0f5ba0416f221d3d3876afdc2/build' [ 68%] Building CXX object CMakeFiles/libzxing.dir/core/src/zxing/qrcode/Version.cpp.o /usr/bin/x86_64-pld-linux-gnux32-g++ -Dlibzxing_EXPORTS -I/usr/include/opencv -I/tmp/B.DiEiOw/BUILD/zxing-cpp-6b3cbe02a332bff0f5ba0416f221d3d3876afdc2/./opencv/src -I/tmp/B.DiEiOw/BUILD/zxing-cpp-6b3cbe02a332bff0f5ba0416f221d3d3876afdc2/./core/src -O2 -fwrapv -pipe -Wformat -Werror=format-security -gdwarf-4 -fno-debug-types-section -fvar-tracking-assignments -g2 -Wp,-D_FORTIFY_SOURCE=2 -fstack-protector-strong --param=ssp-buffer-size=4 -fPIC -mtune=generic -march=x86-64 -gdwarf-4 -fno-debug-types-section -fvar-tracking-assignments -g2 -DNDEBUG -DQT_NO_DEBUG -fPIC -o CMakeFiles/libzxing.dir/core/src/zxing/qrcode/Version.cpp.o -c /tmp/B.DiEiOw/BUILD/zxing-cpp-6b3cbe02a332bff0f5ba0416f221d3d3876afdc2/core/src/zxing/qrcode/Version.cpp make[2]: Leaving directory '/tmp/B.DiEiOw/BUILD/zxing-cpp-6b3cbe02a332bff0f5ba0416f221d3d3876afdc2/build' make[2]: Entering directory '/tmp/B.DiEiOw/BUILD/zxing-cpp-6b3cbe02a332bff0f5ba0416f221d3d3876afdc2/build' [ 75%] Building CXX object CMakeFiles/libzxing.dir/core/src/zxing/qrcode/detector/Detector.cpp.o /usr/bin/x86_64-pld-linux-gnux32-g++ -Dlibzxing_EXPORTS -I/usr/include/opencv -I/tmp/B.DiEiOw/BUILD/zxing-cpp-6b3cbe02a332bff0f5ba0416f221d3d3876afdc2/./opencv/src -I/tmp/B.DiEiOw/BUILD/zxing-cpp-6b3cbe02a332bff0f5ba0416f221d3d3876afdc2/./core/src -O2 -fwrapv -pipe -Wformat -Werror=format-security -gdwarf-4 -fno-debug-types-section -fvar-tracking-assignments -g2 -Wp,-D_FORTIFY_SOURCE=2 -fstack-protector-strong --param=ssp-buffer-size=4 -fPIC -mtune=generic -march=x86-64 -gdwarf-4 -fno-debug-types-section -fvar-tracking-assignments -g2 -DNDEBUG -DQT_NO_DEBUG -fPIC -o CMakeFiles/libzxing.dir/core/src/zxing/qrcode/detector/Detector.cpp.o -c /tmp/B.DiEiOw/BUILD/zxing-cpp-6b3cbe02a332bff0f5ba0416f221d3d3876afdc2/core/src/zxing/qrcode/detector/Detector.cpp make[2]: Leaving directory '/tmp/B.DiEiOw/BUILD/zxing-cpp-6b3cbe02a332bff0f5ba0416f221d3d3876afdc2/build' make[2]: Entering directory '/tmp/B.DiEiOw/BUILD/zxing-cpp-6b3cbe02a332bff0f5ba0416f221d3d3876afdc2/build' [ 80%] Building CXX object CMakeFiles/libzxing.dir/core/src/bigint/BigIntegerUtils.cc.o /usr/bin/x86_64-pld-linux-gnux32-g++ -Dlibzxing_EXPORTS -I/usr/include/opencv -I/tmp/B.DiEiOw/BUILD/zxing-cpp-6b3cbe02a332bff0f5ba0416f221d3d3876afdc2/./opencv/src -I/tmp/B.DiEiOw/BUILD/zxing-cpp-6b3cbe02a332bff0f5ba0416f221d3d3876afdc2/./core/src -O2 -fwrapv -pipe -Wformat -Werror=format-security -gdwarf-4 -fno-debug-types-section -fvar-tracking-assignments -g2 -Wp,-D_FORTIFY_SOURCE=2 -fstack-protector-strong --param=ssp-buffer-size=4 -fPIC -mtune=generic -march=x86-64 -gdwarf-4 -fno-debug-types-section -fvar-tracking-assignments -g2 -DNDEBUG -DQT_NO_DEBUG -fPIC -o CMakeFiles/libzxing.dir/core/src/bigint/BigIntegerUtils.cc.o -c /tmp/B.DiEiOw/BUILD/zxing-cpp-6b3cbe02a332bff0f5ba0416f221d3d3876afdc2/core/src/bigint/BigIntegerUtils.cc make[2]: Leaving directory '/tmp/B.DiEiOw/BUILD/zxing-cpp-6b3cbe02a332bff0f5ba0416f221d3d3876afdc2/build' make[2]: Entering directory '/tmp/B.DiEiOw/BUILD/zxing-cpp-6b3cbe02a332bff0f5ba0416f221d3d3876afdc2/build' [ 64%] Building CXX object CMakeFiles/libzxing.dir/core/src/zxing/pdf417/detector/LinesSampler.cpp.o /usr/bin/x86_64-pld-linux-gnux32-g++ -Dlibzxing_EXPORTS -I/usr/include/opencv -I/tmp/B.DiEiOw/BUILD/zxing-cpp-6b3cbe02a332bff0f5ba0416f221d3d3876afdc2/./opencv/src -I/tmp/B.DiEiOw/BUILD/zxing-cpp-6b3cbe02a332bff0f5ba0416f221d3d3876afdc2/./core/src -O2 -fwrapv -pipe -Wformat -Werror=format-security -gdwarf-4 -fno-debug-types-section -fvar-tracking-assignments -g2 -Wp,-D_FORTIFY_SOURCE=2 -fstack-protector-strong --param=ssp-buffer-size=4 -fPIC -mtune=generic -march=x86-64 -gdwarf-4 -fno-debug-types-section -fvar-tracking-assignments -g2 -DNDEBUG -DQT_NO_DEBUG -fPIC -o CMakeFiles/libzxing.dir/core/src/zxing/pdf417/detector/LinesSampler.cpp.o -c /tmp/B.DiEiOw/BUILD/zxing-cpp-6b3cbe02a332bff0f5ba0416f221d3d3876afdc2/core/src/zxing/pdf417/detector/LinesSampler.cpp make[2]: Leaving directory '/tmp/B.DiEiOw/BUILD/zxing-cpp-6b3cbe02a332bff0f5ba0416f221d3d3876afdc2/build' make[2]: Entering directory '/tmp/B.DiEiOw/BUILD/zxing-cpp-6b3cbe02a332bff0f5ba0416f221d3d3876afdc2/build' [ 81%] Building CXX object CMakeFiles/libzxing.dir/core/src/bigint/BigUnsigned.cc.o /usr/bin/x86_64-pld-linux-gnux32-g++ -Dlibzxing_EXPORTS -I/usr/include/opencv -I/tmp/B.DiEiOw/BUILD/zxing-cpp-6b3cbe02a332bff0f5ba0416f221d3d3876afdc2/./opencv/src -I/tmp/B.DiEiOw/BUILD/zxing-cpp-6b3cbe02a332bff0f5ba0416f221d3d3876afdc2/./core/src -O2 -fwrapv -pipe -Wformat -Werror=format-security -gdwarf-4 -fno-debug-types-section -fvar-tracking-assignments -g2 -Wp,-D_FORTIFY_SOURCE=2 -fstack-protector-strong --param=ssp-buffer-size=4 -fPIC -mtune=generic -march=x86-64 -gdwarf-4 -fno-debug-types-section -fvar-tracking-assignments -g2 -DNDEBUG -DQT_NO_DEBUG -fPIC -o CMakeFiles/libzxing.dir/core/src/bigint/BigUnsigned.cc.o -c /tmp/B.DiEiOw/BUILD/zxing-cpp-6b3cbe02a332bff0f5ba0416f221d3d3876afdc2/core/src/bigint/BigUnsigned.cc make[2]: Leaving directory '/tmp/B.DiEiOw/BUILD/zxing-cpp-6b3cbe02a332bff0f5ba0416f221d3d3876afdc2/build' make[2]: Entering directory '/tmp/B.DiEiOw/BUILD/zxing-cpp-6b3cbe02a332bff0f5ba0416f221d3d3876afdc2/build' [ 81%] Building CXX object CMakeFiles/libzxing.dir/core/src/bigint/BigUnsignedInABase.cc.o /usr/bin/x86_64-pld-linux-gnux32-g++ -Dlibzxing_EXPORTS -I/usr/include/opencv -I/tmp/B.DiEiOw/BUILD/zxing-cpp-6b3cbe02a332bff0f5ba0416f221d3d3876afdc2/./opencv/src -I/tmp/B.DiEiOw/BUILD/zxing-cpp-6b3cbe02a332bff0f5ba0416f221d3d3876afdc2/./core/src -O2 -fwrapv -pipe -Wformat -Werror=format-security -gdwarf-4 -fno-debug-types-section -fvar-tracking-assignments -g2 -Wp,-D_FORTIFY_SOURCE=2 -fstack-protector-strong --param=ssp-buffer-size=4 -fPIC -mtune=generic -march=x86-64 -gdwarf-4 -fno-debug-types-section -fvar-tracking-assignments -g2 -DNDEBUG -DQT_NO_DEBUG -fPIC -o CMakeFiles/libzxing.dir/core/src/bigint/BigUnsignedInABase.cc.o -c /tmp/B.DiEiOw/BUILD/zxing-cpp-6b3cbe02a332bff0f5ba0416f221d3d3876afdc2/core/src/bigint/BigUnsignedInABase.cc make[2]: Leaving directory '/tmp/B.DiEiOw/BUILD/zxing-cpp-6b3cbe02a332bff0f5ba0416f221d3d3876afdc2/build' make[2]: Entering directory '/tmp/B.DiEiOw/BUILD/zxing-cpp-6b3cbe02a332bff0f5ba0416f221d3d3876afdc2/build' [ 82%] Building CXX object CMakeFiles/libzxing.dir/opencv/src/zxing/MatSource.cpp.o /usr/bin/x86_64-pld-linux-gnux32-g++ -Dlibzxing_EXPORTS -I/usr/include/opencv -I/tmp/B.DiEiOw/BUILD/zxing-cpp-6b3cbe02a332bff0f5ba0416f221d3d3876afdc2/./opencv/src -I/tmp/B.DiEiOw/BUILD/zxing-cpp-6b3cbe02a332bff0f5ba0416f221d3d3876afdc2/./core/src -O2 -fwrapv -pipe -Wformat -Werror=format-security -gdwarf-4 -fno-debug-types-section -fvar-tracking-assignments -g2 -Wp,-D_FORTIFY_SOURCE=2 -fstack-protector-strong --param=ssp-buffer-size=4 -fPIC -mtune=generic -march=x86-64 -gdwarf-4 -fno-debug-types-section -fvar-tracking-assignments -g2 -DNDEBUG -DQT_NO_DEBUG -fPIC -o CMakeFiles/libzxing.dir/opencv/src/zxing/MatSource.cpp.o -c /tmp/B.DiEiOw/BUILD/zxing-cpp-6b3cbe02a332bff0f5ba0416f221d3d3876afdc2/opencv/src/zxing/MatSource.cpp make[2]: Leaving directory '/tmp/B.DiEiOw/BUILD/zxing-cpp-6b3cbe02a332bff0f5ba0416f221d3d3876afdc2/build' make[2]: Entering directory '/tmp/B.DiEiOw/BUILD/zxing-cpp-6b3cbe02a332bff0f5ba0416f221d3d3876afdc2/build' [ 77%] Building CXX object CMakeFiles/libzxing.dir/core/src/zxing/qrcode/detector/FinderPatternFinder.cpp.o /usr/bin/x86_64-pld-linux-gnux32-g++ -Dlibzxing_EXPORTS -I/usr/include/opencv -I/tmp/B.DiEiOw/BUILD/zxing-cpp-6b3cbe02a332bff0f5ba0416f221d3d3876afdc2/./opencv/src -I/tmp/B.DiEiOw/BUILD/zxing-cpp-6b3cbe02a332bff0f5ba0416f221d3d3876afdc2/./core/src -O2 -fwrapv -pipe -Wformat -Werror=format-security -gdwarf-4 -fno-debug-types-section -fvar-tracking-assignments -g2 -Wp,-D_FORTIFY_SOURCE=2 -fstack-protector-strong --param=ssp-buffer-size=4 -fPIC -mtune=generic -march=x86-64 -gdwarf-4 -fno-debug-types-section -fvar-tracking-assignments -g2 -DNDEBUG -DQT_NO_DEBUG -fPIC -o CMakeFiles/libzxing.dir/core/src/zxing/qrcode/detector/FinderPatternFinder.cpp.o -c /tmp/B.DiEiOw/BUILD/zxing-cpp-6b3cbe02a332bff0f5ba0416f221d3d3876afdc2/core/src/zxing/qrcode/detector/FinderPatternFinder.cpp make[2]: Leaving directory '/tmp/B.DiEiOw/BUILD/zxing-cpp-6b3cbe02a332bff0f5ba0416f221d3d3876afdc2/build' make[2]: Entering directory '/tmp/B.DiEiOw/BUILD/zxing-cpp-6b3cbe02a332bff0f5ba0416f221d3d3876afdc2/build' [ 83%] Linking CXX shared library libzxing.so /usr/bin/cmake -E cmake_link_script CMakeFiles/libzxing.dir/link.txt --verbose=1 /usr/bin/x86_64-pld-linux-gnux32-g++ -fPIC -O2 -fwrapv -pipe -Wformat -Werror=format-security -gdwarf-4 -fno-debug-types-section -fvar-tracking-assignments -g2 -Wp,-D_FORTIFY_SOURCE=2 -fstack-protector-strong --param=ssp-buffer-size=4 -fPIC -mtune=generic -march=x86-64 -gdwarf-4 -fno-debug-types-section -fvar-tracking-assignments -g2 -DNDEBUG -DQT_NO_DEBUG -Wl,--as-needed -Wl,--no-copy-dt-needed-entries -Wl,-z,relro -Wl,-z,combreloc -shared -Wl,-soname,libzxing.so.0 -o libzxing.so.0 CMakeFiles/libzxing.dir/core/src/zxing/BarcodeFormat.cpp.o CMakeFiles/libzxing.dir/core/src/zxing/Binarizer.cpp.o CMakeFiles/libzxing.dir/core/src/zxing/BinaryBitmap.cpp.o CMakeFiles/libzxing.dir/core/src/zxing/ChecksumException.cpp.o CMakeFiles/libzxing.dir/core/src/zxing/DecodeHints.cpp.o CMakeFiles/libzxing.dir/core/src/zxing/Exception.cpp.o CMakeFiles/libzxing.dir/core/src/zxing/FormatException.cpp.o CMakeFiles/libzxing.dir/core/src/zxing/InvertedLuminanceSource.cpp.o CMakeFiles/libzxing.dir/core/src/zxing/LuminanceSource.cpp.o CMakeFiles/libzxing.dir/core/src/zxing/MultiFormatReader.cpp.o CMakeFiles/libzxing.dir/core/src/zxing/Reader.cpp.o CMakeFiles/libzxing.dir/core/src/zxing/Result.cpp.o CMakeFiles/libzxing.dir/core/src/zxing/ResultIO.cpp.o CMakeFiles/libzxing.dir/core/src/zxing/ResultPoint.cpp.o CMakeFiles/libzxing.dir/core/src/zxing/ResultPointCallback.cpp.o CMakeFiles/libzxing.dir/core/src/zxing/aztec/AztecDetectorResult.cpp.o CMakeFiles/libzxing.dir/core/src/zxing/aztec/AztecReader.cpp.o CMakeFiles/libzxing.dir/core/src/zxing/aztec/decoder/Decoder.cpp.o CMakeFiles/libzxing.dir/core/src/zxing/aztec/detector/Detector.cpp.o CMakeFiles/libzxing.dir/core/src/zxing/common/BitArray.cpp.o CMakeFiles/libzxing.dir/core/src/zxing/common/BitArrayIO.cpp.o CMakeFiles/libzxing.dir/core/src/zxing/common/BitMatrix.cpp.o CMakeFiles/libzxing.dir/core/src/zxing/common/BitSource.cpp.o CMakeFiles/libzxing.dir/core/src/zxing/common/CharacterSetECI.cpp.o CMakeFiles/libzxing.dir/core/src/zxing/common/DecoderResult.cpp.o CMakeFiles/libzxing.dir/core/src/zxing/common/DetectorResult.cpp.o CMakeFiles/libzxing.dir/core/src/zxing/common/GlobalHistogramBinarizer.cpp.o CMakeFiles/libzxing.dir/core/src/zxing/common/GreyscaleLuminanceSource.cpp.o CMakeFiles/libzxing.dir/core/src/zxing/common/GreyscaleRotatedLuminanceSource.cpp.o CMakeFiles/libzxing.dir/core/src/zxing/common/GridSampler.cpp.o CMakeFiles/libzxing.dir/core/src/zxing/common/HybridBinarizer.cpp.o CMakeFiles/libzxing.dir/core/src/zxing/common/IllegalArgumentException.cpp.o CMakeFiles/libzxing.dir/core/src/zxing/common/PerspectiveTransform.cpp.o CMakeFiles/libzxing.dir/core/src/zxing/common/Str.cpp.o CMakeFiles/libzxing.dir/core/src/zxing/common/StringUtils.cpp.o CMakeFiles/libzxing.dir/core/src/zxing/common/detector/MonochromeRectangleDetector.cpp.o CMakeFiles/libzxing.dir/core/src/zxing/common/detector/WhiteRectangleDetector.cpp.o CMakeFiles/libzxing.dir/core/src/zxing/common/reedsolomon/GenericGF.cpp.o CMakeFiles/libzxing.dir/core/src/zxing/common/reedsolomon/GenericGFPoly.cpp.o CMakeFiles/libzxing.dir/core/src/zxing/common/reedsolomon/ReedSolomonDecoder.cpp.o CMakeFiles/libzxing.dir/core/src/zxing/common/reedsolomon/ReedSolomonException.cpp.o CMakeFiles/libzxing.dir/core/src/zxing/datamatrix/DataMatrixReader.cpp.o CMakeFiles/libzxing.dir/core/src/zxing/datamatrix/Version.cpp.o CMakeFiles/libzxing.dir/core/src/zxing/datamatrix/decoder/BitMatrixParser.cpp.o CMakeFiles/libzxing.dir/core/src/zxing/datamatrix/decoder/DataBlock.cpp.o CMakeFiles/libzxing.dir/core/src/zxing/datamatrix/decoder/DecodedBitStreamParser.cpp.o CMakeFiles/libzxing.dir/core/src/zxing/datamatrix/decoder/Decoder.cpp.o CMakeFiles/libzxing.dir/core/src/zxing/datamatrix/detector/CornerPoint.cpp.o CMakeFiles/libzxing.dir/core/src/zxing/datamatrix/detector/Detector.cpp.o CMakeFiles/libzxing.dir/core/src/zxing/datamatrix/detector/DetectorException.cpp.o CMakeFiles/libzxing.dir/core/src/zxing/multi/ByQuadrantReader.cpp.o CMakeFiles/libzxing.dir/core/src/zxing/multi/GenericMultipleBarcodeReader.cpp.o CMakeFiles/libzxing.dir/core/src/zxing/multi/MultipleBarcodeReader.cpp.o CMakeFiles/libzxing.dir/core/src/zxing/multi/qrcode/QRCodeMultiReader.cpp.o CMakeFiles/libzxing.dir/core/src/zxing/multi/qrcode/detector/MultiDetector.cpp.o CMakeFiles/libzxing.dir/core/src/zxing/multi/qrcode/detector/MultiFinderPatternFinder.cpp.o CMakeFiles/libzxing.dir/core/src/zxing/oned/CodaBarReader.cpp.o CMakeFiles/libzxing.dir/core/src/zxing/oned/Code128Reader.cpp.o CMakeFiles/libzxing.dir/core/src/zxing/oned/Code39Reader.cpp.o CMakeFiles/libzxing.dir/core/src/zxing/oned/Code93Reader.cpp.o CMakeFiles/libzxing.dir/core/src/zxing/oned/EAN13Reader.cpp.o CMakeFiles/libzxing.dir/core/src/zxing/oned/EAN8Reader.cpp.o CMakeFiles/libzxing.dir/core/src/zxing/oned/ITFReader.cpp.o CMakeFiles/libzxing.dir/core/src/zxing/oned/MultiFormatOneDReader.cpp.o CMakeFiles/libzxing.dir/core/src/zxing/oned/MultiFormatUPCEANReader.cpp.o CMakeFiles/libzxing.dir/core/src/zxing/oned/OneDReader.cpp.o CMakeFiles/libzxing.dir/core/src/zxing/oned/OneDResultPoint.cpp.o CMakeFiles/libzxing.dir/core/src/zxing/oned/UPCAReader.cpp.o CMakeFiles/libzxing.dir/core/src/zxing/oned/UPCEANReader.cpp.o CMakeFiles/libzxing.dir/core/src/zxing/oned/UPCEReader.cpp.o CMakeFiles/libzxing.dir/core/src/zxing/pdf417/PDF417Reader.cpp.o CMakeFiles/libzxing.dir/core/src/zxing/pdf417/decoder/BitMatrixParser.cpp.o CMakeFiles/libzxing.dir/core/src/zxing/pdf417/decoder/DecodedBitStreamParser.cpp.o CMakeFiles/libzxing.dir/core/src/zxing/pdf417/decoder/Decoder.cpp.o CMakeFiles/libzxing.dir/core/src/zxing/pdf417/decoder/ec/ErrorCorrection.cpp.o CMakeFiles/libzxing.dir/core/src/zxing/pdf417/decoder/ec/ModulusGF.cpp.o CMakeFiles/libzxing.dir/core/src/zxing/pdf417/decoder/ec/ModulusPoly.cpp.o CMakeFiles/libzxing.dir/core/src/zxing/pdf417/detector/Detector.cpp.o CMakeFiles/libzxing.dir/core/src/zxing/pdf417/detector/LinesSampler.cpp.o CMakeFiles/libzxing.dir/core/src/zxing/qrcode/ErrorCorrectionLevel.cpp.o CMakeFiles/libzxing.dir/core/src/zxing/qrcode/FormatInformation.cpp.o CMakeFiles/libzxing.dir/core/src/zxing/qrcode/QRCodeReader.cpp.o CMakeFiles/libzxing.dir/core/src/zxing/qrcode/Version.cpp.o CMakeFiles/libzxing.dir/core/src/zxing/qrcode/decoder/BitMatrixParser.cpp.o CMakeFiles/libzxing.dir/core/src/zxing/qrcode/decoder/DataBlock.cpp.o CMakeFiles/libzxing.dir/core/src/zxing/qrcode/decoder/DataMask.cpp.o CMakeFiles/libzxing.dir/core/src/zxing/qrcode/decoder/DecodedBitStreamParser.cpp.o CMakeFiles/libzxing.dir/core/src/zxing/qrcode/decoder/Decoder.cpp.o CMakeFiles/libzxing.dir/core/src/zxing/qrcode/decoder/Mode.cpp.o CMakeFiles/libzxing.dir/core/src/zxing/qrcode/detector/AlignmentPattern.cpp.o CMakeFiles/libzxing.dir/core/src/zxing/qrcode/detector/AlignmentPatternFinder.cpp.o CMakeFiles/libzxing.dir/core/src/zxing/qrcode/detector/Detector.cpp.o CMakeFiles/libzxing.dir/core/src/zxing/qrcode/detector/FinderPattern.cpp.o CMakeFiles/libzxing.dir/core/src/zxing/qrcode/detector/FinderPatternFinder.cpp.o CMakeFiles/libzxing.dir/core/src/zxing/qrcode/detector/FinderPatternInfo.cpp.o CMakeFiles/libzxing.dir/core/src/bigint/BigInteger.cc.o CMakeFiles/libzxing.dir/core/src/bigint/BigIntegerAlgorithms.cc.o CMakeFiles/libzxing.dir/core/src/bigint/BigIntegerUtils.cc.o CMakeFiles/libzxing.dir/core/src/bigint/BigUnsigned.cc.o CMakeFiles/libzxing.dir/core/src/bigint/BigUnsignedInABase.cc.o CMakeFiles/libzxing.dir/opencv/src/zxing/MatSource.cpp.o -lc /usr/bin/cmake -E cmake_symlink_library libzxing.so.0 libzxing.so.0 libzxing.so make[2]: Leaving directory '/tmp/B.DiEiOw/BUILD/zxing-cpp-6b3cbe02a332bff0f5ba0416f221d3d3876afdc2/build' make[1]: Entering directory '/tmp/B.DiEiOw/BUILD/zxing-cpp-6b3cbe02a332bff0f5ba0416f221d3d3876afdc2/build' [ 83%] Built target libzxing make[1]: Leaving directory '/tmp/B.DiEiOw/BUILD/zxing-cpp-6b3cbe02a332bff0f5ba0416f221d3d3876afdc2/build' /usr/bin/make -f CMakeFiles/zxing-cv.dir/build.make CMakeFiles/zxing-cv.dir/depend /usr/bin/make -f CMakeFiles/zxing.dir/build.make CMakeFiles/zxing.dir/depend /usr/bin/make -f CMakeFiles/testrunner.dir/build.make CMakeFiles/testrunner.dir/depend make[2]: Entering directory '/tmp/B.DiEiOw/BUILD/zxing-cpp-6b3cbe02a332bff0f5ba0416f221d3d3876afdc2/build' cd /tmp/B.DiEiOw/BUILD/zxing-cpp-6b3cbe02a332bff0f5ba0416f221d3d3876afdc2/build && /usr/bin/cmake -E cmake_depends "Unix Makefiles" /tmp/B.DiEiOw/BUILD/zxing-cpp-6b3cbe02a332bff0f5ba0416f221d3d3876afdc2 /tmp/B.DiEiOw/BUILD/zxing-cpp-6b3cbe02a332bff0f5ba0416f221d3d3876afdc2 /tmp/B.DiEiOw/BUILD/zxing-cpp-6b3cbe02a332bff0f5ba0416f221d3d3876afdc2/build /tmp/B.DiEiOw/BUILD/zxing-cpp-6b3cbe02a332bff0f5ba0416f221d3d3876afdc2/build /tmp/B.DiEiOw/BUILD/zxing-cpp-6b3cbe02a332bff0f5ba0416f221d3d3876afdc2/build/CMakeFiles/zxing-cv.dir/DependInfo.cmake --color= Scanning dependencies of target zxing-cv make[2]: Leaving directory '/tmp/B.DiEiOw/BUILD/zxing-cpp-6b3cbe02a332bff0f5ba0416f221d3d3876afdc2/build' /usr/bin/make -f CMakeFiles/zxing-cv.dir/build.make CMakeFiles/zxing-cv.dir/build make[2]: Entering directory '/tmp/B.DiEiOw/BUILD/zxing-cpp-6b3cbe02a332bff0f5ba0416f221d3d3876afdc2/build' cd /tmp/B.DiEiOw/BUILD/zxing-cpp-6b3cbe02a332bff0f5ba0416f221d3d3876afdc2/build && /usr/bin/cmake -E cmake_depends "Unix Makefiles" /tmp/B.DiEiOw/BUILD/zxing-cpp-6b3cbe02a332bff0f5ba0416f221d3d3876afdc2 /tmp/B.DiEiOw/BUILD/zxing-cpp-6b3cbe02a332bff0f5ba0416f221d3d3876afdc2 /tmp/B.DiEiOw/BUILD/zxing-cpp-6b3cbe02a332bff0f5ba0416f221d3d3876afdc2/build /tmp/B.DiEiOw/BUILD/zxing-cpp-6b3cbe02a332bff0f5ba0416f221d3d3876afdc2/build /tmp/B.DiEiOw/BUILD/zxing-cpp-6b3cbe02a332bff0f5ba0416f221d3d3876afdc2/build/CMakeFiles/testrunner.dir/DependInfo.cmake --color= Scanning dependencies of target testrunner make[2]: Leaving directory '/tmp/B.DiEiOw/BUILD/zxing-cpp-6b3cbe02a332bff0f5ba0416f221d3d3876afdc2/build' /usr/bin/make -f CMakeFiles/testrunner.dir/build.make CMakeFiles/testrunner.dir/build make[2]: Entering directory '/tmp/B.DiEiOw/BUILD/zxing-cpp-6b3cbe02a332bff0f5ba0416f221d3d3876afdc2/build' cd /tmp/B.DiEiOw/BUILD/zxing-cpp-6b3cbe02a332bff0f5ba0416f221d3d3876afdc2/build && /usr/bin/cmake -E cmake_depends "Unix Makefiles" /tmp/B.DiEiOw/BUILD/zxing-cpp-6b3cbe02a332bff0f5ba0416f221d3d3876afdc2 /tmp/B.DiEiOw/BUILD/zxing-cpp-6b3cbe02a332bff0f5ba0416f221d3d3876afdc2 /tmp/B.DiEiOw/BUILD/zxing-cpp-6b3cbe02a332bff0f5ba0416f221d3d3876afdc2/build /tmp/B.DiEiOw/BUILD/zxing-cpp-6b3cbe02a332bff0f5ba0416f221d3d3876afdc2/build /tmp/B.DiEiOw/BUILD/zxing-cpp-6b3cbe02a332bff0f5ba0416f221d3d3876afdc2/build/CMakeFiles/zxing.dir/DependInfo.cmake --color= Scanning dependencies of target zxing make[2]: Leaving directory '/tmp/B.DiEiOw/BUILD/zxing-cpp-6b3cbe02a332bff0f5ba0416f221d3d3876afdc2/build' /usr/bin/make -f CMakeFiles/zxing.dir/build.make CMakeFiles/zxing.dir/build make[2]: Entering directory '/tmp/B.DiEiOw/BUILD/zxing-cpp-6b3cbe02a332bff0f5ba0416f221d3d3876afdc2/build' [ 90%] Building CXX object CMakeFiles/testrunner.dir/core/tests/src/TestRunner.cpp.o /usr/bin/x86_64-pld-linux-gnux32-g++ -I/usr/include/opencv -I/tmp/B.DiEiOw/BUILD/zxing-cpp-6b3cbe02a332bff0f5ba0416f221d3d3876afdc2/./opencv/src -I/tmp/B.DiEiOw/BUILD/zxing-cpp-6b3cbe02a332bff0f5ba0416f221d3d3876afdc2/./core/src -O2 -fwrapv -pipe -Wformat -Werror=format-security -gdwarf-4 -fno-debug-types-section -fvar-tracking-assignments -g2 -Wp,-D_FORTIFY_SOURCE=2 -fstack-protector-strong --param=ssp-buffer-size=4 -fPIC -mtune=generic -march=x86-64 -gdwarf-4 -fno-debug-types-section -fvar-tracking-assignments -g2 -DNDEBUG -DQT_NO_DEBUG -o CMakeFiles/testrunner.dir/core/tests/src/TestRunner.cpp.o -c /tmp/B.DiEiOw/BUILD/zxing-cpp-6b3cbe02a332bff0f5ba0416f221d3d3876afdc2/core/tests/src/TestRunner.cpp make[2]: Leaving directory '/tmp/B.DiEiOw/BUILD/zxing-cpp-6b3cbe02a332bff0f5ba0416f221d3d3876afdc2/build' make[2]: Entering directory '/tmp/B.DiEiOw/BUILD/zxing-cpp-6b3cbe02a332bff0f5ba0416f221d3d3876afdc2/build' [ 87%] Building CXX object CMakeFiles/zxing.dir/cli/src/ImageReaderSource.cpp.o /usr/bin/x86_64-pld-linux-gnux32-g++ -I/usr/include/opencv -I/tmp/B.DiEiOw/BUILD/zxing-cpp-6b3cbe02a332bff0f5ba0416f221d3d3876afdc2/./opencv/src -I/tmp/B.DiEiOw/BUILD/zxing-cpp-6b3cbe02a332bff0f5ba0416f221d3d3876afdc2/./core/src -O2 -fwrapv -pipe -Wformat -Werror=format-security -gdwarf-4 -fno-debug-types-section -fvar-tracking-assignments -g2 -Wp,-D_FORTIFY_SOURCE=2 -fstack-protector-strong --param=ssp-buffer-size=4 -fPIC -mtune=generic -march=x86-64 -gdwarf-4 -fno-debug-types-section -fvar-tracking-assignments -g2 -DNDEBUG -DQT_NO_DEBUG -o CMakeFiles/zxing.dir/cli/src/ImageReaderSource.cpp.o -c /tmp/B.DiEiOw/BUILD/zxing-cpp-6b3cbe02a332bff0f5ba0416f221d3d3876afdc2/cli/src/ImageReaderSource.cpp make[2]: Leaving directory '/tmp/B.DiEiOw/BUILD/zxing-cpp-6b3cbe02a332bff0f5ba0416f221d3d3876afdc2/build' make[2]: Entering directory '/tmp/B.DiEiOw/BUILD/zxing-cpp-6b3cbe02a332bff0f5ba0416f221d3d3876afdc2/build' [ 89%] Building CXX object CMakeFiles/testrunner.dir/core/tests/src/common/PerspectiveTransformTest.cpp.o /usr/bin/x86_64-pld-linux-gnux32-g++ -I/usr/include/opencv -I/tmp/B.DiEiOw/BUILD/zxing-cpp-6b3cbe02a332bff0f5ba0416f221d3d3876afdc2/./opencv/src -I/tmp/B.DiEiOw/BUILD/zxing-cpp-6b3cbe02a332bff0f5ba0416f221d3d3876afdc2/./core/src -O2 -fwrapv -pipe -Wformat -Werror=format-security -gdwarf-4 -fno-debug-types-section -fvar-tracking-assignments -g2 -Wp,-D_FORTIFY_SOURCE=2 -fstack-protector-strong --param=ssp-buffer-size=4 -fPIC -mtune=generic -march=x86-64 -gdwarf-4 -fno-debug-types-section -fvar-tracking-assignments -g2 -DNDEBUG -DQT_NO_DEBUG -o CMakeFiles/testrunner.dir/core/tests/src/common/PerspectiveTransformTest.cpp.o -c /tmp/B.DiEiOw/BUILD/zxing-cpp-6b3cbe02a332bff0f5ba0416f221d3d3876afdc2/core/tests/src/common/PerspectiveTransformTest.cpp make[2]: Leaving directory '/tmp/B.DiEiOw/BUILD/zxing-cpp-6b3cbe02a332bff0f5ba0416f221d3d3876afdc2/build' make[2]: Entering directory '/tmp/B.DiEiOw/BUILD/zxing-cpp-6b3cbe02a332bff0f5ba0416f221d3d3876afdc2/build' [ 88%] Building CXX object CMakeFiles/testrunner.dir/core/tests/src/common/CountedTest.cpp.o /usr/bin/x86_64-pld-linux-gnux32-g++ -I/usr/include/opencv -I/tmp/B.DiEiOw/BUILD/zxing-cpp-6b3cbe02a332bff0f5ba0416f221d3d3876afdc2/./opencv/src -I/tmp/B.DiEiOw/BUILD/zxing-cpp-6b3cbe02a332bff0f5ba0416f221d3d3876afdc2/./core/src -O2 -fwrapv -pipe -Wformat -Werror=format-security -gdwarf-4 -fno-debug-types-section -fvar-tracking-assignments -g2 -Wp,-D_FORTIFY_SOURCE=2 -fstack-protector-strong --param=ssp-buffer-size=4 -fPIC -mtune=generic -march=x86-64 -gdwarf-4 -fno-debug-types-section -fvar-tracking-assignments -g2 -DNDEBUG -DQT_NO_DEBUG -o CMakeFiles/testrunner.dir/core/tests/src/common/CountedTest.cpp.o -c /tmp/B.DiEiOw/BUILD/zxing-cpp-6b3cbe02a332bff0f5ba0416f221d3d3876afdc2/core/tests/src/common/CountedTest.cpp make[2]: Leaving directory '/tmp/B.DiEiOw/BUILD/zxing-cpp-6b3cbe02a332bff0f5ba0416f221d3d3876afdc2/build' make[2]: Entering directory '/tmp/B.DiEiOw/BUILD/zxing-cpp-6b3cbe02a332bff0f5ba0416f221d3d3876afdc2/build' [ 86%] Building CXX object CMakeFiles/testrunner.dir/core/tests/src/common/BitSourceTest.cpp.o /usr/bin/x86_64-pld-linux-gnux32-g++ -I/usr/include/opencv -I/tmp/B.DiEiOw/BUILD/zxing-cpp-6b3cbe02a332bff0f5ba0416f221d3d3876afdc2/./opencv/src -I/tmp/B.DiEiOw/BUILD/zxing-cpp-6b3cbe02a332bff0f5ba0416f221d3d3876afdc2/./core/src -O2 -fwrapv -pipe -Wformat -Werror=format-security -gdwarf-4 -fno-debug-types-section -fvar-tracking-assignments -g2 -Wp,-D_FORTIFY_SOURCE=2 -fstack-protector-strong --param=ssp-buffer-size=4 -fPIC -mtune=generic -march=x86-64 -gdwarf-4 -fno-debug-types-section -fvar-tracking-assignments -g2 -DNDEBUG -DQT_NO_DEBUG -o CMakeFiles/testrunner.dir/core/tests/src/common/BitSourceTest.cpp.o -c /tmp/B.DiEiOw/BUILD/zxing-cpp-6b3cbe02a332bff0f5ba0416f221d3d3876afdc2/core/tests/src/common/BitSourceTest.cpp make[2]: Leaving directory '/tmp/B.DiEiOw/BUILD/zxing-cpp-6b3cbe02a332bff0f5ba0416f221d3d3876afdc2/build' make[2]: Entering directory '/tmp/B.DiEiOw/BUILD/zxing-cpp-6b3cbe02a332bff0f5ba0416f221d3d3876afdc2/build' [ 85%] Building CXX object CMakeFiles/testrunner.dir/core/tests/src/common/BitMatrixTest.cpp.o /usr/bin/x86_64-pld-linux-gnux32-g++ -I/usr/include/opencv -I/tmp/B.DiEiOw/BUILD/zxing-cpp-6b3cbe02a332bff0f5ba0416f221d3d3876afdc2/./opencv/src -I/tmp/B.DiEiOw/BUILD/zxing-cpp-6b3cbe02a332bff0f5ba0416f221d3d3876afdc2/./core/src -O2 -fwrapv -pipe -Wformat -Werror=format-security -gdwarf-4 -fno-debug-types-section -fvar-tracking-assignments -g2 -Wp,-D_FORTIFY_SOURCE=2 -fstack-protector-strong --param=ssp-buffer-size=4 -fPIC -mtune=generic -march=x86-64 -gdwarf-4 -fno-debug-types-section -fvar-tracking-assignments -g2 -DNDEBUG -DQT_NO_DEBUG -o CMakeFiles/testrunner.dir/core/tests/src/common/BitMatrixTest.cpp.o -c /tmp/B.DiEiOw/BUILD/zxing-cpp-6b3cbe02a332bff0f5ba0416f221d3d3876afdc2/core/tests/src/common/BitMatrixTest.cpp make[2]: Leaving directory '/tmp/B.DiEiOw/BUILD/zxing-cpp-6b3cbe02a332bff0f5ba0416f221d3d3876afdc2/build' make[2]: Entering directory '/tmp/B.DiEiOw/BUILD/zxing-cpp-6b3cbe02a332bff0f5ba0416f221d3d3876afdc2/build' [ 84%] Building CXX object CMakeFiles/zxing-cv.dir/opencv-cli/src/main.cpp.o /usr/bin/x86_64-pld-linux-gnux32-g++ -isystem /usr/include/opencv -I/tmp/B.DiEiOw/BUILD/zxing-cpp-6b3cbe02a332bff0f5ba0416f221d3d3876afdc2/./opencv/src -I/tmp/B.DiEiOw/BUILD/zxing-cpp-6b3cbe02a332bff0f5ba0416f221d3d3876afdc2/./core/src -O2 -fwrapv -pipe -Wformat -Werror=format-security -gdwarf-4 -fno-debug-types-section -fvar-tracking-assignments -g2 -Wp,-D_FORTIFY_SOURCE=2 -fstack-protector-strong --param=ssp-buffer-size=4 -fPIC -mtune=generic -march=x86-64 -gdwarf-4 -fno-debug-types-section -fvar-tracking-assignments -g2 -DNDEBUG -DQT_NO_DEBUG -o CMakeFiles/zxing-cv.dir/opencv-cli/src/main.cpp.o -c /tmp/B.DiEiOw/BUILD/zxing-cpp-6b3cbe02a332bff0f5ba0416f221d3d3876afdc2/opencv-cli/src/main.cpp make[2]: Leaving directory '/tmp/B.DiEiOw/BUILD/zxing-cpp-6b3cbe02a332bff0f5ba0416f221d3d3876afdc2/build' make[2]: Entering directory '/tmp/B.DiEiOw/BUILD/zxing-cpp-6b3cbe02a332bff0f5ba0416f221d3d3876afdc2/build' [ 86%] Building CXX object CMakeFiles/testrunner.dir/core/tests/src/common/BitArrayTest.cpp.o /usr/bin/x86_64-pld-linux-gnux32-g++ -I/usr/include/opencv -I/tmp/B.DiEiOw/BUILD/zxing-cpp-6b3cbe02a332bff0f5ba0416f221d3d3876afdc2/./opencv/src -I/tmp/B.DiEiOw/BUILD/zxing-cpp-6b3cbe02a332bff0f5ba0416f221d3d3876afdc2/./core/src -O2 -fwrapv -pipe -Wformat -Werror=format-security -gdwarf-4 -fno-debug-types-section -fvar-tracking-assignments -g2 -Wp,-D_FORTIFY_SOURCE=2 -fstack-protector-strong --param=ssp-buffer-size=4 -fPIC -mtune=generic -march=x86-64 -gdwarf-4 -fno-debug-types-section -fvar-tracking-assignments -g2 -DNDEBUG -DQT_NO_DEBUG -o CMakeFiles/testrunner.dir/core/tests/src/common/BitArrayTest.cpp.o -c /tmp/B.DiEiOw/BUILD/zxing-cpp-6b3cbe02a332bff0f5ba0416f221d3d3876afdc2/core/tests/src/common/BitArrayTest.cpp make[2]: Leaving directory '/tmp/B.DiEiOw/BUILD/zxing-cpp-6b3cbe02a332bff0f5ba0416f221d3d3876afdc2/build' make[2]: Entering directory '/tmp/B.DiEiOw/BUILD/zxing-cpp-6b3cbe02a332bff0f5ba0416f221d3d3876afdc2/build' [ 93%] Building CXX object CMakeFiles/testrunner.dir/core/tests/src/qrcode/ErrorCorrectionLevelTest.cpp.o /usr/bin/x86_64-pld-linux-gnux32-g++ -I/usr/include/opencv -I/tmp/B.DiEiOw/BUILD/zxing-cpp-6b3cbe02a332bff0f5ba0416f221d3d3876afdc2/./opencv/src -I/tmp/B.DiEiOw/BUILD/zxing-cpp-6b3cbe02a332bff0f5ba0416f221d3d3876afdc2/./core/src -O2 -fwrapv -pipe -Wformat -Werror=format-security -gdwarf-4 -fno-debug-types-section -fvar-tracking-assignments -g2 -Wp,-D_FORTIFY_SOURCE=2 -fstack-protector-strong --param=ssp-buffer-size=4 -fPIC -mtune=generic -march=x86-64 -gdwarf-4 -fno-debug-types-section -fvar-tracking-assignments -g2 -DNDEBUG -DQT_NO_DEBUG -o CMakeFiles/testrunner.dir/core/tests/src/qrcode/ErrorCorrectionLevelTest.cpp.o -c /tmp/B.DiEiOw/BUILD/zxing-cpp-6b3cbe02a332bff0f5ba0416f221d3d3876afdc2/core/tests/src/qrcode/ErrorCorrectionLevelTest.cpp make[2]: Leaving directory '/tmp/B.DiEiOw/BUILD/zxing-cpp-6b3cbe02a332bff0f5ba0416f221d3d3876afdc2/build' make[2]: Entering directory '/tmp/B.DiEiOw/BUILD/zxing-cpp-6b3cbe02a332bff0f5ba0416f221d3d3876afdc2/build' [ 91%] Building CXX object CMakeFiles/testrunner.dir/core/tests/src/common/reedsolomon/ReedSolomonTest.cpp.o /usr/bin/x86_64-pld-linux-gnux32-g++ -I/usr/include/opencv -I/tmp/B.DiEiOw/BUILD/zxing-cpp-6b3cbe02a332bff0f5ba0416f221d3d3876afdc2/./opencv/src -I/tmp/B.DiEiOw/BUILD/zxing-cpp-6b3cbe02a332bff0f5ba0416f221d3d3876afdc2/./core/src -O2 -fwrapv -pipe -Wformat -Werror=format-security -gdwarf-4 -fno-debug-types-section -fvar-tracking-assignments -g2 -Wp,-D_FORTIFY_SOURCE=2 -fstack-protector-strong --param=ssp-buffer-size=4 -fPIC -mtune=generic -march=x86-64 -gdwarf-4 -fno-debug-types-section -fvar-tracking-assignments -g2 -DNDEBUG -DQT_NO_DEBUG -o CMakeFiles/testrunner.dir/core/tests/src/common/reedsolomon/ReedSolomonTest.cpp.o -c /tmp/B.DiEiOw/BUILD/zxing-cpp-6b3cbe02a332bff0f5ba0416f221d3d3876afdc2/core/tests/src/common/reedsolomon/ReedSolomonTest.cpp make[2]: Leaving directory '/tmp/B.DiEiOw/BUILD/zxing-cpp-6b3cbe02a332bff0f5ba0416f221d3d3876afdc2/build' make[2]: Entering directory '/tmp/B.DiEiOw/BUILD/zxing-cpp-6b3cbe02a332bff0f5ba0416f221d3d3876afdc2/build' [ 96%] Linking CXX executable zxing-cv /usr/bin/cmake -E cmake_link_script CMakeFiles/zxing-cv.dir/link.txt --verbose=1 /usr/bin/x86_64-pld-linux-gnux32-g++ -O2 -fwrapv -pipe -Wformat -Werror=format-security -gdwarf-4 -fno-debug-types-section -fvar-tracking-assignments -g2 -Wp,-D_FORTIFY_SOURCE=2 -fstack-protector-strong --param=ssp-buffer-size=4 -fPIC -mtune=generic -march=x86-64 -gdwarf-4 -fno-debug-types-section -fvar-tracking-assignments -g2 -DNDEBUG -DQT_NO_DEBUG -Wl,--as-needed -Wl,--no-copy-dt-needed-entries -Wl,-z,relro -Wl,-z,combreloc CMakeFiles/zxing-cv.dir/opencv-cli/src/main.cpp.o -o zxing-cv -Wl,-rpath,/tmp/B.DiEiOw/BUILD/zxing-cpp-6b3cbe02a332bff0f5ba0416f221d3d3876afdc2/build -rdynamic libzxing.so.0 /usr/libx32/libopencv_xphoto.so.3.1.0 /usr/libx32/libopencv_xobjdetect.so.3.1.0 /usr/libx32/libopencv_tracking.so.3.1.0 /usr/libx32/libopencv_surface_matching.so.3.1.0 /usr/libx32/libopencv_structured_light.so.3.1.0 /usr/libx32/libopencv_stereo.so.3.1.0 /usr/libx32/libopencv_sfm.so.3.1.0 /usr/libx32/libopencv_saliency.so.3.1.0 /usr/libx32/libopencv_rgbd.so.3.1.0 /usr/libx32/libopencv_reg.so.3.1.0 /usr/libx32/libopencv_plot.so.3.1.0 /usr/libx32/libopencv_optflow.so.3.1.0 /usr/libx32/libopencv_line_descriptor.so.3.1.0 /usr/libx32/libopencv_hdf.so.3.1.0 /usr/libx32/libopencv_fuzzy.so.3.1.0 /usr/libx32/libopencv_dpm.so.3.1.0 /usr/libx32/libopencv_dnn.so.3.1.0 /usr/libx32/libopencv_datasets.so.3.1.0 /usr/libx32/libopencv_ccalib.so.3.1.0 /usr/libx32/libopencv_bioinspired.so.3.1.0 /usr/libx32/libopencv_bgsegm.so.3.1.0 /usr/libx32/libopencv_aruco.so.3.1.0 /usr/libx32/libopencv_viz.so.3.1.0 /usr/libx32/libopencv_videostab.so.3.1.0 /usr/libx32/libopencv_superres.so.3.1.0 /usr/libx32/libopencv_stitching.so.3.1.0 /usr/libx32/libopencv_photo.so.3.1.0 -lc /usr/libx32/libopencv_text.so.3.1.0 /usr/libx32/libopencv_face.so.3.1.0 /usr/libx32/libopencv_ximgproc.so.3.1.0 /usr/libx32/libopencv_xfeatures2d.so.3.1.0 /usr/libx32/libopencv_shape.so.3.1.0 /usr/libx32/libopencv_video.so.3.1.0 /usr/libx32/libopencv_objdetect.so.3.1.0 /usr/libx32/libopencv_calib3d.so.3.1.0 /usr/libx32/libopencv_features2d.so.3.1.0 /usr/libx32/libopencv_ml.so.3.1.0 /usr/libx32/libopencv_highgui.so.3.1.0 /usr/libx32/libopencv_videoio.so.3.1.0 /usr/libx32/libopencv_imgcodecs.so.3.1.0 /usr/libx32/libopencv_imgproc.so.3.1.0 /usr/libx32/libopencv_flann.so.3.1.0 /usr/libx32/libopencv_core.so.3.1.0 make[2]: Leaving directory '/tmp/B.DiEiOw/BUILD/zxing-cpp-6b3cbe02a332bff0f5ba0416f221d3d3876afdc2/build' make[1]: Entering directory '/tmp/B.DiEiOw/BUILD/zxing-cpp-6b3cbe02a332bff0f5ba0416f221d3d3876afdc2/build' [ 98%] Built target zxing-cv make[1]: Leaving directory '/tmp/B.DiEiOw/BUILD/zxing-cpp-6b3cbe02a332bff0f5ba0416f221d3d3876afdc2/build' make[2]: Entering directory '/tmp/B.DiEiOw/BUILD/zxing-cpp-6b3cbe02a332bff0f5ba0416f221d3d3876afdc2/build' [ 94%] Building CXX object CMakeFiles/testrunner.dir/core/tests/src/qrcode/VersionTest.cpp.o /usr/bin/x86_64-pld-linux-gnux32-g++ -I/usr/include/opencv -I/tmp/B.DiEiOw/BUILD/zxing-cpp-6b3cbe02a332bff0f5ba0416f221d3d3876afdc2/./opencv/src -I/tmp/B.DiEiOw/BUILD/zxing-cpp-6b3cbe02a332bff0f5ba0416f221d3d3876afdc2/./core/src -O2 -fwrapv -pipe -Wformat -Werror=format-security -gdwarf-4 -fno-debug-types-section -fvar-tracking-assignments -g2 -Wp,-D_FORTIFY_SOURCE=2 -fstack-protector-strong --param=ssp-buffer-size=4 -fPIC -mtune=generic -march=x86-64 -gdwarf-4 -fno-debug-types-section -fvar-tracking-assignments -g2 -DNDEBUG -DQT_NO_DEBUG -o CMakeFiles/testrunner.dir/core/tests/src/qrcode/VersionTest.cpp.o -c /tmp/B.DiEiOw/BUILD/zxing-cpp-6b3cbe02a332bff0f5ba0416f221d3d3876afdc2/core/tests/src/qrcode/VersionTest.cpp make[2]: Leaving directory '/tmp/B.DiEiOw/BUILD/zxing-cpp-6b3cbe02a332bff0f5ba0416f221d3d3876afdc2/build' make[2]: Entering directory '/tmp/B.DiEiOw/BUILD/zxing-cpp-6b3cbe02a332bff0f5ba0416f221d3d3876afdc2/build' [ 93%] Building CXX object CMakeFiles/testrunner.dir/core/tests/src/qrcode/FormatInformationTest.cpp.o /usr/bin/x86_64-pld-linux-gnux32-g++ -I/usr/include/opencv -I/tmp/B.DiEiOw/BUILD/zxing-cpp-6b3cbe02a332bff0f5ba0416f221d3d3876afdc2/./opencv/src -I/tmp/B.DiEiOw/BUILD/zxing-cpp-6b3cbe02a332bff0f5ba0416f221d3d3876afdc2/./core/src -O2 -fwrapv -pipe -Wformat -Werror=format-security -gdwarf-4 -fno-debug-types-section -fvar-tracking-assignments -g2 -Wp,-D_FORTIFY_SOURCE=2 -fstack-protector-strong --param=ssp-buffer-size=4 -fPIC -mtune=generic -march=x86-64 -gdwarf-4 -fno-debug-types-section -fvar-tracking-assignments -g2 -DNDEBUG -DQT_NO_DEBUG -o CMakeFiles/testrunner.dir/core/tests/src/qrcode/FormatInformationTest.cpp.o -c /tmp/B.DiEiOw/BUILD/zxing-cpp-6b3cbe02a332bff0f5ba0416f221d3d3876afdc2/core/tests/src/qrcode/FormatInformationTest.cpp make[2]: Leaving directory '/tmp/B.DiEiOw/BUILD/zxing-cpp-6b3cbe02a332bff0f5ba0416f221d3d3876afdc2/build' make[2]: Entering directory '/tmp/B.DiEiOw/BUILD/zxing-cpp-6b3cbe02a332bff0f5ba0416f221d3d3876afdc2/build' [ 95%] Building CXX object CMakeFiles/testrunner.dir/core/tests/src/qrcode/decoder/DataMaskTest.cpp.o /usr/bin/x86_64-pld-linux-gnux32-g++ -I/usr/include/opencv -I/tmp/B.DiEiOw/BUILD/zxing-cpp-6b3cbe02a332bff0f5ba0416f221d3d3876afdc2/./opencv/src -I/tmp/B.DiEiOw/BUILD/zxing-cpp-6b3cbe02a332bff0f5ba0416f221d3d3876afdc2/./core/src -O2 -fwrapv -pipe -Wformat -Werror=format-security -gdwarf-4 -fno-debug-types-section -fvar-tracking-assignments -g2 -Wp,-D_FORTIFY_SOURCE=2 -fstack-protector-strong --param=ssp-buffer-size=4 -fPIC -mtune=generic -march=x86-64 -gdwarf-4 -fno-debug-types-section -fvar-tracking-assignments -g2 -DNDEBUG -DQT_NO_DEBUG -o CMakeFiles/testrunner.dir/core/tests/src/qrcode/decoder/DataMaskTest.cpp.o -c /tmp/B.DiEiOw/BUILD/zxing-cpp-6b3cbe02a332bff0f5ba0416f221d3d3876afdc2/core/tests/src/qrcode/decoder/DataMaskTest.cpp make[2]: Leaving directory '/tmp/B.DiEiOw/BUILD/zxing-cpp-6b3cbe02a332bff0f5ba0416f221d3d3876afdc2/build' make[2]: Entering directory '/tmp/B.DiEiOw/BUILD/zxing-cpp-6b3cbe02a332bff0f5ba0416f221d3d3876afdc2/build' [ 88%] Building CXX object CMakeFiles/zxing.dir/cli/src/jpgd.cpp.o /usr/bin/x86_64-pld-linux-gnux32-g++ -I/usr/include/opencv -I/tmp/B.DiEiOw/BUILD/zxing-cpp-6b3cbe02a332bff0f5ba0416f221d3d3876afdc2/./opencv/src -I/tmp/B.DiEiOw/BUILD/zxing-cpp-6b3cbe02a332bff0f5ba0416f221d3d3876afdc2/./core/src -O2 -fwrapv -pipe -Wformat -Werror=format-security -gdwarf-4 -fno-debug-types-section -fvar-tracking-assignments -g2 -Wp,-D_FORTIFY_SOURCE=2 -fstack-protector-strong --param=ssp-buffer-size=4 -fPIC -mtune=generic -march=x86-64 -gdwarf-4 -fno-debug-types-section -fvar-tracking-assignments -g2 -DNDEBUG -DQT_NO_DEBUG -o CMakeFiles/zxing.dir/cli/src/jpgd.cpp.o -c /tmp/B.DiEiOw/BUILD/zxing-cpp-6b3cbe02a332bff0f5ba0416f221d3d3876afdc2/cli/src/jpgd.cpp make[2]: Leaving directory '/tmp/B.DiEiOw/BUILD/zxing-cpp-6b3cbe02a332bff0f5ba0416f221d3d3876afdc2/build' make[2]: Entering directory '/tmp/B.DiEiOw/BUILD/zxing-cpp-6b3cbe02a332bff0f5ba0416f221d3d3876afdc2/build' [ 97%] Building CXX object CMakeFiles/testrunner.dir/core/tests/src/qrcode/decoder/ModeTest.cpp.o /usr/bin/x86_64-pld-linux-gnux32-g++ -I/usr/include/opencv -I/tmp/B.DiEiOw/BUILD/zxing-cpp-6b3cbe02a332bff0f5ba0416f221d3d3876afdc2/./opencv/src -I/tmp/B.DiEiOw/BUILD/zxing-cpp-6b3cbe02a332bff0f5ba0416f221d3d3876afdc2/./core/src -O2 -fwrapv -pipe -Wformat -Werror=format-security -gdwarf-4 -fno-debug-types-section -fvar-tracking-assignments -g2 -Wp,-D_FORTIFY_SOURCE=2 -fstack-protector-strong --param=ssp-buffer-size=4 -fPIC -mtune=generic -march=x86-64 -gdwarf-4 -fno-debug-types-section -fvar-tracking-assignments -g2 -DNDEBUG -DQT_NO_DEBUG -o CMakeFiles/testrunner.dir/core/tests/src/qrcode/decoder/ModeTest.cpp.o -c /tmp/B.DiEiOw/BUILD/zxing-cpp-6b3cbe02a332bff0f5ba0416f221d3d3876afdc2/core/tests/src/qrcode/decoder/ModeTest.cpp make[2]: Leaving directory '/tmp/B.DiEiOw/BUILD/zxing-cpp-6b3cbe02a332bff0f5ba0416f221d3d3876afdc2/build' make[2]: Entering directory '/tmp/B.DiEiOw/BUILD/zxing-cpp-6b3cbe02a332bff0f5ba0416f221d3d3876afdc2/build' [ 99%] Linking CXX executable testrunner /usr/bin/cmake -E cmake_link_script CMakeFiles/testrunner.dir/link.txt --verbose=1 /usr/bin/x86_64-pld-linux-gnux32-g++ -O2 -fwrapv -pipe -Wformat -Werror=format-security -gdwarf-4 -fno-debug-types-section -fvar-tracking-assignments -g2 -Wp,-D_FORTIFY_SOURCE=2 -fstack-protector-strong --param=ssp-buffer-size=4 -fPIC -mtune=generic -march=x86-64 -gdwarf-4 -fno-debug-types-section -fvar-tracking-assignments -g2 -DNDEBUG -DQT_NO_DEBUG -Wl,--as-needed -Wl,--no-copy-dt-needed-entries -Wl,-z,relro -Wl,-z,combreloc CMakeFiles/testrunner.dir/core/tests/src/TestRunner.cpp.o CMakeFiles/testrunner.dir/core/tests/src/common/BitArrayTest.cpp.o CMakeFiles/testrunner.dir/core/tests/src/common/BitMatrixTest.cpp.o CMakeFiles/testrunner.dir/core/tests/src/common/BitSourceTest.cpp.o CMakeFiles/testrunner.dir/core/tests/src/common/CountedTest.cpp.o CMakeFiles/testrunner.dir/core/tests/src/common/PerspectiveTransformTest.cpp.o CMakeFiles/testrunner.dir/core/tests/src/common/reedsolomon/ReedSolomonTest.cpp.o CMakeFiles/testrunner.dir/core/tests/src/qrcode/ErrorCorrectionLevelTest.cpp.o CMakeFiles/testrunner.dir/core/tests/src/qrcode/FormatInformationTest.cpp.o CMakeFiles/testrunner.dir/core/tests/src/qrcode/VersionTest.cpp.o CMakeFiles/testrunner.dir/core/tests/src/qrcode/decoder/DataMaskTest.cpp.o CMakeFiles/testrunner.dir/core/tests/src/qrcode/decoder/ModeTest.cpp.o -o testrunner -Wl,-rpath,/tmp/B.DiEiOw/BUILD/zxing-cpp-6b3cbe02a332bff0f5ba0416f221d3d3876afdc2/build -rdynamic libzxing.so.0 -lcppunit -ldl -lc libzxing.so.0: undefined reference to `cv::fastFree(void*)' libzxing.so.0: undefined reference to `cv::Mat::copyTo(cv::_OutputArray const&) const' libzxing.so.0: undefined reference to `cv::Mat::deallocate()' collect2: error: ld returned 1 exit status make[2]: *** [CMakeFiles/testrunner.dir/build.make:387: testrunner] Error 1 make[2]: Leaving directory '/tmp/B.DiEiOw/BUILD/zxing-cpp-6b3cbe02a332bff0f5ba0416f221d3d3876afdc2/build' make[1]: *** [CMakeFiles/Makefile2:182: CMakeFiles/testrunner.dir/all] Error 2 make[1]: *** Waiting for unfinished jobs.... make[2]: Entering directory '/tmp/B.DiEiOw/BUILD/zxing-cpp-6b3cbe02a332bff0f5ba0416f221d3d3876afdc2/build' [ 98%] Building CXX object CMakeFiles/zxing.dir/cli/src/main.cpp.o /usr/bin/x86_64-pld-linux-gnux32-g++ -I/usr/include/opencv -I/tmp/B.DiEiOw/BUILD/zxing-cpp-6b3cbe02a332bff0f5ba0416f221d3d3876afdc2/./opencv/src -I/tmp/B.DiEiOw/BUILD/zxing-cpp-6b3cbe02a332bff0f5ba0416f221d3d3876afdc2/./core/src -O2 -fwrapv -pipe -Wformat -Werror=format-security -gdwarf-4 -fno-debug-types-section -fvar-tracking-assignments -g2 -Wp,-D_FORTIFY_SOURCE=2 -fstack-protector-strong --param=ssp-buffer-size=4 -fPIC -mtune=generic -march=x86-64 -gdwarf-4 -fno-debug-types-section -fvar-tracking-assignments -g2 -DNDEBUG -DQT_NO_DEBUG -o CMakeFiles/zxing.dir/cli/src/main.cpp.o -c /tmp/B.DiEiOw/BUILD/zxing-cpp-6b3cbe02a332bff0f5ba0416f221d3d3876afdc2/cli/src/main.cpp make[2]: Leaving directory '/tmp/B.DiEiOw/BUILD/zxing-cpp-6b3cbe02a332bff0f5ba0416f221d3d3876afdc2/build' make[2]: Entering directory '/tmp/B.DiEiOw/BUILD/zxing-cpp-6b3cbe02a332bff0f5ba0416f221d3d3876afdc2/build' [ 92%] Building CXX object CMakeFiles/zxing.dir/cli/src/lodepng.cpp.o /usr/bin/x86_64-pld-linux-gnux32-g++ -I/usr/include/opencv -I/tmp/B.DiEiOw/BUILD/zxing-cpp-6b3cbe02a332bff0f5ba0416f221d3d3876afdc2/./opencv/src -I/tmp/B.DiEiOw/BUILD/zxing-cpp-6b3cbe02a332bff0f5ba0416f221d3d3876afdc2/./core/src -O2 -fwrapv -pipe -Wformat -Werror=format-security -gdwarf-4 -fno-debug-types-section -fvar-tracking-assignments -g2 -Wp,-D_FORTIFY_SOURCE=2 -fstack-protector-strong --param=ssp-buffer-size=4 -fPIC -mtune=generic -march=x86-64 -gdwarf-4 -fno-debug-types-section -fvar-tracking-assignments -g2 -DNDEBUG -DQT_NO_DEBUG -o CMakeFiles/zxing.dir/cli/src/lodepng.cpp.o -c /tmp/B.DiEiOw/BUILD/zxing-cpp-6b3cbe02a332bff0f5ba0416f221d3d3876afdc2/cli/src/lodepng.cpp make[2]: Leaving directory '/tmp/B.DiEiOw/BUILD/zxing-cpp-6b3cbe02a332bff0f5ba0416f221d3d3876afdc2/build' make[2]: Entering directory '/tmp/B.DiEiOw/BUILD/zxing-cpp-6b3cbe02a332bff0f5ba0416f221d3d3876afdc2/build' [100%] Linking CXX executable zxing /usr/bin/cmake -E cmake_link_script CMakeFiles/zxing.dir/link.txt --verbose=1 /usr/bin/x86_64-pld-linux-gnux32-g++ -O2 -fwrapv -pipe -Wformat -Werror=format-security -gdwarf-4 -fno-debug-types-section -fvar-tracking-assignments -g2 -Wp,-D_FORTIFY_SOURCE=2 -fstack-protector-strong --param=ssp-buffer-size=4 -fPIC -mtune=generic -march=x86-64 -gdwarf-4 -fno-debug-types-section -fvar-tracking-assignments -g2 -DNDEBUG -DQT_NO_DEBUG -Wl,--as-needed -Wl,--no-copy-dt-needed-entries -Wl,-z,relro -Wl,-z,combreloc CMakeFiles/zxing.dir/cli/src/ImageReaderSource.cpp.o CMakeFiles/zxing.dir/cli/src/jpgd.cpp.o CMakeFiles/zxing.dir/cli/src/lodepng.cpp.o CMakeFiles/zxing.dir/cli/src/main.cpp.o -o zxing -Wl,-rpath,/tmp/B.DiEiOw/BUILD/zxing-cpp-6b3cbe02a332bff0f5ba0416f221d3d3876afdc2/build: -rdynamic libzxing.so.0 -lc libzxing.so.0: undefined reference to `cv::fastFree(void*)' libzxing.so.0: undefined reference to `cv::Mat::copyTo(cv::_OutputArray const&) const' libzxing.so.0: undefined reference to `cv::Mat::deallocate()' collect2: error: ld returned 1 exit status make[2]: *** [CMakeFiles/zxing.dir/build.make:178: zxing] Error 1 make[2]: Leaving directory '/tmp/B.DiEiOw/BUILD/zxing-cpp-6b3cbe02a332bff0f5ba0416f221d3d3876afdc2/build' make[1]: *** [CMakeFiles/Makefile2:145: CMakeFiles/zxing.dir/all] Error 2 make: *** [Makefile:131: all] Error 2 error: Bad exit status from /tmp/B.DiEiOw/BUILD/tmp/rpm-tmp.689 (%build) RPM build errors: Bad exit status from /tmp/B.DiEiOw/BUILD/tmp/rpm-tmp.689 (%build) ended at: Mon Apr 17 10:01:08 2017, done in 0:00:19.615013 error: No files produced. + chmod -R u+rwX /tmp/B.DiEiOw/BUILD + rm -rf /tmp/B.DiEiOw/tmp /tmp/B.DiEiOw/BUILD + rm -rf /tmp/B.DiEiOw Begin-PLD-Builder-Info Build-Time: user:110.01s sys:6.66s real:22.81s (faults io:0 non-io:1717789) End-PLD-Builder-Info
[Back to list of logs] [View rpm -qa of builder]