FailedOk

th/SRPMS[OK]
th/x32[OK]
th/i686[OK]
th/x86_64[OK]

ac/SRPMS[OK]
ac/i386[OK]
ac/i586[OK]
ac/i686[OK]
ac/alpha[OK]
ac/amd64[OK]
ac/athlon[OK]
ac/ppc[OK]
ac/sparc[OK]
ac/sparc64[OK]

Advanced Search
main()
Powered by PLD Linux
(c) 2002-2020 PLD Team
$Revision: 1.37 $
Powered by Leppe'.
Your IP: 3.238.107.166

lms 5e273c99-5839-4ac2-b52b-3c83d079b60a

Status:Failed
Source URL:https://buildlogs.pld-linux.org/pld/th/x32/FAIL/lms,5e273c99-5839-4ac2-b52b-3c83d079b60a.bz2
text/plain URL:View!
rpm -qa of builder:View!
Date:2020/10/05 09:34:58
Runtime:0:00:16.794325

Toc:

  • error 1
  • rpm: error: Failed build dependencies:
  • error 2
  • rpm: error: Failed build dependencies:
  • prep
  • Executing(%prep): /bin/sh -e /tmp/B.tKED1E/BUILD/tmp/rpm-tmp.90881
  • build
  • Executing(%build): /bin/sh -e /tmp/B.tKED1E/BUILD/tmp/rpm-tmp.90881
  • error 3
  • make[2]: *** No rule to make target 'lib/libtscript.a', needed by 'parser.so'. Stop.
  • error 4
  • make[3]: *** [<builtin>: tscript_parser.c] Error 1
  • error 5
  • tscript_exec.h:4:10: fatal error: tscript_context.h: No such file or directory
  • error 6
  • compilation terminated.
  • error 7
  • make[3]: *** [Makefile:14: tscript_exec.o] Error 1
  • error 8
  • tscript_string.h:4:10: fatal error: tscript_context.h: No such file or directory
  • error 9
  • compilation terminated.
  • error 10
  • make[3]: *** [Makefile:14: tscript_string.o] Error 1
  • error 11
  • tscript_file.h:4:10: fatal error: tscript_context.h: No such file or directory
  • error 12
  • compilation terminated.
  • error 13
  • make[3]: *** [Makefile:14: tscript_file.o] Error 1
  • error 14
  • tscript_sysinfo.h:4:10: fatal error: tscript_context.h: No such file or directory
  • error 15
  • compilation terminated.
  • error 16
  • make[3]: *** [Makefile:14: tscript_sysinfo.o] Error 1
  • error 17
  • sql.h:4:10: fatal error: tscript_context.h: No such file or directory
  • error 18
  • compilation terminated.
  • error 19
  • make[3]: *** [Makefile:14: sql.o] Error 1
  • error 20
  • parser.c:32:10: fatal error: tscript_context.h: No such file or directory
  • error 21
  • compilation terminated.
  • error 22
  • make[2]: *** [<builtin>: parser.o] Error 1
  • error 23
  • net.h:4:10: fatal error: tscript_context.h: No such file or directory
  • error 24
  • compilation terminated.
  • error 25
  • make[3]: *** [Makefile:14: net.o] Error 1
  • error 26
  • make[2]: *** [Makefile:20: ext] Error 2
  • error 27
  • make[2]: *** [Makefile:17: libs] Error 2
  • install
  • Executing(%install): /bin/sh -e /tmp/B.tKED1E/BUILD/tmp/rpm-tmp.29924
  • error 28
  • error: Bad exit status from /tmp/B.tKED1E/BUILD/tmp/rpm-tmp.29924 (%install)
  • error 29
  • RPM build errors:
  • error 30
  • error: No files produced.

Content:

request from: baggins
checking if we should skip the build
started at: Mon Oct  5 09:34:16 2020
killing old processes on a builder
sending signal 9 to pid -1
Killed
cleaning up /tmp
fetching https://srcbuilder.pld-linux.org/th//srpms/5e273c99-5839-4ac2-b52b-3c83d079b60a/lms-1.11.13-11.src.rpm
fetched 3694794 bytes, 5988.1 K/s
installing srpm: lms-1.11.13-11.src.rpm
+ install -d /tmp/B.tKED1E/BUILD /tmp/B.tKED1E/RPMS
+ LC_ALL=en_US.UTF-8
+ rpm -qp --changelog lms-1.11.13-11.src.rpm
* Mon Oct 05 2020 PLD Linux Team <feedback@pld-linux.org>
- For complete changelog see: http://git.pld-linux.org/?p=packages/lms.git;a=log;h=master
* Mon Oct 05 2020 Jan Rękorajski <baggins@pld-linux.org> ad976df
- release 11 (by relup.sh) + rpm -Uhv --nodeps --define '_topdir /tmp/B.tKED1E' --define '_specdir %{_topdir}' --define '_sourcedir %{_specdir}' --define '_rpmdir %{_topdir}/RPMS' --define '_builddir %{_topdir}/BUILD' lms-1.11.13-11.src.rpm Preparing... ################################################## lms ################################################## + rm -f lms-1.11.13-11.src.rpm + install -m 700 -d /tmp/B.tKED1E/BUILD/tmp + TMPDIR=/tmp/B.tKED1E/BUILD/tmp + exec nice -n 0 rpmbuild -bp --short-circuit --nodeps --define '_topdir /tmp/B.tKED1E' --define '_specdir %{_topdir}' --define '_sourcedir %{_specdir}' --define '_rpmdir %{_topdir}/RPMS' --define '_builddir %{_topdir}/BUILD' --target x32-pld-linux --define 'prep exit 0' /tmp/B.tKED1E/lms.spec Building target platforms: x32-pld-linux checking BuildConflict-ing packages no BuildConflicts found checking BR rpm: error: Failed build dependencies: rpm: libgadu-devel is needed by lms-1.11.13-11.src rpm: Building target platforms: x32-pld-linux updating poldek cache... ready is up to date th is up to date th is up to date th-ready is up to date th-ready is up to date Loading [pndir]th-test... Applying packages.ndir.2020.10.05-07.03.03.gz... Writing /root/.cache/poldek/[...]/packages.ndir.gz... Retrieving th-test::packages.ndir.diff.toc.gz..............................................done Retrieving diff::packages.ndir.2020.10.05-07.11.01.gz......................................done Loading [pndir]th-test... Applying packages.ndir.2020.10.05-07.11.01.gz... Applying packages.ndir.2020.10.05-07.19.01.gz... Retrieving diff::packages.ndir.2020.10.05-07.20.01.gz......................................done Applying packages.ndir.2020.10.05-07.20.01.gz... Applying packages.ndir.2020.10.05-07.28.01.gz... Applying packages.ndir.2020.10.05-07.29.01.gz... Retrieving diff::packages.ndir.2020.10.05-07.31.02.gz......................................done Retrieving diff::packages.ndir.dscr.2020.10.05-07.31.02.gz.................................done Applying packages.ndir.2020.10.05-07.31.02.gz... Applying packages.ndir.2020.10.05-07.33.02.gz... Writing /root/.cache/poldek/[...]/packages.ndir.gz... checking conflicting packages in BRed packages poldek: Loading [pndir]ready... poldek: Loading [pndir]th-test... poldek: Loading [pndir]th-test... poldek: Loading [pndir]th-ready... poldek: Loading [pndir]th-ready... poldek: Loading [pndir]th... poldek: Loading [pndir]th... poldek: 29675 packages read poldek: Removed 3851 duplicate packages from available set poldek: Processing dependencies... poldek: libgadu-devel-1.12.2-3.x32 marks libgadu-1.12.2-3.x32 (cap libgadu = 4:1.12.2-3) poldek: libgadu-1.12.2-3.x32 marks protobuf-c-1.3.3-5.x32 (cap libprotobuf-c.so.1()(x32bit)) poldek: libgadu-devel-1.12.2-3.x32 marks protobuf-c-devel-1.3.3-5.x32 (cap protobuf-c-devel >= 1.0.0) poldek: There are 4 packages to install (3 marked by dependencies): poldek: A libgadu-1.12.2-3.x32 libgadu-devel-1.12.2-3.x32 protobuf-c-1.3.3-5.x32 poldek: A protobuf-c-devel-1.3.3-5.x32 poldek: This operation will use 597.6KB of disk space. poldek: Need to get 217.9KB of archives (217.9KB to download). poldek: poldek: Retrieving [1/4] th-test::protobuf-c-1.3.3-5.x32.rpm.......................................done poldek: Retrieving [2/4] th-test::protobuf-c-devel-1.3.3-5.x32.rpm.................................done poldek: Retrieving [3/4] th::libgadu-1.12.2-3.x32.rpm..............................................done poldek: Retrieving [4/4] th::libgadu-devel-1.12.2-3.x32.rpm........................................done poldek: Executing pm-command.sh --upgrade -vh --test --root / --define _check_dirname_deps 1... poldek: Preparing... ################################################## no conflicts found checking BR rpm: error: Failed build dependencies: rpm: libgadu-devel is needed by lms-1.11.13-11.src rpm: Building target platforms: x32-pld-linux installing BR: libgadu\-devel + poldek --noask --caplookup -Q -v '--ignore=hhvm-*' '--ignore=php4-*' '--ignore=php52-*' '--ignore=php54-*' '--ignore=php55-*' '--ignore=php56-*' '--ignore=php70-*' '--ignore=php71-*' '--ignore=php72-*' '--ignore=php73-*' '--ignore=php74-*' --upgrade libgadu-devel Loading [pndir]ready... Loading [pndir]th-test... Loading [pndir]th-test... Loading [pndir]th-ready... Loading [pndir]th-ready... Loading [pndir]th... Loading [pndir]th... 29675 packages read Removed 3851 duplicate packages from available set Processing dependencies... libgadu-devel-1.12.2-3.x32 marks libgadu-1.12.2-3.x32 (cap libgadu = 4:1.12.2-3) libgadu-1.12.2-3.x32 marks protobuf-c-1.3.3-5.x32 (cap libprotobuf-c.so.1()(x32bit)) libgadu-devel-1.12.2-3.x32 marks protobuf-c-devel-1.3.3-5.x32 (cap protobuf-c-devel >= 1.0.0) There are 4 packages to install (3 marked by dependencies): A libgadu-1.12.2-3.x32 libgadu-devel-1.12.2-3.x32 protobuf-c-1.3.3-5.x32 A protobuf-c-devel-1.3.3-5.x32 This operation will use 597.6KB of disk space. Need to get 217.9KB of archives. Executing pm-command.sh --upgrade -vh --root / --define _check_dirname_deps 1... Preparing... ################################################## protobuf-c ################################################## libgadu ################################################## protobuf-c-devel ################################################## libgadu-devel ################################################## building RPM using: set -ex; : build-id: 5e273c99-5839-4ac2-b52b-3c83d079b60a; TMPDIR=/tmp/B.tKED1E/BUILD/tmp exec nice -n 0 rpmbuild -bb --define '_smp_mflags -j9' --define '_make_opts -Otarget' --define '_pld_builder 1' --define '_topdir /tmp/B.tKED1E' --define '_specdir %{_topdir}' --define '_sourcedir %{_specdir}' --define '_rpmdir %{_topdir}/RPMS' --define '_builddir %{_topdir}/BUILD' --target x32-pld-linux /tmp/B.tKED1E/lms.spec + : build-id: 5e273c99-5839-4ac2-b52b-3c83d079b60a + TMPDIR=/tmp/B.tKED1E/BUILD/tmp + exec nice -n 0 rpmbuild -bb --define '_smp_mflags -j9' --define '_make_opts -Otarget' --define '_pld_builder 1' --define '_topdir /tmp/B.tKED1E' --define '_specdir %{_topdir}' --define '_sourcedir %{_specdir}' --define '_rpmdir %{_topdir}/RPMS' --define '_builddir %{_topdir}/BUILD' --target x32-pld-linux /tmp/B.tKED1E/lms.spec Building target platforms: x32-pld-linux Executing(%prep): /bin/sh -e /tmp/B.tKED1E/BUILD/tmp/rpm-tmp.90881 + umask 022 + cd /tmp/B.tKED1E/BUILD + cd /tmp/B.tKED1E/BUILD + rm -rf lms + /bin/gzip -dc /tmp/B.tKED1E/lms-1.11.13.tar.gz + /bin/tar -xf - + STATUS=0 + '[' 0 -ne 0 ']' + cd lms + /bin/id -u + '[' 1000 '=' 0 ']' + /bin/id -u + '[' 1000 '=' 0 ']' + /bin/chmod -Rf a+rX,u+w,g-w,o-w . + echo 'Patch #0 (lms-PLD.patch):' Patch #0 (lms-PLD.patch): + '[' -f /tmp/B.tKED1E/lms-PLD.patch ']' + /bin/cat /tmp/B.tKED1E/lms-PLD.patch + /usr/bin/patch -s -p1 + echo 'Patch #2 (lms-smarty.patch):' Patch #2 (lms-smarty.patch): + '[' -f /tmp/B.tKED1E/lms-smarty.patch ']' + /bin/cat /tmp/B.tKED1E/lms-smarty.patch + /usr/bin/patch -s -p1 + echo 'Patch #3 (build.patch):' Patch #3 (build.patch): + '[' -f /tmp/B.tKED1E/build.patch ']' + /bin/cat /tmp/B.tKED1E/build.patch + /usr/bin/patch -s -p1 + mkdir smarty-plugins + /bin/mv lib/Smarty/plugins/block.t.php lib/Smarty/plugins/function.bankaccount.php lib/Smarty/plugins/function.gentime.php lib/Smarty/plugins/function.handle.php lib/Smarty/plugins/function.memory.php lib/Smarty/plugins/function.number.php lib/Smarty/plugins/function.size.php lib/Smarty/plugins/function.sum.php lib/Smarty/plugins/function.tip.php lib/Smarty/plugins/modifier.money_format.php lib/Smarty/plugins/modifier.striphtml.php lib/Smarty/plugins/modifier.to_words.php smarty-plugins + /bin/rm '--interactive=never' -r lib/Smarty + find '(' -name '*~' -o -name '*.orig' ')' -print0 + xargs -0 -r -l512 /bin/rm '--interactive=never' + exit 0 Executing(%build): /bin/sh -e /tmp/B.tKED1E/BUILD/tmp/rpm-tmp.90881 HOME=/home/users/builder PATH=/home/users/builder/GNUstep/Tools:/bin:/usr/bin:/usr/local/bin TMPDIR=/tmp/B.tKED1E/BUILD/tmp + umask 022 + cd /tmp/B.tKED1E/BUILD + cd lms + cd daemon + ./configure --with-mysql OS Type... Linux Database type... MySQL Library location... /usr/lib Includes location... /usr/include SQL queries debugging... no Events debugging... no Configuration file... no Daemon install directory... /usr/local/lms/bin Modules install directory... /usr/local/lms/lib Create Makefile for main program... done Create Makefile for mod_cutoff... done Create Makefile for mod_dhcp... done Create Makefile for mod_dns... done Create Makefile for mod_ethers... done Create Makefile for mod_ewx-pt... done Create Makefile for mod_ewx-stm... done Create Makefile for mod_ewx-stm-channels... done Create Makefile for mod_ggnotify... done Create Makefile for mod_hostfile... done Create Makefile for mod_notify... done Create Makefile for mod_oident... done Create Makefile for mod_parser... done Create Makefile for mod_payments... done Create Makefile for mod_pinger... done Create Makefile for mod_system... done Create Makefile for mod_tc... done Create Makefile for mod_tc-new... done Create Makefile for mod_traffic... done Create Makefile for mod_parser extensions... done *************************************************************** Configuration finished. Now You can type 'make && make install' + /usr/bin/make -Otarget -j9 'CC=x86_64-pld-linux-gnux32-gcc' 'CFLAGS=-O2 -fwrapv -pipe -Wformat -Werror=format-security -gdwarf-4 -fno-debug-types-section -fvar-tracking-assignments -g2 -Wp,-D_FORTIFY_SOURCE=2 -fstack-protector-strong --param=ssp-buffer-size=4 -Werror=trampolines -fPIC -mtune=generic -march=x86-64 -gdwarf-4 -fno-debug-types-section -fvar-tracking-assignments -g2 -fPIC -DUSE_MYSQL -DLMS_LIB_DIR=\"/usr/libx32/lms/\" -I../..' /usr/bin/make -C modules for i in `echo cutoff dhcp dns ethers ewx-pt ewx-stm ewx-stm-channels ggnotify hostfile notify oident parser payments pinger system tc tc-new traffic `; do /usr/bin/make -C $i ; done x86_64-pld-linux-gnux32-gcc -O2 -fwrapv -pipe -Wformat -Werror=format-security -gdwarf-4 -fno-debug-types-section -fvar-tracking-assignments -g2 -Wp,-D_FORTIFY_SOURCE=2 -fstack-protector-strong --param=ssp-buffer-size=4 -Werror=trampolines -fPIC -mtune=generic -march=x86-64 -gdwarf-4 -fno-debug-types-section -fvar-tracking-assignments -g2 -fPIC -DUSE_MYSQL -DLMS_LIB_DIR=\"/usr/libx32/lms/\" -I../.. -c -o cron/cron.o cron/cron.c x86_64-pld-linux-gnux32-gcc -O2 -fwrapv -pipe -Wformat -Werror=format-security -gdwarf-4 -fno-debug-types-section -fvar-tracking-assignments -g2 -Wp,-D_FORTIFY_SOURCE=2 -fstack-protector-strong --param=ssp-buffer-size=4 -Werror=trampolines -fPIC -mtune=generic -march=x86-64 -gdwarf-4 -fno-debug-types-section -fvar-tracking-assignments -g2 -fPIC -DUSE_MYSQL -DLMS_LIB_DIR=\"/usr/libx32/lms/\" -I../.. -c -o util.o util.c x86_64-pld-linux-gnux32-gcc -O2 -fwrapv -pipe -Wformat -Werror=format-security -gdwarf-4 -fno-debug-types-section -fvar-tracking-assignments -g2 -Wp,-D_FORTIFY_SOURCE=2 -fstack-protector-strong --param=ssp-buffer-size=4 -Werror=trampolines -fPIC -mtune=generic -march=x86-64 -gdwarf-4 -fno-debug-types-section -fvar-tracking-assignments -g2 -fPIC -DUSE_MYSQL -DLMS_LIB_DIR=\"/usr/libx32/lms/\" -I../.. -c -o cron/cronparse.o cron/cronparse.c x86_64-pld-linux-gnux32-gcc -O2 -fwrapv -pipe -Wformat -Werror=format-security -gdwarf-4 -fno-debug-types-section -fvar-tracking-assignments -g2 -Wp,-D_FORTIFY_SOURCE=2 -fstack-protector-strong --param=ssp-buffer-size=4 -Werror=trampolines -fPIC -mtune=generic -march=x86-64 -gdwarf-4 -fno-debug-types-section -fvar-tracking-assignments -g2 -fPIC -DUSE_MYSQL -DLMS_LIB_DIR=\"/usr/libx32/lms/\" -I../.. -c -o config/dictionary.o config/dictionary.c x86_64-pld-linux-gnux32-gcc -O2 -fwrapv -pipe -Wformat -Werror=format-security -gdwarf-4 -fno-debug-types-section -fvar-tracking-assignments -g2 -Wp,-D_FORTIFY_SOURCE=2 -fstack-protector-strong --param=ssp-buffer-size=4 -Werror=trampolines -fPIC -mtune=generic -march=x86-64 -gdwarf-4 -fno-debug-types-section -fvar-tracking-assignments -g2 -fPIC -DUSE_MYSQL -DLMS_LIB_DIR=\"/usr/libx32/lms/\" -I../.. -c -o config/config.o config/config.c x86_64-pld-linux-gnux32-gcc -O2 -fwrapv -pipe -Wformat -Werror=format-security -gdwarf-4 -fno-debug-types-section -fvar-tracking-assignments -g2 -Wp,-D_FORTIFY_SOURCE=2 -fstack-protector-strong --param=ssp-buffer-size=4 -Werror=trampolines -fPIC -mtune=generic -march=x86-64 -gdwarf-4 -fno-debug-types-section -fvar-tracking-assignments -g2 -fPIC -DUSE_MYSQL -DLMS_LIB_DIR=\"/usr/libx32/lms/\" -I../.. -c -o dbdrivers/mysql/db.o dbdrivers/mysql/db.c x86_64-pld-linux-gnux32-gcc -O2 -fwrapv -pipe -Wformat -Werror=format-security -gdwarf-4 -fno-debug-types-section -fvar-tracking-assignments -g2 -Wp,-D_FORTIFY_SOURCE=2 -fstack-protector-strong --param=ssp-buffer-size=4 -Werror=trampolines -fPIC -mtune=generic -march=x86-64 -gdwarf-4 -fno-debug-types-section -fvar-tracking-assignments -g2 -fPIC -DUSE_MYSQL -DLMS_LIB_DIR=\"/usr/libx32/lms/\" -I../.. -c -o lmsd.o lmsd.c lmsd.c: In function 'main': lmsd.c:184:4: warning: ignoring return value of 'system' declared with attribute 'warn_unused_result' [-Wunused-result] 184 | system(command); | ^~~~~~~~~~~~~~~ make[2]: Entering directory '/tmp/B.tKED1E/BUILD/lms/daemon/modules/cutoff' x86_64-pld-linux-gnux32-gcc -O2 -fwrapv -pipe -Wformat -Werror=format-security -gdwarf-4 -fno-debug-types-section -fvar-tracking-assignments -g2 -Wp,-D_FORTIFY_SOURCE=2 -fstack-protector-strong --param=ssp-buffer-size=4 -Werror=trampolines -fPIC -mtune=generic -march=x86-64 -gdwarf-4 -fno-debug-types-section -fvar-tracking-assignments -g2 -fPIC -DUSE_MYSQL -DLMS_LIB_DIR=\"/usr/libx32/lms/\" -I../.. -c -o cutoff.o cutoff.c cutoff.c: In function 'reload': cutoff.c:479:3: warning: ignoring return value of 'system' declared with attribute 'warn_unused_result' [-Wunused-result] 479 | system(c->command); | ^~~~~~~~~~~~~~~~~~ make[2]: Leaving directory '/tmp/B.tKED1E/BUILD/lms/daemon/modules/cutoff' make[2]: Entering directory '/tmp/B.tKED1E/BUILD/lms/daemon/modules/cutoff' gcc -shared cutoff.o -o cutoff.so -L/usr/lib -lmysqlclient -ldl rm -rf cutoff.o make[2]: Leaving directory '/tmp/B.tKED1E/BUILD/lms/daemon/modules/cutoff' gcc dbdrivers/mysql/db.o util.o cron/cronparse.o cron/cron.o config/dictionary.o config/config.o lmsd.o -o lmsd -L/usr/lib -lmysqlclient -ldl make[2]: Entering directory '/tmp/B.tKED1E/BUILD/lms/daemon/modules/dhcp' x86_64-pld-linux-gnux32-gcc -O2 -fwrapv -pipe -Wformat -Werror=format-security -gdwarf-4 -fno-debug-types-section -fvar-tracking-assignments -g2 -Wp,-D_FORTIFY_SOURCE=2 -fstack-protector-strong --param=ssp-buffer-size=4 -Werror=trampolines -fPIC -mtune=generic -march=x86-64 -gdwarf-4 -fno-debug-types-section -fvar-tracking-assignments -g2 -fPIC -DUSE_MYSQL -DLMS_LIB_DIR=\"/usr/libx32/lms/\" -I../.. -c -o dhcp.o dhcp.c dhcp.c: In function 'reload': dhcp.c:294:3: warning: ignoring return value of 'system' declared with attribute 'warn_unused_result' [-Wunused-result] 294 | system(dhcp->command); | ^~~~~~~~~~~~~~~~~~~~~ make[2]: Leaving directory '/tmp/B.tKED1E/BUILD/lms/daemon/modules/dhcp' make[2]: Entering directory '/tmp/B.tKED1E/BUILD/lms/daemon/modules/dhcp' gcc -shared dhcp.o -o dhcp.so -L/usr/lib -lmysqlclient -ldl rm -rf dhcp.o make[2]: Leaving directory '/tmp/B.tKED1E/BUILD/lms/daemon/modules/dhcp' make[2]: Entering directory '/tmp/B.tKED1E/BUILD/lms/daemon/modules/dns' x86_64-pld-linux-gnux32-gcc -O2 -fwrapv -pipe -Wformat -Werror=format-security -gdwarf-4 -fno-debug-types-section -fvar-tracking-assignments -g2 -Wp,-D_FORTIFY_SOURCE=2 -fstack-protector-strong --param=ssp-buffer-size=4 -Werror=trampolines -fPIC -mtune=generic -march=x86-64 -gdwarf-4 -fno-debug-types-section -fvar-tracking-assignments -g2 -fPIC -DUSE_MYSQL -DLMS_LIB_DIR=\"/usr/libx32/lms/\" -I../.. -c -o dns.o dns.c dns.c: In function 'reload': dns.c:476:13: warning: ignoring return value of 'system' declared with attribute 'warn_unused_result' [-Wunused-result] 476 | system(dns->command); | ^~~~~~~~~~~~~~~~~~~~ make[2]: Leaving directory '/tmp/B.tKED1E/BUILD/lms/daemon/modules/dns' make[2]: Entering directory '/tmp/B.tKED1E/BUILD/lms/daemon/modules/dns' gcc -shared dns.o -o dns.so -L/usr/lib -lmysqlclient -ldl rm -rf dns.o make[2]: Leaving directory '/tmp/B.tKED1E/BUILD/lms/daemon/modules/dns' make[2]: Entering directory '/tmp/B.tKED1E/BUILD/lms/daemon/modules/ethers' x86_64-pld-linux-gnux32-gcc -O2 -fwrapv -pipe -Wformat -Werror=format-security -gdwarf-4 -fno-debug-types-section -fvar-tracking-assignments -g2 -Wp,-D_FORTIFY_SOURCE=2 -fstack-protector-strong --param=ssp-buffer-size=4 -Werror=trampolines -fPIC -mtune=generic -march=x86-64 -gdwarf-4 -fno-debug-types-section -fvar-tracking-assignments -g2 -fPIC -DUSE_MYSQL -DLMS_LIB_DIR=\"/usr/libx32/lms/\" -I../.. -c -o ethers.o ethers.c ethers.c: In function 'reload': ethers.c:145:3: warning: ignoring return value of 'system' declared with attribute 'warn_unused_result' [-Wunused-result] 145 | system(fm->command); | ^~~~~~~~~~~~~~~~~~~ make[2]: Leaving directory '/tmp/B.tKED1E/BUILD/lms/daemon/modules/ethers' make[2]: Entering directory '/tmp/B.tKED1E/BUILD/lms/daemon/modules/ethers' gcc -shared ethers.o -o ethers.so -L/usr/lib -lmysqlclient -ldl rm -rf ethers.o make[2]: Leaving directory '/tmp/B.tKED1E/BUILD/lms/daemon/modules/ethers' make[2]: Entering directory '/tmp/B.tKED1E/BUILD/lms/daemon/modules/ewx-pt' x86_64-pld-linux-gnux32-gcc -O2 -fwrapv -pipe -Wformat -Werror=format-security -gdwarf-4 -fno-debug-types-section -fvar-tracking-assignments -g2 -Wp,-D_FORTIFY_SOURCE=2 -fstack-protector-strong --param=ssp-buffer-size=4 -Werror=trampolines -fPIC -mtune=generic -march=x86-64 -gdwarf-4 -fno-debug-types-section -fvar-tracking-assignments -g2 -fPIC -DUSE_MYSQL -DLMS_LIB_DIR=\"/usr/libx32/lms/\" -I../.. -c -o ewx-pt.o ewx-pt.c ewx-pt.c: In function 'reload': ewx-pt.c:204:2: warning: 'remote_port' is deprecated [-Wdeprecated-declarations] 204 | session.remote_port = ewx->port; // destination port | ^~~~~~~ In file included from /usr/include/net-snmp/definitions.h:22, from /usr/include/net-snmp/net-snmp-includes.h:24, from ewx-pt.h:2, from ewx-pt.c:33: /usr/include/net-snmp/types.h:307:21: note: declared here 307 | u_short remote_port NETSNMP_ATTRIBUTE_DEPRECATED; | ^~~~~~~~~~~ make[2]: Leaving directory '/tmp/B.tKED1E/BUILD/lms/daemon/modules/ewx-pt' make[2]: Entering directory '/tmp/B.tKED1E/BUILD/lms/daemon/modules/ewx-pt' gcc -shared ewx-pt.o -o ewx-pt.so -L/usr/lib `net-snmp-config --ldflags` -lmysqlclient -ldl `net-snmp-config --libs` rm -rf ewx-pt.o make[2]: Leaving directory '/tmp/B.tKED1E/BUILD/lms/daemon/modules/ewx-pt' make[2]: Entering directory '/tmp/B.tKED1E/BUILD/lms/daemon/modules/ewx-stm' x86_64-pld-linux-gnux32-gcc -O2 -fwrapv -pipe -Wformat -Werror=format-security -gdwarf-4 -fno-debug-types-section -fvar-tracking-assignments -g2 -Wp,-D_FORTIFY_SOURCE=2 -fstack-protector-strong --param=ssp-buffer-size=4 -Werror=trampolines -fPIC -mtune=generic -march=x86-64 -gdwarf-4 -fno-debug-types-section -fvar-tracking-assignments -g2 -fPIC -DUSE_MYSQL -DLMS_LIB_DIR=\"/usr/libx32/lms/\" -I../.. -c -o ewx-stm.o ewx-stm.c ewx-stm.c: In function 'reload': ewx-stm.c:101:2: warning: 'remote_port' is deprecated [-Wdeprecated-declarations] 101 | session.remote_port = ewx->port; // destination port | ^~~~~~~ In file included from /usr/include/net-snmp/definitions.h:22, from /usr/include/net-snmp/net-snmp-includes.h:24, from ewx-stm.h:2, from ewx-stm.c:34: /usr/include/net-snmp/types.h:307:21: note: declared here 307 | u_short remote_port NETSNMP_ATTRIBUTE_DEPRECATED; | ^~~~~~~~~~~ make[2]: Leaving directory '/tmp/B.tKED1E/BUILD/lms/daemon/modules/ewx-stm' make[2]: Entering directory '/tmp/B.tKED1E/BUILD/lms/daemon/modules/ewx-stm' gcc -shared ewx-stm.o -o ewx-stm.so -L/usr/lib `net-snmp-config --ldflags` -lmysqlclient -ldl `net-snmp-config --libs` -lm rm -rf ewx-stm.o make[2]: Leaving directory '/tmp/B.tKED1E/BUILD/lms/daemon/modules/ewx-stm' make[2]: Entering directory '/tmp/B.tKED1E/BUILD/lms/daemon/modules/ewx-stm-channels' x86_64-pld-linux-gnux32-gcc -O2 -fwrapv -pipe -Wformat -Werror=format-security -gdwarf-4 -fno-debug-types-section -fvar-tracking-assignments -g2 -Wp,-D_FORTIFY_SOURCE=2 -fstack-protector-strong --param=ssp-buffer-size=4 -Werror=trampolines -fPIC -mtune=generic -march=x86-64 -gdwarf-4 -fno-debug-types-section -fvar-tracking-assignments -g2 -fPIC -DUSE_MYSQL -DLMS_LIB_DIR=\"/usr/libx32/lms/\" -I../.. -c -o ewx-stm-channels.o ewx-stm-channels.c ewx-stm-channels.c: In function 'reload': ewx-stm-channels.c:101:2: warning: 'remote_port' is deprecated [-Wdeprecated-declarations] 101 | session.remote_port = ewx->port; // destination port | ^~~~~~~ In file included from /usr/include/net-snmp/definitions.h:22, from /usr/include/net-snmp/net-snmp-includes.h:24, from ewx-stm-channels.h:2, from ewx-stm-channels.c:33: /usr/include/net-snmp/types.h:307:21: note: declared here 307 | u_short remote_port NETSNMP_ATTRIBUTE_DEPRECATED; | ^~~~~~~~~~~ make[2]: Leaving directory '/tmp/B.tKED1E/BUILD/lms/daemon/modules/ewx-stm-channels' make[2]: Entering directory '/tmp/B.tKED1E/BUILD/lms/daemon/modules/ewx-stm-channels' gcc -shared ewx-stm-channels.o -o ewx-stm-channels.so -L/usr/lib `net-snmp-config --ldflags` -lmysqlclient -ldl `net-snmp-config --libs` rm -rf ewx-stm-channels.o make[2]: Leaving directory '/tmp/B.tKED1E/BUILD/lms/daemon/modules/ewx-stm-channels' make[2]: Entering directory '/tmp/B.tKED1E/BUILD/lms/daemon/modules/ggnotify' x86_64-pld-linux-gnux32-gcc -O2 -fwrapv -pipe -Wformat -Werror=format-security -gdwarf-4 -fno-debug-types-section -fvar-tracking-assignments -g2 -Wp,-D_FORTIFY_SOURCE=2 -fstack-protector-strong --param=ssp-buffer-size=4 -Werror=trampolines -fPIC -mtune=generic -march=x86-64 -gdwarf-4 -fno-debug-types-section -fvar-tracking-assignments -g2 -fPIC -DUSE_MYSQL -DLMS_LIB_DIR=\"/usr/libx32/lms/\" -I../.. -c -o ggnotify.o ggnotify.c make[2]: Leaving directory '/tmp/B.tKED1E/BUILD/lms/daemon/modules/ggnotify' make[2]: Entering directory '/tmp/B.tKED1E/BUILD/lms/daemon/modules/ggnotify' gcc -shared ggnotify.o -o ggnotify.so -L/usr/lib -L/usr/lib -lmysqlclient -ldl -lgadu rm -rf ggnotify.o make[2]: Leaving directory '/tmp/B.tKED1E/BUILD/lms/daemon/modules/ggnotify' make[2]: Entering directory '/tmp/B.tKED1E/BUILD/lms/daemon/modules/hostfile' x86_64-pld-linux-gnux32-gcc -O2 -fwrapv -pipe -Wformat -Werror=format-security -gdwarf-4 -fno-debug-types-section -fvar-tracking-assignments -g2 -Wp,-D_FORTIFY_SOURCE=2 -fstack-protector-strong --param=ssp-buffer-size=4 -Werror=trampolines -fPIC -mtune=generic -march=x86-64 -gdwarf-4 -fno-debug-types-section -fvar-tracking-assignments -g2 -fPIC -DUSE_MYSQL -DLMS_LIB_DIR=\"/usr/libx32/lms/\" -I../.. -c -o hostfile.o hostfile.c hostfile.c: In function 'reload': hostfile.c:470:3: warning: ignoring return value of 'system' declared with attribute 'warn_unused_result' [-Wunused-result] 470 | system(hm->command); | ^~~~~~~~~~~~~~~~~~~ make[2]: Leaving directory '/tmp/B.tKED1E/BUILD/lms/daemon/modules/hostfile' make[2]: Entering directory '/tmp/B.tKED1E/BUILD/lms/daemon/modules/hostfile' gcc -shared hostfile.o -o hostfile.so -L/usr/lib -lmysqlclient -ldl rm -rf hostfile.o make[2]: Leaving directory '/tmp/B.tKED1E/BUILD/lms/daemon/modules/hostfile' make[2]: Entering directory '/tmp/B.tKED1E/BUILD/lms/daemon/modules/notify' x86_64-pld-linux-gnux32-gcc -O2 -fwrapv -pipe -Wformat -Werror=format-security -gdwarf-4 -fno-debug-types-section -fvar-tracking-assignments -g2 -Wp,-D_FORTIFY_SOURCE=2 -fstack-protector-strong --param=ssp-buffer-size=4 -Werror=trampolines -fPIC -mtune=generic -march=x86-64 -gdwarf-4 -fno-debug-types-section -fvar-tracking-assignments -g2 -fPIC -DUSE_MYSQL -DLMS_LIB_DIR=\"/usr/libx32/lms/\" -I../.. -c -o notify.o notify.c notify.c: In function 'reload': notify.c:174:6: warning: ignoring return value of 'system' declared with attribute 'warn_unused_result' [-Wunused-result] 174 | system(command); | ^~~~~~~~~~~~~~~ make[2]: Leaving directory '/tmp/B.tKED1E/BUILD/lms/daemon/modules/notify' make[2]: Entering directory '/tmp/B.tKED1E/BUILD/lms/daemon/modules/notify' gcc -shared notify.o -o notify.so -L/usr/lib -lmysqlclient -ldl rm -rf notify.o make[2]: Leaving directory '/tmp/B.tKED1E/BUILD/lms/daemon/modules/notify' make[2]: Entering directory '/tmp/B.tKED1E/BUILD/lms/daemon/modules/oident' x86_64-pld-linux-gnux32-gcc -O2 -fwrapv -pipe -Wformat -Werror=format-security -gdwarf-4 -fno-debug-types-section -fvar-tracking-assignments -g2 -Wp,-D_FORTIFY_SOURCE=2 -fstack-protector-strong --param=ssp-buffer-size=4 -Werror=trampolines -fPIC -mtune=generic -march=x86-64 -gdwarf-4 -fno-debug-types-section -fvar-tracking-assignments -g2 -fPIC -DUSE_MYSQL -DLMS_LIB_DIR=\"/usr/libx32/lms/\" -I../.. -c -o oident.o oident.c oident.c: In function 'reload': oident.c:123:3: warning: ignoring return value of 'system' declared with attribute 'warn_unused_result' [-Wunused-result] 123 | system(o->command); | ^~~~~~~~~~~~~~~~~~ make[2]: Leaving directory '/tmp/B.tKED1E/BUILD/lms/daemon/modules/oident' make[2]: Entering directory '/tmp/B.tKED1E/BUILD/lms/daemon/modules/oident' gcc -shared oident.o -o oident.so -L/usr/lib -lmysqlclient -ldl rm -rf oident.o make[2]: Leaving directory '/tmp/B.tKED1E/BUILD/lms/daemon/modules/oident' /usr/bin/make -C lib /usr/bin/make -C extensions make[2]: *** No rule to make target 'lib/libtscript.a', needed by 'parser.so'. Stop. make[2]: *** Waiting for unfinished jobs.... make[3]: Circular tscript_parser.h <- tscript_parser.h dependency dropped. make[3]: Entering directory '/tmp/B.tKED1E/BUILD/lms/daemon/modules/parser/lib' yacc tscript_parser.y yacc: e - line 45 of "tscript_parser.y", syntax error %error-verbose ^ make[3]: *** [<builtin>: tscript_parser.c] Error 1 make[3]: Leaving directory '/tmp/B.tKED1E/BUILD/lms/daemon/modules/parser/lib' make[3]: *** Waiting for unfinished jobs.... make[3]: Entering directory '/tmp/B.tKED1E/BUILD/lms/daemon/modules/parser/extensions' gcc -c tscript_exec.c -O2 -fwrapv -pipe -Wformat -Werror=format-security -gdwarf-4 -fno-debug-types-section -fvar-tracking-assignments -g2 -Wp,-D_FORTIFY_SOURCE=2 -fstack-protector-strong --param=ssp-buffer-size=4 -Werror=trampolines -fPIC -mtune=generic -march=x86-64 -gdwarf-4 -fno-debug-types-section -fvar-tracking-assignments -g2 -fPIC -DUSE_MYSQL -DLMS_LIB_DIR=\"/usr/libx32/lms/\" -I../.. In file included from tscript_exec.c:32: tscript_exec.h:4:10: fatal error: tscript_context.h: No such file or directory 4 | #include "tscript_context.h" | ^~~~~~~~~~~~~~~~~~~ compilation terminated. make[3]: *** [Makefile:14: tscript_exec.o] Error 1 make[3]: Leaving directory '/tmp/B.tKED1E/BUILD/lms/daemon/modules/parser/extensions' make[3]: *** Waiting for unfinished jobs.... make[3]: Entering directory '/tmp/B.tKED1E/BUILD/lms/daemon/modules/parser/extensions' gcc -c tscript_string.c -O2 -fwrapv -pipe -Wformat -Werror=format-security -gdwarf-4 -fno-debug-types-section -fvar-tracking-assignments -g2 -Wp,-D_FORTIFY_SOURCE=2 -fstack-protector-strong --param=ssp-buffer-size=4 -Werror=trampolines -fPIC -mtune=generic -march=x86-64 -gdwarf-4 -fno-debug-types-section -fvar-tracking-assignments -g2 -fPIC -DUSE_MYSQL -DLMS_LIB_DIR=\"/usr/libx32/lms/\" -I../.. In file included from tscript_string.c:32: tscript_string.h:4:10: fatal error: tscript_context.h: No such file or directory 4 | #include "tscript_context.h" | ^~~~~~~~~~~~~~~~~~~ compilation terminated. make[3]: *** [Makefile:14: tscript_string.o] Error 1 make[3]: Leaving directory '/tmp/B.tKED1E/BUILD/lms/daemon/modules/parser/extensions' make[3]: Entering directory '/tmp/B.tKED1E/BUILD/lms/daemon/modules/parser/extensions' gcc -c tscript_file.c -O2 -fwrapv -pipe -Wformat -Werror=format-security -gdwarf-4 -fno-debug-types-section -fvar-tracking-assignments -g2 -Wp,-D_FORTIFY_SOURCE=2 -fstack-protector-strong --param=ssp-buffer-size=4 -Werror=trampolines -fPIC -mtune=generic -march=x86-64 -gdwarf-4 -fno-debug-types-section -fvar-tracking-assignments -g2 -fPIC -DUSE_MYSQL -DLMS_LIB_DIR=\"/usr/libx32/lms/\" -I../.. In file included from tscript_file.c:32: tscript_file.h:4:10: fatal error: tscript_context.h: No such file or directory 4 | #include "tscript_context.h" | ^~~~~~~~~~~~~~~~~~~ compilation terminated. make[3]: *** [Makefile:14: tscript_file.o] Error 1 make[3]: Leaving directory '/tmp/B.tKED1E/BUILD/lms/daemon/modules/parser/extensions' make[3]: Entering directory '/tmp/B.tKED1E/BUILD/lms/daemon/modules/parser/extensions' gcc -c tscript_sysinfo.c -O2 -fwrapv -pipe -Wformat -Werror=format-security -gdwarf-4 -fno-debug-types-section -fvar-tracking-assignments -g2 -Wp,-D_FORTIFY_SOURCE=2 -fstack-protector-strong --param=ssp-buffer-size=4 -Werror=trampolines -fPIC -mtune=generic -march=x86-64 -gdwarf-4 -fno-debug-types-section -fvar-tracking-assignments -g2 -fPIC -DUSE_MYSQL -DLMS_LIB_DIR=\"/usr/libx32/lms/\" -I../.. In file included from tscript_sysinfo.c:32: tscript_sysinfo.h:4:10: fatal error: tscript_context.h: No such file or directory 4 | #include "tscript_context.h" | ^~~~~~~~~~~~~~~~~~~ compilation terminated. make[3]: *** [Makefile:14: tscript_sysinfo.o] Error 1 make[3]: Leaving directory '/tmp/B.tKED1E/BUILD/lms/daemon/modules/parser/extensions' make[3]: Entering directory '/tmp/B.tKED1E/BUILD/lms/daemon/modules/parser/extensions' gcc -c sql.c -O2 -fwrapv -pipe -Wformat -Werror=format-security -gdwarf-4 -fno-debug-types-section -fvar-tracking-assignments -g2 -Wp,-D_FORTIFY_SOURCE=2 -fstack-protector-strong --param=ssp-buffer-size=4 -Werror=trampolines -fPIC -mtune=generic -march=x86-64 -gdwarf-4 -fno-debug-types-section -fvar-tracking-assignments -g2 -fPIC -DUSE_MYSQL -DLMS_LIB_DIR=\"/usr/libx32/lms/\" -I../.. In file included from sql.c:25: sql.h:4:10: fatal error: tscript_context.h: No such file or directory 4 | #include "tscript_context.h" | ^~~~~~~~~~~~~~~~~~~ compilation terminated. make[3]: *** [Makefile:14: sql.o] Error 1 make[3]: Leaving directory '/tmp/B.tKED1E/BUILD/lms/daemon/modules/parser/extensions' make[2]: Entering directory '/tmp/B.tKED1E/BUILD/lms/daemon/modules/parser' x86_64-pld-linux-gnux32-gcc -O2 -fwrapv -pipe -Wformat -Werror=format-security -gdwarf-4 -fno-debug-types-section -fvar-tracking-assignments -g2 -Wp,-D_FORTIFY_SOURCE=2 -fstack-protector-strong --param=ssp-buffer-size=4 -Werror=trampolines -fPIC -mtune=generic -march=x86-64 -gdwarf-4 -fno-debug-types-section -fvar-tracking-assignments -g2 -fPIC -DUSE_MYSQL -DLMS_LIB_DIR=\"/usr/libx32/lms/\" -I../.. -c -o parser.o parser.c parser.c:32:10: fatal error: tscript_context.h: No such file or directory 32 | #include "tscript_context.h" | ^~~~~~~~~~~~~~~~~~~ compilation terminated. make[2]: *** [<builtin>: parser.o] Error 1 make[2]: Leaving directory '/tmp/B.tKED1E/BUILD/lms/daemon/modules/parser' make[3]: Entering directory '/tmp/B.tKED1E/BUILD/lms/daemon/modules/parser/extensions' gcc -c net.c -O2 -fwrapv -pipe -Wformat -Werror=format-security -gdwarf-4 -fno-debug-types-section -fvar-tracking-assignments -g2 -Wp,-D_FORTIFY_SOURCE=2 -fstack-protector-strong --param=ssp-buffer-size=4 -Werror=trampolines -fPIC -mtune=generic -march=x86-64 -gdwarf-4 -fno-debug-types-section -fvar-tracking-assignments -g2 -fPIC -DUSE_MYSQL -DLMS_LIB_DIR=\"/usr/libx32/lms/\" -I../.. In file included from net.c:31: net.h:4:10: fatal error: tscript_context.h: No such file or directory 4 | #include "tscript_context.h" | ^~~~~~~~~~~~~~~~~~~ compilation terminated. make[3]: *** [Makefile:14: net.o] Error 1 make[3]: Leaving directory '/tmp/B.tKED1E/BUILD/lms/daemon/modules/parser/extensions' make[2]: *** [Makefile:20: ext] Error 2 make[3]: Entering directory '/tmp/B.tKED1E/BUILD/lms/daemon/modules/parser/lib' bison -o tscript_parser.c -d tscript_parser.y -p tscript_yy -r lookahead tscript_parser.y:45.1-14: warning: deprecated directive: '%error-verbose', use '%define parse.error verbose' [-Wdeprecated] 45 | %error-verbose | ^~~~~~~~~~~~~~ | %define parse.error verbose tscript_parser.y: warning: 32 shift/reduce conflicts [-Wconflicts-sr] tscript_parser.y: warning: 1 reduce/reduce conflict [-Wconflicts-rr] tscript_parser.y: note: rerun with option '-Wcounterexamples' to generate conflict counterexamples tscript_parser.y: warning: fix-its can be applied. Rerun with option '--update'. [-Wother] make[3]: Leaving directory '/tmp/B.tKED1E/BUILD/lms/daemon/modules/parser/lib' make[2]: *** [Makefile:17: libs] Error 2 make[2]: Entering directory '/tmp/B.tKED1E/BUILD/lms/daemon/modules/payments' x86_64-pld-linux-gnux32-gcc -O2 -fwrapv -pipe -Wformat -Werror=format-security -gdwarf-4 -fno-debug-types-section -fvar-tracking-assignments -g2 -Wp,-D_FORTIFY_SOURCE=2 -fstack-protector-strong --param=ssp-buffer-size=4 -Werror=trampolines -fPIC -mtune=generic -march=x86-64 -gdwarf-4 -fno-debug-types-section -fvar-tracking-assignments -g2 -fPIC -DUSE_MYSQL -DLMS_LIB_DIR=\"/usr/libx32/lms/\" -I../.. -c -o payments.o payments.c make[2]: Leaving directory '/tmp/B.tKED1E/BUILD/lms/daemon/modules/payments' make[2]: Entering directory '/tmp/B.tKED1E/BUILD/lms/daemon/modules/payments' gcc -shared payments.o -o payments.so -L/usr/lib -lmysqlclient -ldl rm -rf payments.o make[2]: Leaving directory '/tmp/B.tKED1E/BUILD/lms/daemon/modules/payments' make[2]: Entering directory '/tmp/B.tKED1E/BUILD/lms/daemon/modules/pinger' x86_64-pld-linux-gnux32-gcc -O2 -fwrapv -pipe -Wformat -Werror=format-security -gdwarf-4 -fno-debug-types-section -fvar-tracking-assignments -g2 -Wp,-D_FORTIFY_SOURCE=2 -fstack-protector-strong --param=ssp-buffer-size=4 -Werror=trampolines -fPIC -mtune=generic -march=x86-64 -gdwarf-4 -fno-debug-types-section -fvar-tracking-assignments -g2 -fPIC -DUSE_MYSQL -DLMS_LIB_DIR=\"/usr/libx32/lms/\" -I../.. -c -o pinger.o pinger.c make[2]: Leaving directory '/tmp/B.tKED1E/BUILD/lms/daemon/modules/pinger' make[2]: Entering directory '/tmp/B.tKED1E/BUILD/lms/daemon/modules/pinger' gcc -shared pinger.o -o pinger.so -L/usr/lib -lmysqlclient -ldl rm -rf pinger.o make[2]: Leaving directory '/tmp/B.tKED1E/BUILD/lms/daemon/modules/pinger' make[2]: Entering directory '/tmp/B.tKED1E/BUILD/lms/daemon/modules/system' x86_64-pld-linux-gnux32-gcc -O2 -fwrapv -pipe -Wformat -Werror=format-security -gdwarf-4 -fno-debug-types-section -fvar-tracking-assignments -g2 -Wp,-D_FORTIFY_SOURCE=2 -fstack-protector-strong --param=ssp-buffer-size=4 -Werror=trampolines -fPIC -mtune=generic -march=x86-64 -gdwarf-4 -fno-debug-types-section -fvar-tracking-assignments -g2 -fPIC -DUSE_MYSQL -DLMS_LIB_DIR=\"/usr/libx32/lms/\" -I../.. -c -o system.o system.c system.c: In function 'reload': system.c:42:3: warning: ignoring return value of 'system' declared with attribute 'warn_unused_result' [-Wunused-result] 42 | system(s->command); | ^~~~~~~~~~~~~~~~~~ make[2]: Leaving directory '/tmp/B.tKED1E/BUILD/lms/daemon/modules/system' make[2]: Entering directory '/tmp/B.tKED1E/BUILD/lms/daemon/modules/system' gcc -shared system.o -o system.so -L/usr/lib -lmysqlclient -ldl rm -rf system.o make[2]: Leaving directory '/tmp/B.tKED1E/BUILD/lms/daemon/modules/system' make[2]: Entering directory '/tmp/B.tKED1E/BUILD/lms/daemon/modules/tc' x86_64-pld-linux-gnux32-gcc -O2 -fwrapv -pipe -Wformat -Werror=format-security -gdwarf-4 -fno-debug-types-section -fvar-tracking-assignments -g2 -Wp,-D_FORTIFY_SOURCE=2 -fstack-protector-strong --param=ssp-buffer-size=4 -Werror=trampolines -fPIC -mtune=generic -march=x86-64 -gdwarf-4 -fno-debug-types-section -fvar-tracking-assignments -g2 -fPIC -DUSE_MYSQL -DLMS_LIB_DIR=\"/usr/libx32/lms/\" -I../.. -c -o tc.o tc.c tc.c: In function 'reload': tc.c:443:3: warning: ignoring return value of 'system' declared with attribute 'warn_unused_result' [-Wunused-result] 443 | system(tc->command); | ^~~~~~~~~~~~~~~~~~~ make[2]: Leaving directory '/tmp/B.tKED1E/BUILD/lms/daemon/modules/tc' make[2]: Entering directory '/tmp/B.tKED1E/BUILD/lms/daemon/modules/tc' gcc -shared tc.o -o tc.so -L/usr/lib -lmysqlclient -ldl rm -rf tc.o make[2]: Leaving directory '/tmp/B.tKED1E/BUILD/lms/daemon/modules/tc' make[2]: Entering directory '/tmp/B.tKED1E/BUILD/lms/daemon/modules/tc-new' x86_64-pld-linux-gnux32-gcc -O2 -fwrapv -pipe -Wformat -Werror=format-security -gdwarf-4 -fno-debug-types-section -fvar-tracking-assignments -g2 -Wp,-D_FORTIFY_SOURCE=2 -fstack-protector-strong --param=ssp-buffer-size=4 -Werror=trampolines -fPIC -mtune=generic -march=x86-64 -gdwarf-4 -fno-debug-types-section -fvar-tracking-assignments -g2 -fPIC -DUSE_MYSQL -DLMS_LIB_DIR=\"/usr/libx32/lms/\" -I../.. -c -o tc-new.o tc-new.c tc-new.c: In function 'reload': tc-new.c:513:3: warning: ignoring return value of 'system' declared with attribute 'warn_unused_result' [-Wunused-result] 513 | system(tc->command); | ^~~~~~~~~~~~~~~~~~~ make[2]: Leaving directory '/tmp/B.tKED1E/BUILD/lms/daemon/modules/tc-new' make[2]: Entering directory '/tmp/B.tKED1E/BUILD/lms/daemon/modules/tc-new' gcc -shared tc-new.o -o tc-new.so -L/usr/lib -lmysqlclient -ldl rm -rf tc-new.o make[2]: Leaving directory '/tmp/B.tKED1E/BUILD/lms/daemon/modules/tc-new' make[2]: Entering directory '/tmp/B.tKED1E/BUILD/lms/daemon/modules/traffic' x86_64-pld-linux-gnux32-gcc -O2 -fwrapv -pipe -Wformat -Werror=format-security -gdwarf-4 -fno-debug-types-section -fvar-tracking-assignments -g2 -Wp,-D_FORTIFY_SOURCE=2 -fstack-protector-strong --param=ssp-buffer-size=4 -Werror=trampolines -fPIC -mtune=generic -march=x86-64 -gdwarf-4 -fno-debug-types-section -fvar-tracking-assignments -g2 -fPIC -DUSE_MYSQL -DLMS_LIB_DIR=\"/usr/libx32/lms/\" -I../.. -c -o traffic.o traffic.c traffic.c: In function 'reload': traffic.c:65:4: warning: ignoring return value of 'system' declared with attribute 'warn_unused_result' [-Wunused-result] 65 | system(traffic->begin_command); | ^~~~~~~~~~~~~~~~~~~~~~~~~~~~~~ traffic.c:119:3: warning: ignoring return value of 'system' declared with attribute 'warn_unused_result' [-Wunused-result] 119 | system(traffic->end_command); | ^~~~~~~~~~~~~~~~~~~~~~~~~~~~ make[2]: Leaving directory '/tmp/B.tKED1E/BUILD/lms/daemon/modules/traffic' make[2]: Entering directory '/tmp/B.tKED1E/BUILD/lms/daemon/modules/traffic' gcc -shared traffic.o -o traffic.so -L/usr/lib -lmysqlclient -ldl rm -rf traffic.o make[2]: Leaving directory '/tmp/B.tKED1E/BUILD/lms/daemon/modules/traffic' + mv lmsd lmsd-mysql + ./configure --with-pgsql OS Type... Linux Database type... PostgreSQL Library location... /usr/lib Includes location... /usr/include SQL queries debugging... no Events debugging... no Configuration file... no Daemon install directory... /usr/local/lms/bin Modules install directory... /usr/local/lms/lib Create Makefile for main program... done Create Makefile for mod_cutoff... done Create Makefile for mod_dhcp... done Create Makefile for mod_dns... done Create Makefile for mod_ethers... done Create Makefile for mod_ewx-pt... done Create Makefile for mod_ewx-stm... done Create Makefile for mod_ewx-stm-channels... done Create Makefile for mod_ggnotify... done Create Makefile for mod_hostfile... done Create Makefile for mod_notify... done Create Makefile for mod_oident... done Create Makefile for mod_parser... done Create Makefile for mod_payments... done Create Makefile for mod_pinger... done Create Makefile for mod_system... done Create Makefile for mod_tc... done Create Makefile for mod_tc-new... done Create Makefile for mod_traffic... done Create Makefile for mod_parser extensions... done *************************************************************** Configuration finished. Now You can type 'make && make install' + /usr/bin/make -Otarget -j9 lmsd 'CC=x86_64-pld-linux-gnux32-gcc' 'CFLAGS=-O2 -fwrapv -pipe -Wformat -Werror=format-security -gdwarf-4 -fno-debug-types-section -fvar-tracking-assignments -g2 -Wp,-D_FORTIFY_SOURCE=2 -fstack-protector-strong --param=ssp-buffer-size=4 -Werror=trampolines -fPIC -mtune=generic -march=x86-64 -gdwarf-4 -fno-debug-types-section -fvar-tracking-assignments -g2 -fPIC -DUSE_PGSQL -DLMS_LIB_DIR=\"/usr/libx32/lms/\" -I../..' x86_64-pld-linux-gnux32-gcc -O2 -fwrapv -pipe -Wformat -Werror=format-security -gdwarf-4 -fno-debug-types-section -fvar-tracking-assignments -g2 -Wp,-D_FORTIFY_SOURCE=2 -fstack-protector-strong --param=ssp-buffer-size=4 -Werror=trampolines -fPIC -mtune=generic -march=x86-64 -gdwarf-4 -fno-debug-types-section -fvar-tracking-assignments -g2 -fPIC -DUSE_PGSQL -DLMS_LIB_DIR=\"/usr/libx32/lms/\" -I../.. -c -o dbdrivers/pgsql/db.o dbdrivers/pgsql/db.c gcc dbdrivers/pgsql/db.o util.o cron/cronparse.o cron/cron.o config/dictionary.o config/config.o lmsd.o -o lmsd -L/usr/lib -lpq -ldl + mv lmsd lmsd-pgsql + CFLAGS='-O2 -fwrapv -pipe -Wformat -Werror=format-security -gdwarf-4 -fno-debug-types-section -fvar-tracking-assignments -g2 -Wp,-D_FORTIFY_SOURCE=2 -fstack-protector-strong --param=ssp-buffer-size=4 -Werror=trampolines -fPIC -mtune=generic -march=x86-64 -gdwarf-4 -fno-debug-types-section -fvar-tracking-assignments -g2 ' /usr/bin/make -Otarget -j9 -j1 -C modules/parser 'CC=x86_64-pld-linux-gnux32-gcc' make: Entering directory '/tmp/B.tKED1E/BUILD/lms/daemon/modules/parser' /usr/bin/make -C lib make[1]: Entering directory '/tmp/B.tKED1E/BUILD/lms/daemon/modules/parser/lib' make[1]: Circular tscript_parser.h <- tscript_parser.h dependency dropped. x86_64-pld-linux-gnux32-gcc -c tscript_ast.c -O2 -fPIC x86_64-pld-linux-gnux32-gcc -c tscript_context.c -O2 -fPIC x86_64-pld-linux-gnux32-gcc -c tscript_compiler.c -O2 -fPIC tscript_compiler.c: In function 'tscript_compile_stream': tscript_compiler.c:42:2: warning: implicit declaration of function 'tscript_init_lexical' [-Wimplicit-function-declaration] 42 | tscript_init_lexical(); | ^~~~~~~~~~~~~~~~~~~~ tscript_compiler.c:43:25: warning: passing argument 1 of 'tscript_yyparse' from incompatible pointer type [-Wincompatible-pointer-types] 43 | return tscript_yyparse(&context->ast); | ^~~~~~~~~~~~~ | | | struct tscript_ast_node ** In file included from tscript_compiler.c:33: tscript_parser.h:123:39: note: expected 'tscript_context *' but argument is of type 'struct tscript_ast_node **' 123 | int tscript_yyparse (tscript_context* context); | ~~~~~~~~~~~~~~~~~^~~~~~~ tscript_compiler.c: In function 'tscript_compile_string': tscript_compiler.c:51:22: warning: passing argument 1 of 'tscript_yyparse' from incompatible pointer type [-Wincompatible-pointer-types] 51 | r = tscript_yyparse(&context->ast); | ^~~~~~~~~~~~~ | | | struct tscript_ast_node ** In file included from tscript_compiler.c:33: tscript_parser.h:123:39: note: expected 'tscript_context *' but argument is of type 'struct tscript_ast_node **' 123 | int tscript_yyparse (tscript_context* context); | ~~~~~~~~~~~~~~~~~^~~~~~~ x86_64-pld-linux-gnux32-gcc -c tscript_interpreter.c -O2 -fPIC tscript_interpreter.c: In function 'tscript_interprete_sub': tscript_interpreter.c:125:2: warning: implicit declaration of function 'tscript_debug' [-Wimplicit-function-declaration] 125 | tscript_debug(context, "Interpretting %s\n", ast->type); | ^~~~~~~~~~~~~ tscript_interpreter.c:580:4: warning: implicit declaration of function 'tscript_internal_error' [-Wimplicit-function-declaration] 580 | tscript_internal_error("Incorrect conversion"); | ^~~~~~~~~~~~~~~~~~~~~~ x86_64-pld-linux-gnux32-gcc -c tscript_variables.c -O2 -fPIC tscript_variables.c: In function 'tscript_variable_get_reference': tscript_variables.c:47:2: warning: implicit declaration of function 'tscript_debug' [-Wimplicit-function-declaration] 47 | tscript_debug(context, "Getting reference for variable %s\n", name); | ^~~~~~~~~~~~~ x86_64-pld-linux-gnux32-gcc -c tscript_parser.c -O2 -fPIC tscript_parser.c: In function 'tscript_yyparse': tscript_parser.c:69:25: warning: implicit declaration of function 'tscript_yylex'; did you mean 'tscript_yyparse'? [-Wimplicit-function-declaration] 69 | #define yylex tscript_yylex | ^~~~~~~~~~~~~ tscript_parser.c:1691:16: note: in expansion of macro 'yylex' 1691 | yychar = yylex (context); | ^~~~~ tscript_parser.y:151:9: warning: implicit declaration of function 'strcmp' [-Wimplicit-function-declaration] 151 | if (strcmp(tscript_value_as_string($1->value), | ^~~~~~ tscript_parser.c:70:25: warning: implicit declaration of function 'tscript_yyerror'; did you mean 'tscript_yyparse'? [-Wimplicit-function-declaration] 70 | #define yyerror tscript_yyerror | ^~~~~~~~~~~~~~~ tscript_parser.y:154:6: note: in expansion of macro 'yyerror' 154 | yyerror(context, | ^~~~~~~ x86_64-pld-linux-gnux32-gcc -c tscript_values.c -O2 -fPIC tscript_values.c: In function 'tscript_value_create': tscript_values.c:50:3: warning: implicit declaration of function 'asprintf' [-Wimplicit-function-declaration] 50 | asprintf(&v->data, "%s", data); | ^~~~~~~~ tscript_values.c: In function 'tscript_value_create_error': tscript_values.c:69:2: warning: implicit declaration of function 'vasprintf' [-Wimplicit-function-declaration] 69 | vasprintf(&msg, format, va); | ^~~~~~~~~ tscript_values.c: In function 'tscript_value_dereference': tscript_values.c:200:4: warning: implicit declaration of function 'tscript_internal_error'; did you mean 'tscript_value_create_error'? [-Wimplicit-function-declaration] 200 | tscript_internal_error("Reference pointer is NULL!\n"); | ^~~~~~~~~~~~~~~~~~~~~~ | tscript_value_create_error x86_64-pld-linux-gnux32-gcc -c tscript_extensions.c -O2 -fPIC tscript_extensions.c: In function 'tscript_run_extension': tscript_extensions.c:113:3: warning: implicit declaration of function 'tscript_internal_error'; did you mean 'tscript_value_create_error'? [-Wimplicit-function-declaration] 113 | tscript_internal_error("Cannot find extension\n"); | ^~~~~~~~~~~~~~~~~~~~~~ | tscript_value_create_error x86_64-pld-linux-gnux32-gcc -c tscript_debug.c -O2 -fPIC tscript_debug.c: In function 'tscript_yyerror': tscript_debug.c:70:2: warning: implicit declaration of function 'asprintf'; did you mean 'vsprintf'? [-Wimplicit-function-declaration] 70 | asprintf(&context->error, "(line: %i, col: %i): %s", | ^~~~~~~~ | vsprintf flex -otscript_lexical.c -Ptscript_yy tscript_lexical.yy x86_64-pld-linux-gnux32-gcc -c tscript_lexical.c -O2 -fPIC tscript_lexical.yy: In function 'tscript_yylex': tscript_lexical.yy:282:11: warning: implicit declaration of function 'tscript_has_extension' [-Wimplicit-function-declaration] 282 | if (tscript_has_extension(context, yytext)) | ^~~~~~~~~~~~~~~~~~~~~ tscript_lexical.yy:286:12: warning: implicit declaration of function 'tscript_extension_is_block'; did you mean 'tscript_extension_map_count'? [-Wimplicit-function-declaration] 286 | if (tscript_extension_is_block(context, | ^~~~~~~~~~~~~~~~~~~~~~~~~~ | tscript_extension_map_count tscript_lexical.yy:291:11: warning: implicit declaration of function 'tscript_has_constant'; did you mean 'tscript_yy_scan_string'? [-Wimplicit-function-declaration] 291 | if (tscript_has_constant(context, yytext)) | ^~~~~~~~~~~~~~~~~~~~ | tscript_yy_scan_string ar rs libtscript.a tscript_ast.o tscript_context.o tscript_compiler.o tscript_interpreter.o tscript_variables.o tscript_parser.o tscript_values.o tscript_extensions.o tscript_debug.o tscript_lexical.o ar: creating libtscript.a x86_64-pld-linux-gnux32-gcc -shared -o libtscript.so tscript_ast.o tscript_context.o tscript_compiler.o tscript_interpreter.o tscript_variables.o tscript_parser.o tscript_values.o tscript_extensions.o tscript_debug.o tscript_lexical.o strip libtscript.so make[1]: Leaving directory '/tmp/B.tKED1E/BUILD/lms/daemon/modules/parser/lib' /usr/bin/make -C extensions make[1]: Entering directory '/tmp/B.tKED1E/BUILD/lms/daemon/modules/parser/extensions' gcc -c tscript_exec.c -I/usr/include -Wall -O2 -fPIC -DGNU -DUSE_PGSQL -I../.. -I../lib -D_GNU_SOURCE gcc -c tscript_string.c -I/usr/include -Wall -O2 -fPIC -DGNU -DUSE_PGSQL -I../.. -I../lib -D_GNU_SOURCE gcc -c tscript_file.c -I/usr/include -Wall -O2 -fPIC -DGNU -DUSE_PGSQL -I../.. -I../lib -D_GNU_SOURCE gcc -c tscript_sysinfo.c -I/usr/include -Wall -O2 -fPIC -DGNU -DUSE_PGSQL -I../.. -I../lib -D_GNU_SOURCE gcc -c sql.c -I/usr/include -Wall -O2 -fPIC -DGNU -DUSE_PGSQL -I../.. -I../lib -D_GNU_SOURCE gcc -c net.c -I/usr/include -Wall -O2 -fPIC -DGNU -DUSE_PGSQL -I../.. -I../lib -D_GNU_SOURCE gcc -c syslog.c -I/usr/include -Wall -O2 -fPIC -DGNU -DUSE_PGSQL -I../.. -I../lib -D_GNU_SOURCE ar rs tscript_extensions.a ../../../dbdrivers/pgsql/db.o ../../../util.o tscript_exec.o tscript_string.o tscript_file.o tscript_sysinfo.o sql.o net.o syslog.o ar: creating tscript_extensions.a make[1]: Leaving directory '/tmp/B.tKED1E/BUILD/lms/daemon/modules/parser/extensions' x86_64-pld-linux-gnux32-gcc -I/usr/include -Wall -O2 -fPIC -DGNU -DUSE_PGSQL -I../.. -I./lib -c -o parser.o parser.c gcc -shared parser.o lib/libtscript.a extensions/tscript_extensions.a -o parser.so -L/usr/lib -lfl -lm -lpq -ldl rm -rf parser.o lib/libtscript.a extensions/tscript_extensions.a make: Leaving directory '/tmp/B.tKED1E/BUILD/lms/daemon/modules/parser' + cd .. + exit 0 Executing(%install): /bin/sh -e /tmp/B.tKED1E/BUILD/tmp/rpm-tmp.29924 HOME=/home/users/builder PATH=/home/users/builder/GNUstep/Tools:/bin:/usr/bin:/usr/local/bin TMPDIR=/tmp/B.tKED1E/BUILD/tmp + umask 022 + cd /tmp/B.tKED1E/BUILD + /bin/rm '--interactive=never' -rf /tmp/B.tKED1E/BUILD/tmp/lms-1.11.13-root-builder + /bin/mkdir -p /tmp/B.tKED1E/BUILD/tmp/lms-1.11.13-root-builder + cd lms + rm -rf /tmp/B.tKED1E/BUILD/tmp/lms-1.11.13-root-builder + install -d /tmp/B.tKED1E/BUILD/tmp/lms-1.11.13-root-builder/usr/sbin /tmp/B.tKED1E/BUILD/tmp/lms-1.11.13-root-builder/usr/libx32/lms /tmp/B.tKED1E/BUILD/tmp/lms-1.11.13-root-builder/etc/webapps/lms /tmp/B.tKED1E/BUILD/tmp/lms-1.11.13-root-builder/etc/rc.d/init.d /tmp/B.tKED1E/BUILD/tmp/lms-1.11.13-root-builder/etc/sysconfig /tmp/B.tKED1E/BUILD/tmp/lms-1.11.13-root-builder/etc/lms/modules /tmp/B.tKED1E/BUILD/tmp/lms-1.11.13-root-builder/usr/share/php/Smarty/plugins /tmp/B.tKED1E/BUILD/tmp/lms-1.11.13-root-builder/usr/share/lms/lms /tmp/B.tKED1E/BUILD/tmp/lms-1.11.13-root-builder/usr/share/lms/userpanel /tmp/B.tKED1E/BUILD/tmp/lms-1.11.13-root-builder/usr/share/lms/www/doc /tmp/B.tKED1E/BUILD/tmp/lms-1.11.13-root-builder/usr/share/lms/www/user /tmp/B.tKED1E/BUILD/tmp/lms-1.11.13-root-builder/usr/share/lms/www/userpanel/modules /tmp/B.tKED1E/BUILD/tmp/lms-1.11.13-root-builder/var/lib/lms/backups /tmp/B.tKED1E/BUILD/tmp/lms-1.11.13-root-builder/var/lib/lms/documents /tmp/B.tKED1E/BUILD/tmp/lms-1.11.13-root-builder/var/lib/lms/templates_c /tmp/B.tKED1E/BUILD/tmp/lms-1.11.13-root-builder/var/lib/lms/userpanel/templates_c + cp -a index.php img /tmp/B.tKED1E/BUILD/tmp/lms-1.11.13-root-builder/usr/share/lms/www + cp -a doc/html /tmp/B.tKED1E/BUILD/tmp/lms-1.11.13-root-builder/usr/share/lms/www/doc + cp -a contrib lib modules sample templates /tmp/B.tKED1E/BUILD/tmp/lms-1.11.13-root-builder/usr/share/lms + cp -a smarty-plugins/block.t.php smarty-plugins/function.bankaccount.php smarty-plugins/function.gentime.php smarty-plugins/function.handle.php smarty-plugins/function.memory.php smarty-plugins/function.number.php smarty-plugins/function.size.php smarty-plugins/function.sum.php smarty-plugins/function.tip.php smarty-plugins/modifier.money_format.php smarty-plugins/modifier.striphtml.php smarty-plugins/modifier.to_words.php /tmp/B.tKED1E/BUILD/tmp/lms-1.11.13-root-builder/usr/share/php/Smarty/plugins + cp -a bin/lms-arpd bin/lms-arping bin/lms-cutoff bin/lms-etherdesc bin/lms-fping bin/lms-ipfw bin/lms-makearp bin/lms-makedhcpconf bin/lms-makehosts bin/lms-makeipchains bin/lms-makeiptables bin/lms-makemacs bin/lms-makemessages bin/lms-makeoidentconf bin/lms-makeon bin/lms-makeopenbsdpf bin/lms-makewarnings bin/lms-mgc bin/lms-notify bin/lms-notify-messages bin/lms-notify-sms bin/lms-payments bin/lms-reminder bin/lms-rtparser bin/lms-sendinvoices bin/lms-smstools bin/lms-traffic bin/lms-traffic-htbiptlimits bin/lms-traffic-logiptables /tmp/B.tKED1E/BUILD/tmp/lms-1.11.13-root-builder/usr/sbin + /bin/mv /tmp/B.tKED1E/BUILD/tmp/lms-1.11.13-root-builder/usr/share/lms/sample/lms.ini /tmp/B.tKED1E/BUILD/tmp/lms-1.11.13-root-builder/etc/lms + install /tmp/B.tKED1E/lms-apache.conf /tmp/B.tKED1E/BUILD/tmp/lms-1.11.13-root-builder/etc/webapps/lms/apache.conf + install /tmp/B.tKED1E/lms-httpd.conf /tmp/B.tKED1E/BUILD/tmp/lms-1.11.13-root-builder/etc/webapps/lms/httpd.conf + /bin/mv /tmp/B.tKED1E/BUILD/tmp/lms-1.11.13-root-builder/usr/share/lms/contrib/sqlpanel/sql.php /tmp/B.tKED1E/BUILD/tmp/lms-1.11.13-root-builder/usr/share/lms/contrib/sqlpanel/sqllang.php /tmp/B.tKED1E/BUILD/tmp/lms-1.11.13-root-builder/usr/share/lms/modules + /bin/mv /tmp/B.tKED1E/BUILD/tmp/lms-1.11.13-root-builder/usr/share/lms/contrib/sqlpanel/sql.html /tmp/B.tKED1E/BUILD/tmp/lms-1.11.13-root-builder/usr/share/lms/contrib/sqlpanel/sqlprint.html /tmp/B.tKED1E/BUILD/tmp/lms-1.11.13-root-builder/usr/share/lms/templates + /bin/mv /tmp/B.tKED1E/BUILD/tmp/lms-1.11.13-root-builder/usr/share/lms/contrib/customer/customer.html /tmp/B.tKED1E/BUILD/tmp/lms-1.11.13-root-builder/usr/share/lms/contrib/customer/index.php /tmp/B.tKED1E/BUILD/tmp/lms-1.11.13-root-builder/usr/share/lms/contrib/customer/lms-powered.png /tmp/B.tKED1E/BUILD/tmp/lms-1.11.13-root-builder/usr/share/lms/contrib/customer/locale /tmp/B.tKED1E/BUILD/tmp/lms-1.11.13-root-builder/usr/share/lms/www/user + install daemon/lmsd-mysql daemon/lmsd-pgsql /tmp/B.tKED1E/BUILD/tmp/lms-1.11.13-root-builder/usr/sbin + install daemon/modules/cutoff/cutoff.so daemon/modules/dhcp/dhcp.so daemon/modules/dns/dns.so daemon/modules/ethers/ethers.so daemon/modules/ewx-pt/ewx-pt.so daemon/modules/ewx-stm-channels/ewx-stm-channels.so daemon/modules/ewx-stm/ewx-stm.so daemon/modules/ggnotify/ggnotify.so daemon/modules/hostfile/hostfile.so daemon/modules/notify/notify.so daemon/modules/oident/oident.so daemon/modules/parser/parser.so daemon/modules/payments/payments.so daemon/modules/pinger/pinger.so daemon/modules/system/system.so daemon/modules/tc-new/tc-new.so daemon/modules/tc/tc.so daemon/modules/traffic/traffic.so /tmp/B.tKED1E/BUILD/tmp/lms-1.11.13-root-builder/usr/libx32/lms + cp -a daemon/modules/dns/sample /tmp/B.tKED1E/BUILD/tmp/lms-1.11.13-root-builder/etc/lms/modules/dns + cp -a daemon/modules/ggnotify/sample /tmp/B.tKED1E/BUILD/tmp/lms-1.11.13-root-builder/etc/lms/modules/ggnotify + cp -a daemon/modules/notify/sample /tmp/B.tKED1E/BUILD/tmp/lms-1.11.13-root-builder/etc/lms/modules/notify + install /tmp/B.tKED1E/lms.init /tmp/B.tKED1E/BUILD/tmp/lms-1.11.13-root-builder/etc/rc.d/init.d/lmsd + install /tmp/B.tKED1E/lms.sysconfig /tmp/B.tKED1E/BUILD/tmp/lms-1.11.13-root-builder/etc/sysconfig/lms + cp -a userpanel/lib userpanel/modules userpanel/templates /tmp/B.tKED1E/BUILD/tmp/lms-1.11.13-root-builder/usr/share/lms/userpanel + cp -a userpanel/index.php userpanel/style /tmp/B.tKED1E/BUILD/tmp/lms-1.11.13-root-builder/usr/share/lms/www/userpanel + ln -s /usr/share/lms/www/userpanel/style /tmp/B.tKED1E/BUILD/tmp/lms-1.11.13-root-builder/usr/share/lms/userpanel + ln -s /var/lib/lms/userpanel/templates_c /tmp/B.tKED1E/BUILD/tmp/lms-1.11.13-root-builder/usr/share/lms/userpanel + basename /tmp/B.tKED1E/BUILD/tmp/lms-1.11.13-root-builder/usr/share/lms/userpanel/modules/finances + MODULE=finances + mkdir /tmp/B.tKED1E/BUILD/tmp/lms-1.11.13-root-builder/usr/share/lms/www/userpanel/modules/finances + ln -s /usr/share/lms/userpanel/modules/finances/style /tmp/B.tKED1E/BUILD/tmp/lms-1.11.13-root-builder/usr/share/lms/www/userpanel/modules/finances + basename /tmp/B.tKED1E/BUILD/tmp/lms-1.11.13-root-builder/usr/share/lms/userpanel/modules/help + MODULE=help + mkdir /tmp/B.tKED1E/BUILD/tmp/lms-1.11.13-root-builder/usr/share/lms/www/userpanel/modules/help + ln -s /usr/share/lms/userpanel/modules/help/style /tmp/B.tKED1E/BUILD/tmp/lms-1.11.13-root-builder/usr/share/lms/www/userpanel/modules/help + basename /tmp/B.tKED1E/BUILD/tmp/lms-1.11.13-root-builder/usr/share/lms/userpanel/modules/helpdesk + MODULE=helpdesk + mkdir /tmp/B.tKED1E/BUILD/tmp/lms-1.11.13-root-builder/usr/share/lms/www/userpanel/modules/helpdesk + ln -s /usr/share/lms/userpanel/modules/helpdesk/style /tmp/B.tKED1E/BUILD/tmp/lms-1.11.13-root-builder/usr/share/lms/www/userpanel/modules/helpdesk + basename /tmp/B.tKED1E/BUILD/tmp/lms-1.11.13-root-builder/usr/share/lms/userpanel/modules/info + MODULE=info + mkdir /tmp/B.tKED1E/BUILD/tmp/lms-1.11.13-root-builder/usr/share/lms/www/userpanel/modules/info + ln -s /usr/share/lms/userpanel/modules/info/style /tmp/B.tKED1E/BUILD/tmp/lms-1.11.13-root-builder/usr/share/lms/www/userpanel/modules/info + basename /tmp/B.tKED1E/BUILD/tmp/lms-1.11.13-root-builder/usr/share/lms/userpanel/modules/logout + MODULE=logout + mkdir /tmp/B.tKED1E/BUILD/tmp/lms-1.11.13-root-builder/usr/share/lms/www/userpanel/modules/logout + ln -s /usr/share/lms/userpanel/modules/logout/style /tmp/B.tKED1E/BUILD/tmp/lms-1.11.13-root-builder/usr/share/lms/www/userpanel/modules/logout + basename /tmp/B.tKED1E/BUILD/tmp/lms-1.11.13-root-builder/usr/share/lms/userpanel/modules/messages + MODULE=messages + mkdir /tmp/B.tKED1E/BUILD/tmp/lms-1.11.13-root-builder/usr/share/lms/www/userpanel/modules/messages + ln -s /usr/share/lms/userpanel/modules/messages/style /tmp/B.tKED1E/BUILD/tmp/lms-1.11.13-root-builder/usr/share/lms/www/userpanel/modules/messages + basename /tmp/B.tKED1E/BUILD/tmp/lms-1.11.13-root-builder/usr/share/lms/userpanel/modules/modules + MODULE=modules + mkdir /tmp/B.tKED1E/BUILD/tmp/lms-1.11.13-root-builder/usr/share/lms/www/userpanel/modules/modules + ln -s /usr/share/lms/userpanel/modules/modules/style /tmp/B.tKED1E/BUILD/tmp/lms-1.11.13-root-builder/usr/share/lms/www/userpanel/modules/modules + basename /tmp/B.tKED1E/BUILD/tmp/lms-1.11.13-root-builder/usr/share/lms/userpanel/modules/stats + MODULE=stats + mkdir /tmp/B.tKED1E/BUILD/tmp/lms-1.11.13-root-builder/usr/share/lms/www/userpanel/modules/stats + ln -s /usr/share/lms/userpanel/modules/stats/style /tmp/B.tKED1E/BUILD/tmp/lms-1.11.13-root-builder/usr/share/lms/www/userpanel/modules/stats + /usr/lib/rpm/find-debuginfo.sh /tmp/B.tKED1E/BUILD/lms RPM_BUILD_DIR=/tmp/B.tKED1E/BUILD extracting debug info from /tmp/B.tKED1E/BUILD/tmp/lms-1.11.13-root-builder/usr/libx32/lms/cutoff.so extracting debug info from /tmp/B.tKED1E/BUILD/tmp/lms-1.11.13-root-builder/usr/libx32/lms/dhcp.so extracting debug info from /tmp/B.tKED1E/BUILD/tmp/lms-1.11.13-root-builder/usr/libx32/lms/dns.so extracting debug info from /tmp/B.tKED1E/BUILD/tmp/lms-1.11.13-root-builder/usr/libx32/lms/ethers.so extracting debug info from /tmp/B.tKED1E/BUILD/tmp/lms-1.11.13-root-builder/usr/libx32/lms/ewx-pt.so extracting debug info from /tmp/B.tKED1E/BUILD/tmp/lms-1.11.13-root-builder/usr/libx32/lms/ewx-stm-channels.so extracting debug info from /tmp/B.tKED1E/BUILD/tmp/lms-1.11.13-root-builder/usr/libx32/lms/ewx-stm.so extracting debug info from /tmp/B.tKED1E/BUILD/tmp/lms-1.11.13-root-builder/usr/libx32/lms/ggnotify.so extracting debug info from /tmp/B.tKED1E/BUILD/tmp/lms-1.11.13-root-builder/usr/libx32/lms/hostfile.so extracting debug info from /tmp/B.tKED1E/BUILD/tmp/lms-1.11.13-root-builder/usr/libx32/lms/notify.so extracting debug info from /tmp/B.tKED1E/BUILD/tmp/lms-1.11.13-root-builder/usr/libx32/lms/oident.so extracting debug info from /tmp/B.tKED1E/BUILD/tmp/lms-1.11.13-root-builder/usr/libx32/lms/parser.so extracting debug info from /tmp/B.tKED1E/BUILD/tmp/lms-1.11.13-root-builder/usr/libx32/lms/payments.so extracting debug info from /tmp/B.tKED1E/BUILD/tmp/lms-1.11.13-root-builder/usr/libx32/lms/pinger.so extracting debug info from /tmp/B.tKED1E/BUILD/tmp/lms-1.11.13-root-builder/usr/libx32/lms/system.so extracting debug info from /tmp/B.tKED1E/BUILD/tmp/lms-1.11.13-root-builder/usr/libx32/lms/tc-new.so extracting debug info from /tmp/B.tKED1E/BUILD/tmp/lms-1.11.13-root-builder/usr/libx32/lms/tc.so extracting debug info from /tmp/B.tKED1E/BUILD/tmp/lms-1.11.13-root-builder/usr/libx32/lms/traffic.so extracting debug info from /tmp/B.tKED1E/BUILD/tmp/lms-1.11.13-root-builder/usr/sbin/lmsd-mysql extracting debug info from /tmp/B.tKED1E/BUILD/tmp/lms-1.11.13-root-builder/usr/sbin/lmsd-pgsql cpio: /tmp/B.dMEcnj/BUILD/glibc-2.32/csu: Cannot stat: No such file or directory 798 blocks + __spec_install_post_strip + set +x Stripping 2 ELF executables...DONE Stripping 18 ELF shared libraries...DONE + __spec_install_post_chrpath + set +x Remove RPATH/RUNPATH from 20 executable binaries and shared object files. + __spec_install_post_compress_modules + set +x + __spec_install_post_check_so + set +x Searching for shared objects with unresolved symbols... DONE + __spec_install_post_check_tmpfiles + set +x Checking /var/run <-> tmpfiles.d completeness... DONE + __spec_install_post_check_shebangs + set +x Checking script shebangs... /usr/share/lms/contrib/LMS2Nagios/nagios-v6-check.py starts with '#!/usr/bin/python', should be '#!/usr/bin/python2' or '#!/usr/bin/python3' /usr/share/lms/contrib/LMS2Nagios/nagios-v6-gen.py starts with '#!/usr/bin/python', should be '#!/usr/bin/python2' or '#!/usr/bin/python3' DONE error: Bad exit status from /tmp/B.tKED1E/BUILD/tmp/rpm-tmp.29924 (%install) RPM build errors: Bad exit status from /tmp/B.tKED1E/BUILD/tmp/rpm-tmp.29924 (%install) ended at: Mon Oct 5 09:34:58 2020, done in 0:00:16.794325 error: No files produced. + chmod -R u+rwX /tmp/B.tKED1E/BUILD + rm -rf /tmp/B.tKED1E/tmp /tmp/B.tKED1E/BUILD + rm -rf /tmp/B.tKED1E Begin-PLD-Builder-Info Build-Time: user:26.61s sys:3.38s real:41.89s (faults io:21 non-io:763494) End-PLD-Builder-Info
[Back to list of logs] [View rpm -qa of builder]