FailedOk

th/SRPMS[OK]
th/x32[OK]
th/i686[OK]
th/x86_64[OK]

ac/SRPMS[OK]
ac/i386[OK]
ac/i586[OK]
ac/i686[OK]
ac/alpha[OK]
ac/amd64[OK]
ac/athlon[OK]
ac/ppc[OK]
ac/sparc[OK]
ac/sparc64[OK]

Advanced Search
main()
Powered by PLD Linux
(c) 2002-2020 PLD Team
$Revision: 1.37 $
Powered by Linus.
Your IP: 3.235.107.209

python-FormEncode e43bfc66-a26b-4324-b89e-6504b407a4e5

Status:Failed
Source URL:https://buildlogs.pld-linux.org/pld/th/x32/FAIL/python-FormEncode,e43bfc66-a26b-4324-b89e-6504b407a4e5.bz2
text/plain URL:View!
rpm -qa of builder:View!
Date:2020/06/09 19:24:33
Runtime:0:02:03.276425

Toc:

  • error 1
  • rpm: error: Failed build dependencies:
  • error 2
  • rpm: error: Failed build dependencies:
  • prep
  • Executing(%prep): /bin/sh -e /tmp/B.V1Ai6e/BUILD/tmp/rpm-tmp.59443
  • build
  • Executing(%build): /bin/sh -e /tmp/B.V1Ai6e/BUILD/tmp/rpm-tmp.59443
  • error 3
  • FAIL: Doctests for formencode.validators
  • error 4
  • AssertionError:
  • error 5
  • error: Bad exit status from /tmp/B.V1Ai6e/BUILD/tmp/rpm-tmp.59443 (%build)
  • error 6
  • RPM build errors:
  • error 7
  • error: No files produced.

Content:

request from: qboosh
checking if we should skip the build
started at: Tue Jun  9 19:22:06 2020
killing old processes on a builder
sending signal 9 to pid -1
Killed
cleaning up /tmp
fetching https://srcbuilder.pld-linux.org/th//srpms/e43bfc66-a26b-4324-b89e-6504b407a4e5/python-FormEncode-1.3.1-1.src.rpm
fetched 211805 bytes, 427.5 K/s
installing srpm: python-FormEncode-1.3.1-1.src.rpm
+ install -d /tmp/B.V1Ai6e/BUILD /tmp/B.V1Ai6e/RPMS
+ LC_ALL=en_US.UTF-8
+ rpm -qp --changelog python-FormEncode-1.3.1-1.src.rpm
* Tue Jun 09 2020 PLD Linux Team <feedback@pld-linux.org>
- For complete changelog see: http://git.pld-linux.org/?p=packages/python-FormEncode.git;a=log;h=master
* Tue Jun 09 2020 Jakub Bogusz <qboosh@pld-linux.org> d7c2098
- updated to 1.3.1 - added pycountry patch (adapt for pycountry 16.10.23 API change) - added python3- and -apidocs packages + rpm -Uhv --nodeps --define '_topdir /tmp/B.V1Ai6e' --define '_specdir %{_topdir}' --define '_sourcedir %{_specdir}' --define '_rpmdir %{_topdir}/RPMS' --define '_builddir %{_topdir}/BUILD' python-FormEncode-1.3.1-1.src.rpm Preparing... ################################################## python-FormEncode ################################################## + rm -f python-FormEncode-1.3.1-1.src.rpm + install -m 700 -d /tmp/B.V1Ai6e/BUILD/tmp + TMPDIR=/tmp/B.V1Ai6e/BUILD/tmp + exec nice -n 0 rpmbuild -bp --short-circuit --nodeps --define '_topdir /tmp/B.V1Ai6e' --define '_specdir %{_topdir}' --define '_sourcedir %{_specdir}' --define '_rpmdir %{_topdir}/RPMS' --define '_builddir %{_topdir}/BUILD' --target x32-pld-linux --define 'prep exit 0' /tmp/B.V1Ai6e/python-FormEncode.spec Building target platforms: x32-pld-linux checking BuildConflict-ing packages no BuildConflicts found checking BR rpm: error: Failed build dependencies: rpm: python-pycountry >= 16.10.23 is needed by python-FormEncode-1.3.1-1.src rpm: python3-pycountry >= 16.10.23 is needed by python-FormEncode-1.3.1-1.src rpm: Building target platforms: x32-pld-linux updating poldek cache... ready is up to date th is up to date th is up to date th-ready is up to date th-ready is up to date Retrieving diff::packages.ndir.2020.06.09-04.33.01.gz......................................done Loading [pndir]th-test... Applying packages.ndir.2020.06.09-04.33.01.gz... Applying packages.ndir.2020.06.09-10.02.10.gz... Writing /root/.cache/poldek/[...]/packages.ndir.gz... Retrieving diff::packages.ndir.2020.06.09-04.33.02.gz......................................done Loading [pndir]th-test... Applying packages.ndir.2020.06.09-04.33.02.gz... Writing /root/.cache/poldek/[...]/packages.ndir.gz... checking conflicting packages in BRed packages poldek: Loading [pndir]ready... poldek: Loading [pndir]th-test... poldek: Loading [pndir]th-test... poldek: Loading [pndir]th-ready... poldek: Loading [pndir]th-ready... poldek: Loading [pndir]th... poldek: Loading [pndir]th... poldek: 28352 packages read poldek: Removed 2846 duplicate packages from available set poldek: Processing dependencies... poldek: There are 2 packages to install: poldek: A python-pycountry-18.12.8-1.noarch python3-pycountry-18.12.8-1.noarch poldek: This operation will use 51.8MB of disk space. poldek: Need to get 6.6MB of archives. poldek: Executing pm-command.sh --upgrade -vh --test --root / --define _check_dirname_deps 1... poldek: Preparing... ################################################## no conflicts found checking BR rpm: error: Failed build dependencies: rpm: python-pycountry >= 16.10.23 is needed by python-FormEncode-1.3.1-1.src rpm: python3-pycountry >= 16.10.23 is needed by python-FormEncode-1.3.1-1.src rpm: Building target platforms: x32-pld-linux installing BR: python\-pycountry python3\-pycountry + poldek --noask --caplookup -Q -v '--ignore=hhvm-*' '--ignore=php4-*' '--ignore=php52-*' '--ignore=php54-*' '--ignore=php55-*' '--ignore=php56-*' '--ignore=php70-*' '--ignore=php71-*' '--ignore=php72-*' '--ignore=php73-*' '--ignore=php74-*' --upgrade python-pycountry python3-pycountry Loading [pndir]ready... Loading [pndir]th-test... Loading [pndir]th-test... Loading [pndir]th-ready... Loading [pndir]th-ready... Loading [pndir]th... Loading [pndir]th... 28352 packages read Removed 2846 duplicate packages from available set Processing dependencies... There are 2 packages to install: A python-pycountry-18.12.8-1.noarch python3-pycountry-18.12.8-1.noarch This operation will use 51.8MB of disk space. Need to get 6.6MB of archives. Executing pm-command.sh --upgrade -vh --root / --define _check_dirname_deps 1... Preparing... ################################################## python3-pycountry ################################################## python-pycountry ################################################## building RPM using: set -ex; : build-id: e43bfc66-a26b-4324-b89e-6504b407a4e5; TMPDIR=/tmp/B.V1Ai6e/BUILD/tmp exec nice -n 0 rpmbuild -bb --define '_smp_mflags -j9' --define '_make_opts -Otarget' --define '_pld_builder 1' --define '_topdir /tmp/B.V1Ai6e' --define '_specdir %{_topdir}' --define '_sourcedir %{_specdir}' --define '_rpmdir %{_topdir}/RPMS' --define '_builddir %{_topdir}/BUILD' --target x32-pld-linux /tmp/B.V1Ai6e/python-FormEncode.spec + : build-id: e43bfc66-a26b-4324-b89e-6504b407a4e5 + TMPDIR=/tmp/B.V1Ai6e/BUILD/tmp + exec nice -n 0 rpmbuild -bb --define '_smp_mflags -j9' --define '_make_opts -Otarget' --define '_pld_builder 1' --define '_topdir /tmp/B.V1Ai6e' --define '_specdir %{_topdir}' --define '_sourcedir %{_specdir}' --define '_rpmdir %{_topdir}/RPMS' --define '_builddir %{_topdir}/BUILD' --target x32-pld-linux /tmp/B.V1Ai6e/python-FormEncode.spec Building target platforms: x32-pld-linux Executing(%prep): /bin/sh -e /tmp/B.V1Ai6e/BUILD/tmp/rpm-tmp.59443 + umask 022 + cd /tmp/B.V1Ai6e/BUILD + cd /tmp/B.V1Ai6e/BUILD + rm -rf FormEncode-1.3.1 + /bin/gzip -dc /tmp/B.V1Ai6e/FormEncode-1.3.1.tar.gz + /bin/tar -xf - + STATUS=0 + '[' 0 -ne 0 ']' + cd FormEncode-1.3.1 + /bin/id -u + '[' 1000 '=' 0 ']' + /bin/id -u + '[' 1000 '=' 0 ']' + /bin/chmod -Rf a+rX,u+w,g-w,o-w . + echo 'Patch #0 (python-FormEncode-pycountry.patch):' Patch #0 (python-FormEncode-pycountry.patch): + '[' -f /tmp/B.V1Ai6e/python-FormEncode-pycountry.patch ']' + /bin/cat /tmp/B.V1Ai6e/python-FormEncode-pycountry.patch + /usr/bin/patch -s -p1 + /bin/rm '--interactive=never' formencode/tests/test_email.py + exit 0 Executing(%build): /bin/sh -e /tmp/B.V1Ai6e/BUILD/tmp/rpm-tmp.59443 HOME=/home/users/builder PATH=/home/users/builder/GNUstep/Tools:/bin:/usr/bin:/usr/local/bin TMPDIR=/tmp/B.V1Ai6e/BUILD/tmp + umask 022 + cd /tmp/B.V1Ai6e/BUILD + cd FormEncode-1.3.1 + LDFLAGS='-Wl,--as-needed -Wl,--no-copy-dt-needed-entries -Wl,-z,relro -Wl,-z,combreloc ' + export LDFLAGS + CFLAGS=' -O2 -fwrapv -pipe -Wformat -Werror=format-security -gdwarf-4 -fno-debug-types-section -fvar-tracking-assignments -g2 -Wp,-D_FORTIFY_SOURCE=2 -fstack-protector-strong --param=ssp-buffer-size=4 -Werror=trampolines -fPIC -mtune=generic -march=x86-64 -gdwarf-4 -fno-debug-types-section -fvar-tracking-assignments -g2 ' + export CFLAGS + CXXFLAGS=' -O2 -fwrapv -pipe -Wformat -Werror=format-security -gdwarf-4 -fno-debug-types-section -fvar-tracking-assignments -g2 -Wp,-D_FORTIFY_SOURCE=2 -fstack-protector-strong --param=ssp-buffer-size=4 -Werror=trampolines -fPIC -mtune=generic -march=x86-64 -gdwarf-4 -fno-debug-types-section -fvar-tracking-assignments -g2 ' + export CXXFLAGS + CC=x86_64-pld-linux-gnux32-gcc + export CC + CXX=x86_64-pld-linux-gnux32-g++ + export CXX + /usr/bin/python2 setup.py build '--build-base=build-2' running build running build_py creating build-2 creating build-2/lib creating build-2/lib/formencode copying formencode/__init__.py -> build-2/lib/formencode copying formencode/api.py -> build-2/lib/formencode copying formencode/compound.py -> build-2/lib/formencode copying formencode/context.py -> build-2/lib/formencode copying formencode/declarative.py -> build-2/lib/formencode copying formencode/doctest_xml_compare.py -> build-2/lib/formencode copying formencode/exc.py -> build-2/lib/formencode copying formencode/fieldstorage.py -> build-2/lib/formencode copying formencode/foreach.py -> build-2/lib/formencode copying formencode/htmlfill.py -> build-2/lib/formencode copying formencode/htmlfill_schemabuilder.py -> build-2/lib/formencode copying formencode/htmlgen.py -> build-2/lib/formencode copying formencode/htmlrename.py -> build-2/lib/formencode copying formencode/interfaces.py -> build-2/lib/formencode copying formencode/national.py -> build-2/lib/formencode copying formencode/rewritingparser.py -> build-2/lib/formencode copying formencode/schema.py -> build-2/lib/formencode copying formencode/validators.py -> build-2/lib/formencode copying formencode/variabledecode.py -> build-2/lib/formencode creating build-2/lib/formencode/tests copying formencode/tests/__init__.py -> build-2/lib/formencode/tests copying formencode/tests/test_cc.py -> build-2/lib/formencode/tests copying formencode/tests/test_compound.py -> build-2/lib/formencode/tests copying formencode/tests/test_context.py -> build-2/lib/formencode/tests copying formencode/tests/test_declarative.py -> build-2/lib/formencode/tests copying formencode/tests/test_doctest_xml_compare.py -> build-2/lib/formencode/tests copying formencode/tests/test_doctests.py -> build-2/lib/formencode/tests copying formencode/tests/test_htmlfill.py -> build-2/lib/formencode/tests copying formencode/tests/test_htmlgen.py -> build-2/lib/formencode/tests copying formencode/tests/test_htmlrename.py -> build-2/lib/formencode/tests copying formencode/tests/test_i18n.py -> build-2/lib/formencode/tests copying formencode/tests/test_schema.py -> build-2/lib/formencode/tests copying formencode/tests/test_subclassing.py -> build-2/lib/formencode/tests copying formencode/tests/test_subclassing_old.py -> build-2/lib/formencode/tests copying formencode/tests/test_validators.py -> build-2/lib/formencode/tests copying formencode/tests/test_variabledecode.py -> build-2/lib/formencode/tests running egg_info writing requirements to FormEncode.egg-info/requires.txt writing FormEncode.egg-info/PKG-INFO writing top-level names to FormEncode.egg-info/top_level.txt writing dependency_links to FormEncode.egg-info/dependency_links.txt reading manifest file 'FormEncode.egg-info/SOURCES.txt' reading manifest template 'MANIFEST.in' warning: no files found matching '*.html' under directory 'docs' warning: no files found matching '*.py' under directory 'formencode/i18n' warning: no previously-included files matching '*.pyc' found under directory '.' warning: no previously-included files matching '*.pyo' found under directory '.' warning: no previously-included files matching '*~' found under directory '.' no previously-included directories found matching 'docs/_build' no previously-included directories found matching '**/.svn' no previously-included directories found matching '.hg' no previously-included directories found matching '.git' writing manifest file 'FormEncode.egg-info/SOURCES.txt' creating build-2/lib/formencode/i18n copying formencode/i18n/FormEncode.pot -> build-2/lib/formencode/i18n creating build-2/lib/formencode/i18n/cs creating build-2/lib/formencode/i18n/cs/LC_MESSAGES copying formencode/i18n/cs/LC_MESSAGES/FormEncode.mo -> build-2/lib/formencode/i18n/cs/LC_MESSAGES copying formencode/i18n/cs/LC_MESSAGES/FormEncode.po -> build-2/lib/formencode/i18n/cs/LC_MESSAGES creating build-2/lib/formencode/i18n/da creating build-2/lib/formencode/i18n/da/LC_MESSAGES copying formencode/i18n/da/LC_MESSAGES/FormEncode.mo -> build-2/lib/formencode/i18n/da/LC_MESSAGES copying formencode/i18n/da/LC_MESSAGES/FormEncode.po -> build-2/lib/formencode/i18n/da/LC_MESSAGES creating build-2/lib/formencode/i18n/de creating build-2/lib/formencode/i18n/de/LC_MESSAGES copying formencode/i18n/de/LC_MESSAGES/FormEncode.mo -> build-2/lib/formencode/i18n/de/LC_MESSAGES copying formencode/i18n/de/LC_MESSAGES/FormEncode.po -> build-2/lib/formencode/i18n/de/LC_MESSAGES creating build-2/lib/formencode/i18n/el creating build-2/lib/formencode/i18n/el/LC_MESSAGES copying formencode/i18n/el/LC_MESSAGES/FormEncode.mo -> build-2/lib/formencode/i18n/el/LC_MESSAGES copying formencode/i18n/el/LC_MESSAGES/FormEncode.po -> build-2/lib/formencode/i18n/el/LC_MESSAGES creating build-2/lib/formencode/i18n/es creating build-2/lib/formencode/i18n/es/LC_MESSAGES copying formencode/i18n/es/LC_MESSAGES/FormEncode.mo -> build-2/lib/formencode/i18n/es/LC_MESSAGES copying formencode/i18n/es/LC_MESSAGES/FormEncode.po -> build-2/lib/formencode/i18n/es/LC_MESSAGES creating build-2/lib/formencode/i18n/et creating build-2/lib/formencode/i18n/et/LC_MESSAGES copying formencode/i18n/et/LC_MESSAGES/FormEncode.mo -> build-2/lib/formencode/i18n/et/LC_MESSAGES copying formencode/i18n/et/LC_MESSAGES/FormEncode.po -> build-2/lib/formencode/i18n/et/LC_MESSAGES creating build-2/lib/formencode/i18n/fi creating build-2/lib/formencode/i18n/fi/LC_MESSAGES copying formencode/i18n/fi/LC_MESSAGES/FormEncode.mo -> build-2/lib/formencode/i18n/fi/LC_MESSAGES copying formencode/i18n/fi/LC_MESSAGES/FormEncode.po -> build-2/lib/formencode/i18n/fi/LC_MESSAGES creating build-2/lib/formencode/i18n/fr creating build-2/lib/formencode/i18n/fr/LC_MESSAGES copying formencode/i18n/fr/LC_MESSAGES/FormEncode.mo -> build-2/lib/formencode/i18n/fr/LC_MESSAGES copying formencode/i18n/fr/LC_MESSAGES/FormEncode.po -> build-2/lib/formencode/i18n/fr/LC_MESSAGES creating build-2/lib/formencode/i18n/it creating build-2/lib/formencode/i18n/it/LC_MESSAGES copying formencode/i18n/it/LC_MESSAGES/FormEncode.mo -> build-2/lib/formencode/i18n/it/LC_MESSAGES copying formencode/i18n/it/LC_MESSAGES/FormEncode.po -> build-2/lib/formencode/i18n/it/LC_MESSAGES creating build-2/lib/formencode/i18n/ja creating build-2/lib/formencode/i18n/ja/LC_MESSAGES copying formencode/i18n/ja/LC_MESSAGES/FormEncode.mo -> build-2/lib/formencode/i18n/ja/LC_MESSAGES copying formencode/i18n/ja/LC_MESSAGES/FormEncode.po -> build-2/lib/formencode/i18n/ja/LC_MESSAGES creating build-2/lib/formencode/i18n/ko creating build-2/lib/formencode/i18n/ko/LC_MESSAGES copying formencode/i18n/ko/LC_MESSAGES/FormEncode.mo -> build-2/lib/formencode/i18n/ko/LC_MESSAGES copying formencode/i18n/ko/LC_MESSAGES/FormEncode.po -> build-2/lib/formencode/i18n/ko/LC_MESSAGES creating build-2/lib/formencode/i18n/lt creating build-2/lib/formencode/i18n/lt/LC_MESSAGES copying formencode/i18n/lt/LC_MESSAGES/FormEncode.mo -> build-2/lib/formencode/i18n/lt/LC_MESSAGES copying formencode/i18n/lt/LC_MESSAGES/FormEncode.po -> build-2/lib/formencode/i18n/lt/LC_MESSAGES creating build-2/lib/formencode/i18n/nb_NO creating build-2/lib/formencode/i18n/nb_NO/LC_MESSAGES copying formencode/i18n/nb_NO/LC_MESSAGES/FormEncode.mo -> build-2/lib/formencode/i18n/nb_NO/LC_MESSAGES copying formencode/i18n/nb_NO/LC_MESSAGES/FormEncode.po -> build-2/lib/formencode/i18n/nb_NO/LC_MESSAGES creating build-2/lib/formencode/i18n/nl creating build-2/lib/formencode/i18n/nl/LC_MESSAGES copying formencode/i18n/nl/LC_MESSAGES/FormEncode.mo -> build-2/lib/formencode/i18n/nl/LC_MESSAGES copying formencode/i18n/nl/LC_MESSAGES/FormEncode.po -> build-2/lib/formencode/i18n/nl/LC_MESSAGES creating build-2/lib/formencode/i18n/pl creating build-2/lib/formencode/i18n/pl/LC_MESSAGES copying formencode/i18n/pl/LC_MESSAGES/FormEncode.mo -> build-2/lib/formencode/i18n/pl/LC_MESSAGES copying formencode/i18n/pl/LC_MESSAGES/FormEncode.po -> build-2/lib/formencode/i18n/pl/LC_MESSAGES creating build-2/lib/formencode/i18n/pt_BR creating build-2/lib/formencode/i18n/pt_BR/LC_MESSAGES copying formencode/i18n/pt_BR/LC_MESSAGES/FormEncode.mo -> build-2/lib/formencode/i18n/pt_BR/LC_MESSAGES copying formencode/i18n/pt_BR/LC_MESSAGES/FormEncode.po -> build-2/lib/formencode/i18n/pt_BR/LC_MESSAGES creating build-2/lib/formencode/i18n/pt_PT creating build-2/lib/formencode/i18n/pt_PT/LC_MESSAGES copying formencode/i18n/pt_PT/LC_MESSAGES/FormEncode.mo -> build-2/lib/formencode/i18n/pt_PT/LC_MESSAGES copying formencode/i18n/pt_PT/LC_MESSAGES/FormEncode.po -> build-2/lib/formencode/i18n/pt_PT/LC_MESSAGES creating build-2/lib/formencode/i18n/ru creating build-2/lib/formencode/i18n/ru/LC_MESSAGES copying formencode/i18n/ru/LC_MESSAGES/FormEncode.mo -> build-2/lib/formencode/i18n/ru/LC_MESSAGES copying formencode/i18n/ru/LC_MESSAGES/FormEncode.po -> build-2/lib/formencode/i18n/ru/LC_MESSAGES creating build-2/lib/formencode/i18n/sk creating build-2/lib/formencode/i18n/sk/LC_MESSAGES copying formencode/i18n/sk/LC_MESSAGES/FormEncode.mo -> build-2/lib/formencode/i18n/sk/LC_MESSAGES copying formencode/i18n/sk/LC_MESSAGES/FormEncode.po -> build-2/lib/formencode/i18n/sk/LC_MESSAGES creating build-2/lib/formencode/i18n/sl creating build-2/lib/formencode/i18n/sl/LC_MESSAGES copying formencode/i18n/sl/LC_MESSAGES/FormEncode.mo -> build-2/lib/formencode/i18n/sl/LC_MESSAGES copying formencode/i18n/sl/LC_MESSAGES/FormEncode.po -> build-2/lib/formencode/i18n/sl/LC_MESSAGES creating build-2/lib/formencode/i18n/sr creating build-2/lib/formencode/i18n/sr/LC_MESSAGES copying formencode/i18n/sr/LC_MESSAGES/FormEncode.mo -> build-2/lib/formencode/i18n/sr/LC_MESSAGES copying formencode/i18n/sr/LC_MESSAGES/FormEncode.po -> build-2/lib/formencode/i18n/sr/LC_MESSAGES creating build-2/lib/formencode/i18n/sv creating build-2/lib/formencode/i18n/sv/LC_MESSAGES copying formencode/i18n/sv/LC_MESSAGES/FormEncode.mo -> build-2/lib/formencode/i18n/sv/LC_MESSAGES copying formencode/i18n/sv/LC_MESSAGES/FormEncode.po -> build-2/lib/formencode/i18n/sv/LC_MESSAGES creating build-2/lib/formencode/i18n/tr creating build-2/lib/formencode/i18n/tr/LC_MESSAGES copying formencode/i18n/tr/LC_MESSAGES/FormEncode.mo -> build-2/lib/formencode/i18n/tr/LC_MESSAGES copying formencode/i18n/tr/LC_MESSAGES/FormEncode.po -> build-2/lib/formencode/i18n/tr/LC_MESSAGES creating build-2/lib/formencode/i18n/zh_CN creating build-2/lib/formencode/i18n/zh_CN/LC_MESSAGES copying formencode/i18n/zh_CN/LC_MESSAGES/FormEncode.mo -> build-2/lib/formencode/i18n/zh_CN/LC_MESSAGES copying formencode/i18n/zh_CN/LC_MESSAGES/FormEncode.po -> build-2/lib/formencode/i18n/zh_CN/LC_MESSAGES creating build-2/lib/formencode/i18n/zh_TW creating build-2/lib/formencode/i18n/zh_TW/LC_MESSAGES copying formencode/i18n/zh_TW/LC_MESSAGES/FormEncode.mo -> build-2/lib/formencode/i18n/zh_TW/LC_MESSAGES copying formencode/i18n/zh_TW/LC_MESSAGES/FormEncode.po -> build-2/lib/formencode/i18n/zh_TW/LC_MESSAGES creating build-2/lib/formencode/javascript copying formencode/javascript/ordering.js -> build-2/lib/formencode/javascript creating build-2/lib/docs copying formencode/../docs/community.txt -> build-2/lib/formencode/../docs copying formencode/../docs/Design.txt -> build-2/lib/formencode/../docs copying formencode/../docs/download.txt -> build-2/lib/formencode/../docs copying formencode/../docs/history.txt -> build-2/lib/formencode/../docs copying formencode/../docs/htmlfill.txt -> build-2/lib/formencode/../docs copying formencode/../docs/i18n.txt -> build-2/lib/formencode/../docs copying formencode/../docs/index.txt -> build-2/lib/formencode/../docs copying formencode/../docs/modules.txt -> build-2/lib/formencode/../docs copying formencode/../docs/ToDo.txt -> build-2/lib/formencode/../docs copying formencode/../docs/Validator.txt -> build-2/lib/formencode/../docs copying formencode/../docs/whatsnew-0-to-1.2.4.txt -> build-2/lib/formencode/../docs copying formencode/../docs/whatsnew-1.2.5.txt -> build-2/lib/formencode/../docs copying formencode/../docs/whatsnew-1.3.txt -> build-2/lib/formencode/../docs copying formencode/tests/non_empty.txt -> build-2/lib/formencode/tests creating build-2/lib/formencode/tests/htmlfill_data copying formencode/tests/htmlfill_data/data-error1.txt -> build-2/lib/formencode/tests/htmlfill_data copying formencode/tests/htmlfill_data/data-fill1.txt -> build-2/lib/formencode/tests/htmlfill_data copying formencode/tests/htmlfill_data/data-fill2.txt -> build-2/lib/formencode/tests/htmlfill_data copying formencode/tests/htmlfill_data/data-fill3.txt -> build-2/lib/formencode/tests/htmlfill_data copying formencode/tests/htmlfill_data/data-fill4.txt -> build-2/lib/formencode/tests/htmlfill_data copying formencode/tests/htmlfill_data/data-form-last-element.txt -> build-2/lib/formencode/tests/htmlfill_data copying formencode/tests/htmlfill_data/data-schema1.txt -> build-2/lib/formencode/tests/htmlfill_data + /usr/bin/python2 -m nose build-2/lib/formencode/tests ...................................F........................................................................................................................................................................................................................... ====================================================================== FAIL: Doctests for formencode.validators ---------------------------------------------------------------------- Traceback (most recent call last): File "/usr/share/python2.7/site-packages/nose/case.py", line 197, in runTest File "/tmp/B.V1Ai6e/BUILD/FormEncode-1.3.1/build-2/lib/formencode/tests/test_doctests.py", line 69, in _wrapper fn(*a_test_args) File "/tmp/B.V1Ai6e/BUILD/FormEncode-1.3.1/build-2/lib/formencode/tests/test_doctests.py", line 63, in doctest_module assert failure_count == 0 AssertionError: -------------------- >> begin captured stdout << --------------------- ********************************************************************** File "/tmp/B.V1Ai6e/BUILD/FormEncode-1.3.1/build-2/lib/formencode/validators.py", line 1294, in formencode.validators.Email Failed example: e.to_python('doesnotexist@colorstudy.com') Exception raised: Traceback (most recent call last): File "/usr/libx32/python2.7/doctest.py", line 1315, in __run compileflags, 1) in test.globs File "<doctest formencode.validators.Email[11]>", line 1, in <module> e.to_python('doesnotexist@colorstudy.com') File "/tmp/B.V1Ai6e/BUILD/FormEncode-1.3.1/build-2/lib/formencode/api.py", line 478, in to_python vp(value, state) File "/tmp/B.V1Ai6e/BUILD/FormEncode-1.3.1/build-2/lib/formencode/validators.py", line 1387, in _validate_python self.message('socketError', state, error=e), value, state) Invalid: An error occured when trying to connect to the server: The DNS operation timed out after 30.001210928 seconds ********************************************************************** File "/tmp/B.V1Ai6e/BUILD/FormEncode-1.3.1/build-2/lib/formencode/validators.py", line 1296, in formencode.validators.Email Failed example: e.to_python('test@nyu.edu') Exception raised: Traceback (most recent call last): File "/usr/libx32/python2.7/doctest.py", line 1315, in __run compileflags, 1) in test.globs File "<doctest formencode.validators.Email[12]>", line 1, in <module> e.to_python('test@nyu.edu') File "/tmp/B.V1Ai6e/BUILD/FormEncode-1.3.1/build-2/lib/formencode/api.py", line 478, in to_python vp(value, state) File "/tmp/B.V1Ai6e/BUILD/FormEncode-1.3.1/build-2/lib/formencode/validators.py", line 1387, in _validate_python self.message('socketError', state, error=e), value, state) Invalid: An error occured when trying to connect to the server: The DNS operation timed out after 30.0002901554 seconds ********************************************************************** File "/tmp/B.V1Ai6e/BUILD/FormEncode-1.3.1/build-2/lib/formencode/validators.py", line 1303, in formencode.validators.Email Failed example: e.to_python(u'test@google.com') Exception raised: Traceback (most recent call last): File "/usr/libx32/python2.7/doctest.py", line 1315, in __run compileflags, 1) in test.globs File "<doctest formencode.validators.Email[14]>", line 1, in <module> e.to_python(u'test@google.com') File "/tmp/B.V1Ai6e/BUILD/FormEncode-1.3.1/build-2/lib/formencode/api.py", line 478, in to_python vp(value, state) File "/tmp/B.V1Ai6e/BUILD/FormEncode-1.3.1/build-2/lib/formencode/validators.py", line 1387, in _validate_python self.message('socketError', state, error=e), value, state) Invalid: An error occured when trying to connect to the server: The DNS operation timed out after 30.0003781319 seconds ********************************************************************** File "/tmp/B.V1Ai6e/BUILD/FormEncode-1.3.1/build-2/lib/formencode/validators.py", line 1433, in formencode.validators.URL Failed example: u.to_python('http://google.com') Exception raised: Traceback (most recent call last): File "/usr/libx32/python2.7/doctest.py", line 1315, in __run compileflags, 1) in test.globs File "<doctest formencode.validators.URL[13]>", line 1, in <module> u.to_python('http://google.com') File "/tmp/B.V1Ai6e/BUILD/FormEncode-1.3.1/build-2/lib/formencode/api.py", line 475, in to_python value = tp(value, state) File "/tmp/B.V1Ai6e/BUILD/FormEncode-1.3.1/build-2/lib/formencode/validators.py", line 1523, in _convert_to_python self._check_url_exists(value, state) File "/tmp/B.V1Ai6e/BUILD/FormEncode-1.3.1/build-2/lib/formencode/validators.py", line 1571, in _check_url_exists self.message('socketError', state, error=e), state, url) Invalid: An error occured when trying to connect to the server: [Errno -3] Temporary failure in name resolution ********************************************************************** 2 items had failures: 3 of 17 in formencode.validators.Email 1 of 21 in formencode.validators.URL ***Test Failed*** 4 failures. --------------------- >> end captured stdout << ---------------------- assert 253 > 0 >> assert 4 == 0 ---------------------------------------------------------------------- Ran 255 tests in 120.793s FAILED (failures=1) error: Bad exit status from /tmp/B.V1Ai6e/BUILD/tmp/rpm-tmp.59443 (%build) RPM build errors: Bad exit status from /tmp/B.V1Ai6e/BUILD/tmp/rpm-tmp.59443 (%build) ended at: Tue Jun 9 19:24:32 2020, done in 0:02:03.276425 error: No files produced. + chmod -R u+rwX /tmp/B.V1Ai6e/BUILD + rm -rf /tmp/B.V1Ai6e/tmp /tmp/B.V1Ai6e/BUILD + rm -rf /tmp/B.V1Ai6e Begin-PLD-Builder-Info Build-Time: user:13.85s sys:2.28s real:146.90s (faults io:2 non-io:438830) End-PLD-Builder-Info
[Back to list of logs] [View rpm -qa of builder]