FailedOk

th/SRPMS[OK]
th/x32[OK]
th/i686[OK]
th/x86_64[OK]

ac/SRPMS[OK]
ac/i386[OK]
ac/i586[OK]
ac/i686[OK]
ac/alpha[OK]
ac/amd64[OK]
ac/athlon[OK]
ac/ppc[OK]
ac/sparc[OK]
ac/sparc64[OK]

Advanced Search
main()
Powered by PLD Linux
(c) 2002-2018 PLD Team
$Revision: 1.37 $
Powered by PDP-11.
Your IP: 54.80.87.62

GLM cae90238-0884-4ef8-bbfe-cd63f4e742b3

Status:Failed
Source URL:ftp://buildlogs.pld-linux.org/th/x86_64/FAIL/GLM,cae90238-0884-4ef8-bbfe-cd63f4e742b3.bz2
text/plain URL:View!
rpm -qa of builder:View!
Date:2018/07/28 08:35:21
Runtime:0:00:20.646224

Toc:

  • prep
  • Executing(%prep): /bin/sh -e /tmp/B.gUuNec/BUILD/tmp/rpm-tmp.41436
  • build
  • Executing(%build): /bin/sh -e /tmp/B.gUuNec/BUILD/tmp/rpm-tmp.41436
  • error 1
  • /tmp/B.gUuNec/BUILD/glm/test/core/core_func_matrix.cpp:19:34: internal compiler error: in gimplify_expr, at gimplify.c:12385
  • error 2
  • make[2]: *** [test/core/CMakeFiles/test-core_func_matrix.dir/build.make:66: test/core/CMakeFiles/test-core_func_matrix.dir/core_func_matrix.cpp.o] Error 1
  • error 3
  • make[1]: *** [CMakeFiles/Makefile2:1482: test/core/CMakeFiles/test-core_func_matrix.dir/all] Error 2
  • error 4
  • error: Bad exit status from /tmp/B.gUuNec/BUILD/tmp/rpm-tmp.41436 (%build)
  • error 5
  • RPM build errors:
  • error 6
  • error: No files produced.

Content:

request from: qboosh
checking if we should skip the build
started at: Sat Jul 28 08:34:57 2018
killing old processes on a builder
mesg: ttyname failed: Inappropriate ioctl for device
sending signal 9 to pid -1
Killed
cleaning up /tmp
mesg: ttyname failed: Inappropriate ioctl for device
fetching https://srcbuilder.pld-linux.org/th//srpms/cae90238-0884-4ef8-bbfe-cd63f4e742b3/GLM-0.9.9.0-1.src.rpm
fetched 1872792 bytes, 2847.0 K/s
installing srpm: GLM-0.9.9.0-1.src.rpm
mesg: ttyname failed: Inappropriate ioctl for device
+ install -d /tmp/B.gUuNec/BUILD /tmp/B.gUuNec/RPMS
+ LC_ALL=en_US.UTF-8
+ rpm -qp --changelog GLM-0.9.9.0-1.src.rpm
* Sat Jul 28 2018 PLD Linux Team <feedback@pld-linux.org>
- For complete changelog see: http://git.pld-linux.org/?p=packages/GLM.git;a=log;h=master
* Sun Jul 15 2018 Jakub Bogusz <qboosh@pld-linux.org> 7cf3de7
- new Source URL, updated to 0.9.9.0 - updated opt patch - added cmake patch (don't install file to root fs on build stage) - cmake support changed FindGLM.cmake to glm subdir - introduced glm.pc file + rpm -Uhv --nodeps --define '_topdir /tmp/B.gUuNec' --define '_specdir %{_topdir}' --define '_sourcedir %{_specdir}' --define '_rpmdir %{_topdir}/RPMS' --define '_builddir %{_topdir}/BUILD' GLM-0.9.9.0-1.src.rpm Preparing... ################################################## GLM ################################################## + rm -f GLM-0.9.9.0-1.src.rpm mesg: ttyname failed: Inappropriate ioctl for device + install -m 700 -d /tmp/B.gUuNec/BUILD/tmp mesg: ttyname failed: Inappropriate ioctl for device + TMPDIR=/tmp/B.gUuNec/BUILD/tmp + exec nice -n 0 rpmbuild -bp --short-circuit --nodeps --define '_topdir /tmp/B.gUuNec' --define '_specdir %{_topdir}' --define '_sourcedir %{_specdir}' --define '_rpmdir %{_topdir}/RPMS' --define '_builddir %{_topdir}/BUILD' --target x86_64-pld-linux --define 'prep exit 0' /tmp/B.gUuNec/GLM.spec Building target platforms: x86_64-pld-linux checking BuildConflict-ing packages no BuildConflicts found checking BR rpm: Building target platforms: x86_64-pld-linux no BR needed building RPM using: set -ex; : build-id: cae90238-0884-4ef8-bbfe-cd63f4e742b3; TMPDIR=/tmp/B.gUuNec/BUILD/tmp exec nice -n 0 rpmbuild -bb --define '_smp_mflags -j9' --define '_make_opts -Otarget' --define '_pld_builder 1' --define '_topdir /tmp/B.gUuNec' --define '_specdir %{_topdir}' --define '_sourcedir %{_specdir}' --define '_rpmdir %{_topdir}/RPMS' --define '_builddir %{_topdir}/BUILD' --target x86_64-pld-linux /tmp/B.gUuNec/GLM.spec mesg: ttyname failed: Inappropriate ioctl for device + : build-id: cae90238-0884-4ef8-bbfe-cd63f4e742b3 + TMPDIR=/tmp/B.gUuNec/BUILD/tmp + exec nice -n 0 rpmbuild -bb --define '_smp_mflags -j9' --define '_make_opts -Otarget' --define '_pld_builder 1' --define '_topdir /tmp/B.gUuNec' --define '_specdir %{_topdir}' --define '_sourcedir %{_specdir}' --define '_rpmdir %{_topdir}/RPMS' --define '_builddir %{_topdir}/BUILD' --target x86_64-pld-linux /tmp/B.gUuNec/GLM.spec Building target platforms: x86_64-pld-linux Executing(%prep): /bin/sh -e /tmp/B.gUuNec/BUILD/tmp/rpm-tmp.41436 + umask 022 + cd /tmp/B.gUuNec/BUILD + cd /tmp/B.gUuNec/BUILD + rm -rf glm + /usr/bin/7za x /tmp/B.gUuNec/glm-0.9.9.0.7z 7-Zip (a) [64] 16.02 : Copyright (c) 1999-2016 Igor Pavlov : 2016-05-21 p7zip Version 16.02 (locale=C,Utf16=off,HugeFiles=on,64 bits,8 CPUs x64) Scanning the drive for archives: 1 file, 1857564 bytes (1815 KiB) Extracting archive: /tmp/B.gUuNec/glm-0.9.9.0.7z -- Path = /tmp/B.gUuNec/glm-0.9.9.0.7z Type = 7z Physical Size = 1857564 Headers Size = 12866 Method = LZMA2:24 Solid = + Blocks = 1 Everything is Ok Folders: 20 Files: 1054 Size: 15325132 Compressed: 1857564 + STATUS=0 + '[' 0 -ne 0 ']' + cd glm + /bin/id -u + '[' 1000 '=' 0 ']' + /bin/id -u + '[' 1000 '=' 0 ']' + /bin/chmod -Rf a+rX,u+w,g-w,o-w . + echo 'Patch #0 (GLM-opt.patch):' Patch #0 (GLM-opt.patch): + '[' -f /tmp/B.gUuNec/GLM-opt.patch ']' + /bin/cat /tmp/B.gUuNec/GLM-opt.patch + /usr/bin/patch -s -p1 + echo 'Patch #1 (GLM-cmake.patch):' Patch #1 (GLM-cmake.patch): + '[' -f /tmp/B.gUuNec/GLM-cmake.patch ']' + /bin/cat /tmp/B.gUuNec/GLM-cmake.patch + /usr/bin/patch -s -p1 + exit 0 Executing(%build): /bin/sh -e /tmp/B.gUuNec/BUILD/tmp/rpm-tmp.41436 TMP=/home/users/builder/tmp HOME=/home/users/builder PATH=/home/users/builder/GNUstep/Tools:/usr/local/bin:/usr/bin:/bin:/home/users/builder/bin TMPDIR=/tmp/B.gUuNec/BUILD/tmp + umask 022 + cd /tmp/B.gUuNec/BUILD + cd glm + mkdir build + cd build + CC=x86_64-pld-linux-gcc CXX=x86_64-pld-linux-g++ CPPFLAGS= /usr/bin/cmake '-DCMAKE_VERBOSE_MAKEFILE=ON' '-DCMAKE_BUILD_TYPE=PLD' '-DCMAKE_INSTALL_BINDIR:PATH=/usr/bin' '-DCMAKE_INSTALL_SBINDIR:PATH=/usr/sbin' '-DCMAKE_INSTALL_LIBEXECDIR:PATH=/usr/libexec' '-DCMAKE_INSTALL_SYSCONFDIR:PATH=/etc' '-DCMAKE_INSTALL_SHAREDSTATEDIRPATH:PATH=/var/lib' '-DCMAKE_INSTALL_LOCALSTATEDIRPATH:PATH=/var' '-DCMAKE_INSTALL_LIBDIR:PATH=/usr/lib64' '-DCMAKE_INSTALL_INCLUDEDIR:PATH=/usr/include' '-DCMAKE_INSTALL_OLDINCLUDEDIR:PATH=/usr/include' '-DCMAKE_INSTALL_DATAROOTDIR:PATH=/usr/share' '-DCMAKE_INSTALL_DATADIR:PATH=/usr/share' '-DCMAKE_INSTALL_INFODIR:PATH=/usr/share/info' '-DCMAKE_INSTALL_LOCALEDIR:PATH=/usr/share/locale' '-DCMAKE_INSTALL_MANDIR:PATH=/usr/share/man' '-DCMAKE_INSTALL_DOCDIR:PATH=/usr/share/doc' '-DCMAKE_INSTALL_PREFIX:PATH=/usr' '-DSYSCONF_INSTALL_DIR:PATH=/etc' '-DCMAKE_CXX_FLAGS_PLD=-O2 -fwrapv -pipe -Wformat -Werror=format-security -gdwarf-4 -fno-debug-types-section -fvar-tracking-assignments -g2 -Wp,-D_FORTIFY_SOURCE=2 -fstack-protector-strong --param=ssp-buffer-size=4 -fPIC -march=x86-64 -gdwarf-4 -fno-debug-types-section -fvar-tracking-assignments -g2 -DNDEBUG -DQT_NO_DEBUG' '-DCMAKE_C_FLAGS_PLD=-O2 -fwrapv -pipe -Wformat -Werror=format-security -gdwarf-4 -fno-debug-types-section -fvar-tracking-assignments -g2 -Wp,-D_FORTIFY_SOURCE=2 -fstack-protector-strong --param=ssp-buffer-size=4 -fPIC -march=x86-64 -gdwarf-4 -fno-debug-types-section -fvar-tracking-assignments -g2 -DNDEBUG -DQT_NO_DEBUG' '-DCMAKE_Fortran_FLAGS_PLD=-O2 -fwrapv -pipe -Wformat -Werror=format-security -gdwarf-4 -fno-debug-types-section -fvar-tracking-assignments -g2 -Wp,-D_FORTIFY_SOURCE=2 -fstack-protector-strong --param=ssp-buffer-size=4 -fPIC -march=x86-64 -gdwarf-4 -fno-debug-types-section -fvar-tracking-assignments -g2 -DNDEBUG -DQT_NO_DEBUG' '-DCMAKE_EXE_LINKER_FLAGS_PLD=-Wl,--as-needed -Wl,--no-copy-dt-needed-entries -Wl,-z,relro -Wl,-z,combreloc ' '-DCMAKE_SHARED_LINKER_FLAGS_PLD=-Wl,--as-needed -Wl,--no-copy-dt-needed-entries -Wl,-z,relro -Wl,-z,combreloc ' '-DCMAKE_MODULE_LINKER_FLAGS_PLD=-Wl,--as-needed -Wl,--no-copy-dt-needed-entries -Wl,-z,relro -Wl,-z,combreloc ' '-DLIB_SUFFIX=64' '-DBUILD_SHARED_LIBS:BOOL=ON' .. '-DGLM_TEST_ENABLE:BOOL=ON' -- The CXX compiler identification is GNU 8.2.0 -- Check for working CXX compiler: /usr/bin/x86_64-pld-linux-g++ -- Check for working CXX compiler: /usr/bin/x86_64-pld-linux-g++ -- works -- Detecting CXX compiler ABI info -- Detecting CXX compiler ABI info - done -- Detecting CXX compile features -- Detecting CXX compile features - done GLM: GCC - GNU compiler -- Configuring done -- Generating done CMake Warning: Manually-specified variables were not used by the project: CMAKE_C_FLAGS_PLD CMAKE_Fortran_FLAGS_PLD CMAKE_INSTALL_LOCALSTATEDIRPATH CMAKE_INSTALL_SHAREDSTATEDIRPATH LIB_SUFFIX SYSCONF_INSTALL_DIR -- Build files have been written to: /tmp/B.gUuNec/BUILD/glm/build + /usr/bin/make -Otarget -j9 /usr/bin/cmake -H/tmp/B.gUuNec/BUILD/glm -B/tmp/B.gUuNec/BUILD/glm/build --check-build-system CMakeFiles/Makefile.cmake 0 /usr/bin/cmake -E cmake_progress_start /tmp/B.gUuNec/BUILD/glm/build/CMakeFiles /tmp/B.gUuNec/BUILD/glm/build/CMakeFiles/progress.marks /usr/bin/make -f CMakeFiles/Makefile2 all /usr/bin/make -f glm/CMakeFiles/glm_dummy.dir/build.make glm/CMakeFiles/glm_dummy.dir/depend /usr/bin/make -f test/bug/CMakeFiles/test-bug_ms_vec_static.dir/build.make test/bug/CMakeFiles/test-bug_ms_vec_static.dir/depend /usr/bin/make -f test/core/CMakeFiles/test-core_setup_message.dir/build.make test/core/CMakeFiles/test-core_setup_message.dir/depend /usr/bin/make -f test/core/CMakeFiles/test-core_type_mat2x4.dir/build.make test/core/CMakeFiles/test-core_type_mat2x4.dir/depend /usr/bin/make -f test/core/CMakeFiles/test-core_type_mat2x3.dir/build.make test/core/CMakeFiles/test-core_type_mat2x3.dir/depend /usr/bin/make -f test/core/CMakeFiles/test-core_type_ctor.dir/build.make test/core/CMakeFiles/test-core_type_ctor.dir/depend /usr/bin/make -f test/core/CMakeFiles/test-core_type_mat4x3.dir/build.make test/core/CMakeFiles/test-core_type_mat4x3.dir/depend /usr/bin/make -f test/core/CMakeFiles/test-core_func_integer_find_msb.dir/build.make test/core/CMakeFiles/test-core_func_integer_find_msb.dir/depend /usr/bin/make -f test/core/CMakeFiles/test-core_func_trigonometric.dir/build.make test/core/CMakeFiles/test-core_func_trigonometric.dir/depend make[2]: Entering directory '/tmp/B.gUuNec/BUILD/glm/build' cd /tmp/B.gUuNec/BUILD/glm/build && /usr/bin/cmake -E cmake_depends "Unix Makefiles" /tmp/B.gUuNec/BUILD/glm /tmp/B.gUuNec/BUILD/glm/test/core /tmp/B.gUuNec/BUILD/glm/build /tmp/B.gUuNec/BUILD/glm/build/test/core /tmp/B.gUuNec/BUILD/glm/build/test/core/CMakeFiles/test-core_setup_message.dir/DependInfo.cmake --color= Scanning dependencies of target test-core_setup_message make[2]: Leaving directory '/tmp/B.gUuNec/BUILD/glm/build' /usr/bin/make -f test/core/CMakeFiles/test-core_setup_message.dir/build.make test/core/CMakeFiles/test-core_setup_message.dir/build make[2]: Entering directory '/tmp/B.gUuNec/BUILD/glm/build' cd /tmp/B.gUuNec/BUILD/glm/build && /usr/bin/cmake -E cmake_depends "Unix Makefiles" /tmp/B.gUuNec/BUILD/glm /tmp/B.gUuNec/BUILD/glm/test/bug /tmp/B.gUuNec/BUILD/glm/build /tmp/B.gUuNec/BUILD/glm/build/test/bug /tmp/B.gUuNec/BUILD/glm/build/test/bug/CMakeFiles/test-bug_ms_vec_static.dir/DependInfo.cmake --color= Scanning dependencies of target test-bug_ms_vec_static make[2]: Leaving directory '/tmp/B.gUuNec/BUILD/glm/build' make[2]: Entering directory '/tmp/B.gUuNec/BUILD/glm/build' cd /tmp/B.gUuNec/BUILD/glm/build && /usr/bin/cmake -E cmake_depends "Unix Makefiles" /tmp/B.gUuNec/BUILD/glm /tmp/B.gUuNec/BUILD/glm/test/core /tmp/B.gUuNec/BUILD/glm/build /tmp/B.gUuNec/BUILD/glm/build/test/core /tmp/B.gUuNec/BUILD/glm/build/test/core/CMakeFiles/test-core_type_ctor.dir/DependInfo.cmake --color= Scanning dependencies of target test-core_type_ctor make[2]: Leaving directory '/tmp/B.gUuNec/BUILD/glm/build' /usr/bin/make -f test/bug/CMakeFiles/test-bug_ms_vec_static.dir/build.make test/bug/CMakeFiles/test-bug_ms_vec_static.dir/build /usr/bin/make -f test/core/CMakeFiles/test-core_type_ctor.dir/build.make test/core/CMakeFiles/test-core_type_ctor.dir/build make[2]: Entering directory '/tmp/B.gUuNec/BUILD/glm/build' cd /tmp/B.gUuNec/BUILD/glm/build && /usr/bin/cmake -E cmake_depends "Unix Makefiles" /tmp/B.gUuNec/BUILD/glm /tmp/B.gUuNec/BUILD/glm/test/core /tmp/B.gUuNec/BUILD/glm/build /tmp/B.gUuNec/BUILD/glm/build/test/core /tmp/B.gUuNec/BUILD/glm/build/test/core/CMakeFiles/test-core_func_trigonometric.dir/DependInfo.cmake --color= Scanning dependencies of target test-core_func_trigonometric make[2]: Leaving directory '/tmp/B.gUuNec/BUILD/glm/build' make[2]: Entering directory '/tmp/B.gUuNec/BUILD/glm/build' cd /tmp/B.gUuNec/BUILD/glm/build && /usr/bin/cmake -E cmake_depends "Unix Makefiles" /tmp/B.gUuNec/BUILD/glm /tmp/B.gUuNec/BUILD/glm/test/core /tmp/B.gUuNec/BUILD/glm/build /tmp/B.gUuNec/BUILD/glm/build/test/core /tmp/B.gUuNec/BUILD/glm/build/test/core/CMakeFiles/test-core_func_integer_find_msb.dir/DependInfo.cmake --color= Scanning dependencies of target test-core_func_integer_find_msb make[2]: Leaving directory '/tmp/B.gUuNec/BUILD/glm/build' /usr/bin/make -f test/core/CMakeFiles/test-core_func_integer_find_msb.dir/build.make test/core/CMakeFiles/test-core_func_integer_find_msb.dir/build make[2]: Entering directory '/tmp/B.gUuNec/BUILD/glm/build' cd /tmp/B.gUuNec/BUILD/glm/build && /usr/bin/cmake -E cmake_depends "Unix Makefiles" /tmp/B.gUuNec/BUILD/glm /tmp/B.gUuNec/BUILD/glm/test/core /tmp/B.gUuNec/BUILD/glm/build /tmp/B.gUuNec/BUILD/glm/build/test/core /tmp/B.gUuNec/BUILD/glm/build/test/core/CMakeFiles/test-core_type_mat2x3.dir/DependInfo.cmake --color= Scanning dependencies of target test-core_type_mat2x3 make[2]: Leaving directory '/tmp/B.gUuNec/BUILD/glm/build' make[2]: Entering directory '/tmp/B.gUuNec/BUILD/glm/build' cd /tmp/B.gUuNec/BUILD/glm/build && /usr/bin/cmake -E cmake_depends "Unix Makefiles" /tmp/B.gUuNec/BUILD/glm /tmp/B.gUuNec/BUILD/glm/test/core /tmp/B.gUuNec/BUILD/glm/build /tmp/B.gUuNec/BUILD/glm/build/test/core /tmp/B.gUuNec/BUILD/glm/build/test/core/CMakeFiles/test-core_type_mat4x3.dir/DependInfo.cmake --color= Scanning dependencies of target test-core_type_mat4x3 make[2]: Leaving directory '/tmp/B.gUuNec/BUILD/glm/build' /usr/bin/make -f test/core/CMakeFiles/test-core_type_mat2x3.dir/build.make test/core/CMakeFiles/test-core_type_mat2x3.dir/build make[2]: Entering directory '/tmp/B.gUuNec/BUILD/glm/build' cd /tmp/B.gUuNec/BUILD/glm/build && /usr/bin/cmake -E cmake_depends "Unix Makefiles" /tmp/B.gUuNec/BUILD/glm /tmp/B.gUuNec/BUILD/glm/test/core /tmp/B.gUuNec/BUILD/glm/build /tmp/B.gUuNec/BUILD/glm/build/test/core /tmp/B.gUuNec/BUILD/glm/build/test/core/CMakeFiles/test-core_type_mat2x4.dir/DependInfo.cmake --color= Scanning dependencies of target test-core_type_mat2x4 make[2]: Leaving directory '/tmp/B.gUuNec/BUILD/glm/build' /usr/bin/make -f test/core/CMakeFiles/test-core_type_mat4x3.dir/build.make test/core/CMakeFiles/test-core_type_mat4x3.dir/build make[2]: Entering directory '/tmp/B.gUuNec/BUILD/glm/build' cd /tmp/B.gUuNec/BUILD/glm/build && /usr/bin/cmake -E cmake_depends "Unix Makefiles" /tmp/B.gUuNec/BUILD/glm /tmp/B.gUuNec/BUILD/glm/glm /tmp/B.gUuNec/BUILD/glm/build /tmp/B.gUuNec/BUILD/glm/build/glm /tmp/B.gUuNec/BUILD/glm/build/glm/CMakeFiles/glm_dummy.dir/DependInfo.cmake --color= Scanning dependencies of target glm_dummy make[2]: Leaving directory '/tmp/B.gUuNec/BUILD/glm/build' /usr/bin/make -f test/core/CMakeFiles/test-core_type_mat2x4.dir/build.make test/core/CMakeFiles/test-core_type_mat2x4.dir/build /usr/bin/make -f glm/CMakeFiles/glm_dummy.dir/build.make glm/CMakeFiles/glm_dummy.dir/build /usr/bin/make -f test/core/CMakeFiles/test-core_func_trigonometric.dir/build.make test/core/CMakeFiles/test-core_func_trigonometric.dir/build make[2]: Entering directory '/tmp/B.gUuNec/BUILD/glm/build' [ 6%] Building CXX object glm/CMakeFiles/glm_dummy.dir/detail/dummy.cpp.o cd /tmp/B.gUuNec/BUILD/glm/build/glm && /usr/bin/x86_64-pld-linux-g++ -I/tmp/B.gUuNec/BUILD/glm -I/tmp/B.gUuNec/BUILD/glm/glm/.. -O2 -fwrapv -pipe -Wformat -Werror=format-security -gdwarf-4 -fno-debug-types-section -fvar-tracking-assignments -g2 -Wp,-D_FORTIFY_SOURCE=2 -fstack-protector-strong --param=ssp-buffer-size=4 -fPIC -march=x86-64 -gdwarf-4 -fno-debug-types-section -fvar-tracking-assignments -g2 -DNDEBUG -DQT_NO_DEBUG -Wno-long-long -o CMakeFiles/glm_dummy.dir/detail/dummy.cpp.o -c /tmp/B.gUuNec/BUILD/glm/glm/detail/dummy.cpp make[2]: Leaving directory '/tmp/B.gUuNec/BUILD/glm/build' make[2]: Entering directory '/tmp/B.gUuNec/BUILD/glm/build' [ 0%] Building CXX object test/core/CMakeFiles/test-core_setup_message.dir/core_setup_message.cpp.o cd /tmp/B.gUuNec/BUILD/glm/build/test/core && /usr/bin/x86_64-pld-linux-g++ -I/tmp/B.gUuNec/BUILD/glm -O2 -fwrapv -pipe -Wformat -Werror=format-security -gdwarf-4 -fno-debug-types-section -fvar-tracking-assignments -g2 -Wp,-D_FORTIFY_SOURCE=2 -fstack-protector-strong --param=ssp-buffer-size=4 -fPIC -march=x86-64 -gdwarf-4 -fno-debug-types-section -fvar-tracking-assignments -g2 -DNDEBUG -DQT_NO_DEBUG -Wno-long-long -o CMakeFiles/test-core_setup_message.dir/core_setup_message.cpp.o -c /tmp/B.gUuNec/BUILD/glm/test/core/core_setup_message.cpp In file included from /tmp/B.gUuNec/BUILD/glm/glm/detail/setup.hpp:36, from /tmp/B.gUuNec/BUILD/glm/glm/vec3.hpp:4, from /tmp/B.gUuNec/BUILD/glm/test/core/core_setup_message.cpp:2: /tmp/B.gUuNec/BUILD/glm/glm/detail/../simd/platform.h:63:49: note: #pragma message: GLM: Linux platform detected # pragma message("GLM: Linux platform detected") ^ In file included from /tmp/B.gUuNec/BUILD/glm/glm/vec3.hpp:4, from /tmp/B.gUuNec/BUILD/glm/test/core/core_setup_message.cpp:2: /tmp/B.gUuNec/BUILD/glm/glm/detail/setup.hpp:43:41: note: #pragma message: GLM: version 0.9.9.0 # pragma message ("GLM: version 0.9.9.0") ^ /tmp/B.gUuNec/BUILD/glm/glm/detail/setup.hpp:58:47: note: #pragma message: GLM: GCC compiler detected # pragma message("GLM: GCC compiler detected") ^ /tmp/B.gUuNec/BUILD/glm/glm/detail/setup.hpp:82:39: note: #pragma message: GLM: 64 bits model # pragma message("GLM: 64 bits model") ^ /tmp/B.gUuNec/BUILD/glm/glm/detail/setup.hpp:105:46: note: #pragma message: GLM: SSE2 instruction set # pragma message("GLM: SSE2 instruction set") ^ In file included from /tmp/B.gUuNec/BUILD/glm/glm/vec3.hpp:4, from /tmp/B.gUuNec/BUILD/glm/test/core/core_setup_message.cpp:2: /tmp/B.gUuNec/BUILD/glm/glm/detail/setup.hpp:261:31: note: #pragma message: GLM: C++14 # pragma message("GLM: C++14") ^ /tmp/B.gUuNec/BUILD/glm/glm/detail/setup.hpp:597:103: note: #pragma message: GLM: Swizzling operators disabled, #define GLM_SWIZZLE to enable swizzle operators # pragma message("GLM: Swizzling operators disabled, #define GLM_SWIZZLE to enable swizzle operators") ^ /tmp/B.gUuNec/BUILD/glm/glm/detail/setup.hpp:646:63: note: #pragma message: GLM: Depth clip space: negative one to one # pragma message("GLM: Depth clip space: negative one to one") ^ /tmp/B.gUuNec/BUILD/glm/glm/detail/setup.hpp:668:57: note: #pragma message: GLM: Coordinate system: right handed # pragma message("GLM: Coordinate system: right handed") ^ /tmp/B.gUuNec/BUILD/glm/glm/detail/setup.hpp:806:108: note: #pragma message: GLM: .length() returns glm::length_t, a typedef of int following the GLSL specification # pragma message("GLM: .length() returns glm::length_t, a typedef of int following the GLSL specification") ^ make[2]: Leaving directory '/tmp/B.gUuNec/BUILD/glm/build' make[2]: Entering directory '/tmp/B.gUuNec/BUILD/glm/build' [ 5%] Building CXX object test/core/CMakeFiles/test-core_func_trigonometric.dir/core_func_trigonometric.cpp.o cd /tmp/B.gUuNec/BUILD/glm/build/test/core && /usr/bin/x86_64-pld-linux-g++ -I/tmp/B.gUuNec/BUILD/glm -O2 -fwrapv -pipe -Wformat -Werror=format-security -gdwarf-4 -fno-debug-types-section -fvar-tracking-assignments -g2 -Wp,-D_FORTIFY_SOURCE=2 -fstack-protector-strong --param=ssp-buffer-size=4 -fPIC -march=x86-64 -gdwarf-4 -fno-debug-types-section -fvar-tracking-assignments -g2 -DNDEBUG -DQT_NO_DEBUG -Wno-long-long -o CMakeFiles/test-core_func_trigonometric.dir/core_func_trigonometric.cpp.o -c /tmp/B.gUuNec/BUILD/glm/test/core/core_func_trigonometric.cpp make[2]: Leaving directory '/tmp/B.gUuNec/BUILD/glm/build' make[2]: Entering directory '/tmp/B.gUuNec/BUILD/glm/build' [ 7%] Linking CXX executable test-core_setup_message cd /tmp/B.gUuNec/BUILD/glm/build/test/core && /usr/bin/cmake -E cmake_link_script CMakeFiles/test-core_setup_message.dir/link.txt --verbose=1 /usr/bin/x86_64-pld-linux-g++ -O2 -fwrapv -pipe -Wformat -Werror=format-security -gdwarf-4 -fno-debug-types-section -fvar-tracking-assignments -g2 -Wp,-D_FORTIFY_SOURCE=2 -fstack-protector-strong --param=ssp-buffer-size=4 -fPIC -march=x86-64 -gdwarf-4 -fno-debug-types-section -fvar-tracking-assignments -g2 -DNDEBUG -DQT_NO_DEBUG -Wl,--as-needed -Wl,--no-copy-dt-needed-entries -Wl,-z,relro -Wl,-z,combreloc -rdynamic CMakeFiles/test-core_setup_message.dir/core_setup_message.cpp.o -o test-core_setup_message make[2]: Leaving directory '/tmp/B.gUuNec/BUILD/glm/build' make[1]: Entering directory '/tmp/B.gUuNec/BUILD/glm/build' [ 7%] Built target test-core_setup_message make[1]: Leaving directory '/tmp/B.gUuNec/BUILD/glm/build' /usr/bin/make -f test/core/CMakeFiles/test-core_type_length.dir/build.make test/core/CMakeFiles/test-core_type_length.dir/depend make[2]: Entering directory '/tmp/B.gUuNec/BUILD/glm/build' cd /tmp/B.gUuNec/BUILD/glm/build && /usr/bin/cmake -E cmake_depends "Unix Makefiles" /tmp/B.gUuNec/BUILD/glm /tmp/B.gUuNec/BUILD/glm/test/core /tmp/B.gUuNec/BUILD/glm/build /tmp/B.gUuNec/BUILD/glm/build/test/core /tmp/B.gUuNec/BUILD/glm/build/test/core/CMakeFiles/test-core_type_length.dir/DependInfo.cmake --color= Scanning dependencies of target test-core_type_length make[2]: Leaving directory '/tmp/B.gUuNec/BUILD/glm/build' /usr/bin/make -f test/core/CMakeFiles/test-core_type_length.dir/build.make test/core/CMakeFiles/test-core_type_length.dir/build make[2]: Entering directory '/tmp/B.gUuNec/BUILD/glm/build' [ 7%] Linking CXX executable test-core_func_trigonometric cd /tmp/B.gUuNec/BUILD/glm/build/test/core && /usr/bin/cmake -E cmake_link_script CMakeFiles/test-core_func_trigonometric.dir/link.txt --verbose=1 /usr/bin/x86_64-pld-linux-g++ -O2 -fwrapv -pipe -Wformat -Werror=format-security -gdwarf-4 -fno-debug-types-section -fvar-tracking-assignments -g2 -Wp,-D_FORTIFY_SOURCE=2 -fstack-protector-strong --param=ssp-buffer-size=4 -fPIC -march=x86-64 -gdwarf-4 -fno-debug-types-section -fvar-tracking-assignments -g2 -DNDEBUG -DQT_NO_DEBUG -Wl,--as-needed -Wl,--no-copy-dt-needed-entries -Wl,-z,relro -Wl,-z,combreloc -rdynamic CMakeFiles/test-core_func_trigonometric.dir/core_func_trigonometric.cpp.o -o test-core_func_trigonometric make[2]: Leaving directory '/tmp/B.gUuNec/BUILD/glm/build' make[1]: Entering directory '/tmp/B.gUuNec/BUILD/glm/build' [ 7%] Built target test-core_func_trigonometric make[1]: Leaving directory '/tmp/B.gUuNec/BUILD/glm/build' /usr/bin/make -f test/core/CMakeFiles/test-core_type_mat4x2.dir/build.make test/core/CMakeFiles/test-core_type_mat4x2.dir/depend make[2]: Entering directory '/tmp/B.gUuNec/BUILD/glm/build' cd /tmp/B.gUuNec/BUILD/glm/build && /usr/bin/cmake -E cmake_depends "Unix Makefiles" /tmp/B.gUuNec/BUILD/glm /tmp/B.gUuNec/BUILD/glm/test/core /tmp/B.gUuNec/BUILD/glm/build /tmp/B.gUuNec/BUILD/glm/build/test/core /tmp/B.gUuNec/BUILD/glm/build/test/core/CMakeFiles/test-core_type_mat4x2.dir/DependInfo.cmake --color= Scanning dependencies of target test-core_type_mat4x2 make[2]: Leaving directory '/tmp/B.gUuNec/BUILD/glm/build' /usr/bin/make -f test/core/CMakeFiles/test-core_type_mat4x2.dir/build.make test/core/CMakeFiles/test-core_type_mat4x2.dir/build make[2]: Entering directory '/tmp/B.gUuNec/BUILD/glm/build' [ 0%] Building CXX object test/bug/CMakeFiles/test-bug_ms_vec_static.dir/bug_ms_vec_static.cpp.o cd /tmp/B.gUuNec/BUILD/glm/build/test/bug && /usr/bin/x86_64-pld-linux-g++ -I/tmp/B.gUuNec/BUILD/glm -O2 -fwrapv -pipe -Wformat -Werror=format-security -gdwarf-4 -fno-debug-types-section -fvar-tracking-assignments -g2 -Wp,-D_FORTIFY_SOURCE=2 -fstack-protector-strong --param=ssp-buffer-size=4 -fPIC -march=x86-64 -gdwarf-4 -fno-debug-types-section -fvar-tracking-assignments -g2 -DNDEBUG -DQT_NO_DEBUG -Wno-long-long -o CMakeFiles/test-bug_ms_vec_static.dir/bug_ms_vec_static.cpp.o -c /tmp/B.gUuNec/BUILD/glm/test/bug/bug_ms_vec_static.cpp make[2]: Leaving directory '/tmp/B.gUuNec/BUILD/glm/build' make[2]: Entering directory '/tmp/B.gUuNec/BUILD/glm/build' [ 8%] Linking CXX executable test-bug_ms_vec_static cd /tmp/B.gUuNec/BUILD/glm/build/test/bug && /usr/bin/cmake -E cmake_link_script CMakeFiles/test-bug_ms_vec_static.dir/link.txt --verbose=1 /usr/bin/x86_64-pld-linux-g++ -O2 -fwrapv -pipe -Wformat -Werror=format-security -gdwarf-4 -fno-debug-types-section -fvar-tracking-assignments -g2 -Wp,-D_FORTIFY_SOURCE=2 -fstack-protector-strong --param=ssp-buffer-size=4 -fPIC -march=x86-64 -gdwarf-4 -fno-debug-types-section -fvar-tracking-assignments -g2 -DNDEBUG -DQT_NO_DEBUG -Wl,--as-needed -Wl,--no-copy-dt-needed-entries -Wl,-z,relro -Wl,-z,combreloc -rdynamic CMakeFiles/test-bug_ms_vec_static.dir/bug_ms_vec_static.cpp.o -o test-bug_ms_vec_static make[2]: Leaving directory '/tmp/B.gUuNec/BUILD/glm/build' make[1]: Entering directory '/tmp/B.gUuNec/BUILD/glm/build' [ 8%] Built target test-bug_ms_vec_static make[1]: Leaving directory '/tmp/B.gUuNec/BUILD/glm/build' /usr/bin/make -f test/core/CMakeFiles/test-core_type_mat3x2.dir/build.make test/core/CMakeFiles/test-core_type_mat3x2.dir/depend make[2]: Entering directory '/tmp/B.gUuNec/BUILD/glm/build' cd /tmp/B.gUuNec/BUILD/glm/build && /usr/bin/cmake -E cmake_depends "Unix Makefiles" /tmp/B.gUuNec/BUILD/glm /tmp/B.gUuNec/BUILD/glm/test/core /tmp/B.gUuNec/BUILD/glm/build /tmp/B.gUuNec/BUILD/glm/build/test/core /tmp/B.gUuNec/BUILD/glm/build/test/core/CMakeFiles/test-core_type_mat3x2.dir/DependInfo.cmake --color= Scanning dependencies of target test-core_type_mat3x2 make[2]: Leaving directory '/tmp/B.gUuNec/BUILD/glm/build' /usr/bin/make -f test/core/CMakeFiles/test-core_type_mat3x2.dir/build.make test/core/CMakeFiles/test-core_type_mat3x2.dir/build make[2]: Entering directory '/tmp/B.gUuNec/BUILD/glm/build' [ 1%] Building CXX object test/core/CMakeFiles/test-core_type_ctor.dir/core_type_ctor.cpp.o cd /tmp/B.gUuNec/BUILD/glm/build/test/core && /usr/bin/x86_64-pld-linux-g++ -I/tmp/B.gUuNec/BUILD/glm -O2 -fwrapv -pipe -Wformat -Werror=format-security -gdwarf-4 -fno-debug-types-section -fvar-tracking-assignments -g2 -Wp,-D_FORTIFY_SOURCE=2 -fstack-protector-strong --param=ssp-buffer-size=4 -fPIC -march=x86-64 -gdwarf-4 -fno-debug-types-section -fvar-tracking-assignments -g2 -DNDEBUG -DQT_NO_DEBUG -Wno-long-long -o CMakeFiles/test-core_type_ctor.dir/core_type_ctor.cpp.o -c /tmp/B.gUuNec/BUILD/glm/test/core/core_type_ctor.cpp make[2]: Leaving directory '/tmp/B.gUuNec/BUILD/glm/build' make[2]: Entering directory '/tmp/B.gUuNec/BUILD/glm/build' [ 7%] Building CXX object test/core/CMakeFiles/test-core_type_length.dir/core_type_length.cpp.o cd /tmp/B.gUuNec/BUILD/glm/build/test/core && /usr/bin/x86_64-pld-linux-g++ -I/tmp/B.gUuNec/BUILD/glm -O2 -fwrapv -pipe -Wformat -Werror=format-security -gdwarf-4 -fno-debug-types-section -fvar-tracking-assignments -g2 -Wp,-D_FORTIFY_SOURCE=2 -fstack-protector-strong --param=ssp-buffer-size=4 -fPIC -march=x86-64 -gdwarf-4 -fno-debug-types-section -fvar-tracking-assignments -g2 -DNDEBUG -DQT_NO_DEBUG -Wno-long-long -o CMakeFiles/test-core_type_length.dir/core_type_length.cpp.o -c /tmp/B.gUuNec/BUILD/glm/test/core/core_type_length.cpp make[2]: Leaving directory '/tmp/B.gUuNec/BUILD/glm/build' make[2]: Entering directory '/tmp/B.gUuNec/BUILD/glm/build' [ 3%] Building CXX object test/core/CMakeFiles/test-core_func_integer_find_msb.dir/core_func_integer_find_msb.cpp.o cd /tmp/B.gUuNec/BUILD/glm/build/test/core && /usr/bin/x86_64-pld-linux-g++ -I/tmp/B.gUuNec/BUILD/glm -O2 -fwrapv -pipe -Wformat -Werror=format-security -gdwarf-4 -fno-debug-types-section -fvar-tracking-assignments -g2 -Wp,-D_FORTIFY_SOURCE=2 -fstack-protector-strong --param=ssp-buffer-size=4 -fPIC -march=x86-64 -gdwarf-4 -fno-debug-types-section -fvar-tracking-assignments -g2 -DNDEBUG -DQT_NO_DEBUG -Wno-long-long -o CMakeFiles/test-core_func_integer_find_msb.dir/core_func_integer_find_msb.cpp.o -c /tmp/B.gUuNec/BUILD/glm/test/core/core_func_integer_find_msb.cpp make[2]: Leaving directory '/tmp/B.gUuNec/BUILD/glm/build' make[2]: Entering directory '/tmp/B.gUuNec/BUILD/glm/build' [ 2%] Building CXX object test/core/CMakeFiles/test-core_type_mat2x3.dir/core_type_mat2x3.cpp.o cd /tmp/B.gUuNec/BUILD/glm/build/test/core && /usr/bin/x86_64-pld-linux-g++ -I/tmp/B.gUuNec/BUILD/glm -O2 -fwrapv -pipe -Wformat -Werror=format-security -gdwarf-4 -fno-debug-types-section -fvar-tracking-assignments -g2 -Wp,-D_FORTIFY_SOURCE=2 -fstack-protector-strong --param=ssp-buffer-size=4 -fPIC -march=x86-64 -gdwarf-4 -fno-debug-types-section -fvar-tracking-assignments -g2 -DNDEBUG -DQT_NO_DEBUG -Wno-long-long -o CMakeFiles/test-core_type_mat2x3.dir/core_type_mat2x3.cpp.o -c /tmp/B.gUuNec/BUILD/glm/test/core/core_type_mat2x3.cpp make[2]: Leaving directory '/tmp/B.gUuNec/BUILD/glm/build' make[2]: Entering directory '/tmp/B.gUuNec/BUILD/glm/build' [ 9%] Linking CXX executable test-core_type_length cd /tmp/B.gUuNec/BUILD/glm/build/test/core && /usr/bin/cmake -E cmake_link_script CMakeFiles/test-core_type_length.dir/link.txt --verbose=1 /usr/bin/x86_64-pld-linux-g++ -O2 -fwrapv -pipe -Wformat -Werror=format-security -gdwarf-4 -fno-debug-types-section -fvar-tracking-assignments -g2 -Wp,-D_FORTIFY_SOURCE=2 -fstack-protector-strong --param=ssp-buffer-size=4 -fPIC -march=x86-64 -gdwarf-4 -fno-debug-types-section -fvar-tracking-assignments -g2 -DNDEBUG -DQT_NO_DEBUG -Wl,--as-needed -Wl,--no-copy-dt-needed-entries -Wl,-z,relro -Wl,-z,combreloc -rdynamic CMakeFiles/test-core_type_length.dir/core_type_length.cpp.o -o test-core_type_length make[2]: Leaving directory '/tmp/B.gUuNec/BUILD/glm/build' make[2]: Entering directory '/tmp/B.gUuNec/BUILD/glm/build' [ 9%] Linking CXX executable test-core_type_ctor cd /tmp/B.gUuNec/BUILD/glm/build/test/core && /usr/bin/cmake -E cmake_link_script CMakeFiles/test-core_type_ctor.dir/link.txt --verbose=1 /usr/bin/x86_64-pld-linux-g++ -O2 -fwrapv -pipe -Wformat -Werror=format-security -gdwarf-4 -fno-debug-types-section -fvar-tracking-assignments -g2 -Wp,-D_FORTIFY_SOURCE=2 -fstack-protector-strong --param=ssp-buffer-size=4 -fPIC -march=x86-64 -gdwarf-4 -fno-debug-types-section -fvar-tracking-assignments -g2 -DNDEBUG -DQT_NO_DEBUG -Wl,--as-needed -Wl,--no-copy-dt-needed-entries -Wl,-z,relro -Wl,-z,combreloc -rdynamic CMakeFiles/test-core_type_ctor.dir/core_type_ctor.cpp.o -o test-core_type_ctor make[2]: Leaving directory '/tmp/B.gUuNec/BUILD/glm/build' make[1]: Entering directory '/tmp/B.gUuNec/BUILD/glm/build' [ 9%] Built target test-core_type_ctor make[1]: Leaving directory '/tmp/B.gUuNec/BUILD/glm/build' make[1]: Entering directory '/tmp/B.gUuNec/BUILD/glm/build' [ 9%] Built target test-core_type_length make[1]: Leaving directory '/tmp/B.gUuNec/BUILD/glm/build' /usr/bin/make -f test/core/CMakeFiles/test-core_type_mat3x4.dir/build.make test/core/CMakeFiles/test-core_type_mat3x4.dir/depend /usr/bin/make -f test/core/CMakeFiles/test-core_type_vec3.dir/build.make test/core/CMakeFiles/test-core_type_vec3.dir/depend make[2]: Entering directory '/tmp/B.gUuNec/BUILD/glm/build' [ 9%] Linking CXX executable test-core_func_integer_find_msb cd /tmp/B.gUuNec/BUILD/glm/build/test/core && /usr/bin/cmake -E cmake_link_script CMakeFiles/test-core_func_integer_find_msb.dir/link.txt --verbose=1 /usr/bin/x86_64-pld-linux-g++ -O2 -fwrapv -pipe -Wformat -Werror=format-security -gdwarf-4 -fno-debug-types-section -fvar-tracking-assignments -g2 -Wp,-D_FORTIFY_SOURCE=2 -fstack-protector-strong --param=ssp-buffer-size=4 -fPIC -march=x86-64 -gdwarf-4 -fno-debug-types-section -fvar-tracking-assignments -g2 -DNDEBUG -DQT_NO_DEBUG -Wl,--as-needed -Wl,--no-copy-dt-needed-entries -Wl,-z,relro -Wl,-z,combreloc -rdynamic CMakeFiles/test-core_func_integer_find_msb.dir/core_func_integer_find_msb.cpp.o -o test-core_func_integer_find_msb make[2]: Leaving directory '/tmp/B.gUuNec/BUILD/glm/build' make[2]: Entering directory '/tmp/B.gUuNec/BUILD/glm/build' cd /tmp/B.gUuNec/BUILD/glm/build && /usr/bin/cmake -E cmake_depends "Unix Makefiles" /tmp/B.gUuNec/BUILD/glm /tmp/B.gUuNec/BUILD/glm/test/core /tmp/B.gUuNec/BUILD/glm/build /tmp/B.gUuNec/BUILD/glm/build/test/core /tmp/B.gUuNec/BUILD/glm/build/test/core/CMakeFiles/test-core_type_vec3.dir/DependInfo.cmake --color= Scanning dependencies of target test-core_type_vec3 make[2]: Leaving directory '/tmp/B.gUuNec/BUILD/glm/build' /usr/bin/make -f test/core/CMakeFiles/test-core_type_vec3.dir/build.make test/core/CMakeFiles/test-core_type_vec3.dir/build make[2]: Entering directory '/tmp/B.gUuNec/BUILD/glm/build' cd /tmp/B.gUuNec/BUILD/glm/build && /usr/bin/cmake -E cmake_depends "Unix Makefiles" /tmp/B.gUuNec/BUILD/glm /tmp/B.gUuNec/BUILD/glm/test/core /tmp/B.gUuNec/BUILD/glm/build /tmp/B.gUuNec/BUILD/glm/build/test/core /tmp/B.gUuNec/BUILD/glm/build/test/core/CMakeFiles/test-core_type_mat3x4.dir/DependInfo.cmake --color= Scanning dependencies of target test-core_type_mat3x4 make[2]: Leaving directory '/tmp/B.gUuNec/BUILD/glm/build' /usr/bin/make -f test/core/CMakeFiles/test-core_type_mat3x4.dir/build.make test/core/CMakeFiles/test-core_type_mat3x4.dir/build make[1]: Entering directory '/tmp/B.gUuNec/BUILD/glm/build' [ 9%] Built target test-core_func_integer_find_msb make[1]: Leaving directory '/tmp/B.gUuNec/BUILD/glm/build' /usr/bin/make -f test/core/CMakeFiles/test-core_force_unrestricted_gentype.dir/build.make test/core/CMakeFiles/test-core_force_unrestricted_gentype.dir/depend make[2]: Entering directory '/tmp/B.gUuNec/BUILD/glm/build' [ 4%] Building CXX object test/core/CMakeFiles/test-core_type_mat4x3.dir/core_type_mat4x3.cpp.o cd /tmp/B.gUuNec/BUILD/glm/build/test/core && /usr/bin/x86_64-pld-linux-g++ -I/tmp/B.gUuNec/BUILD/glm -O2 -fwrapv -pipe -Wformat -Werror=format-security -gdwarf-4 -fno-debug-types-section -fvar-tracking-assignments -g2 -Wp,-D_FORTIFY_SOURCE=2 -fstack-protector-strong --param=ssp-buffer-size=4 -fPIC -march=x86-64 -gdwarf-4 -fno-debug-types-section -fvar-tracking-assignments -g2 -DNDEBUG -DQT_NO_DEBUG -Wno-long-long -o CMakeFiles/test-core_type_mat4x3.dir/core_type_mat4x3.cpp.o -c /tmp/B.gUuNec/BUILD/glm/test/core/core_type_mat4x3.cpp make[2]: Leaving directory '/tmp/B.gUuNec/BUILD/glm/build' make[2]: Entering directory '/tmp/B.gUuNec/BUILD/glm/build' [ 6%] Building CXX object test/core/CMakeFiles/test-core_type_mat2x4.dir/core_type_mat2x4.cpp.o cd /tmp/B.gUuNec/BUILD/glm/build/test/core && /usr/bin/x86_64-pld-linux-g++ -I/tmp/B.gUuNec/BUILD/glm -O2 -fwrapv -pipe -Wformat -Werror=format-security -gdwarf-4 -fno-debug-types-section -fvar-tracking-assignments -g2 -Wp,-D_FORTIFY_SOURCE=2 -fstack-protector-strong --param=ssp-buffer-size=4 -fPIC -march=x86-64 -gdwarf-4 -fno-debug-types-section -fvar-tracking-assignments -g2 -DNDEBUG -DQT_NO_DEBUG -Wno-long-long -o CMakeFiles/test-core_type_mat2x4.dir/core_type_mat2x4.cpp.o -c /tmp/B.gUuNec/BUILD/glm/test/core/core_type_mat2x4.cpp make[2]: Leaving directory '/tmp/B.gUuNec/BUILD/glm/build' make[2]: Entering directory '/tmp/B.gUuNec/BUILD/glm/build' cd /tmp/B.gUuNec/BUILD/glm/build && /usr/bin/cmake -E cmake_depends "Unix Makefiles" /tmp/B.gUuNec/BUILD/glm /tmp/B.gUuNec/BUILD/glm/test/core /tmp/B.gUuNec/BUILD/glm/build /tmp/B.gUuNec/BUILD/glm/build/test/core /tmp/B.gUuNec/BUILD/glm/build/test/core/CMakeFiles/test-core_force_unrestricted_gentype.dir/DependInfo.cmake --color= Scanning dependencies of target test-core_force_unrestricted_gentype make[2]: Leaving directory '/tmp/B.gUuNec/BUILD/glm/build' /usr/bin/make -f test/core/CMakeFiles/test-core_force_unrestricted_gentype.dir/build.make test/core/CMakeFiles/test-core_force_unrestricted_gentype.dir/build make[2]: Entering directory '/tmp/B.gUuNec/BUILD/glm/build' [ 9%] Linking CXX executable test-core_type_mat2x3 cd /tmp/B.gUuNec/BUILD/glm/build/test/core && /usr/bin/cmake -E cmake_link_script CMakeFiles/test-core_type_mat2x3.dir/link.txt --verbose=1 /usr/bin/x86_64-pld-linux-g++ -O2 -fwrapv -pipe -Wformat -Werror=format-security -gdwarf-4 -fno-debug-types-section -fvar-tracking-assignments -g2 -Wp,-D_FORTIFY_SOURCE=2 -fstack-protector-strong --param=ssp-buffer-size=4 -fPIC -march=x86-64 -gdwarf-4 -fno-debug-types-section -fvar-tracking-assignments -g2 -DNDEBUG -DQT_NO_DEBUG -Wl,--as-needed -Wl,--no-copy-dt-needed-entries -Wl,-z,relro -Wl,-z,combreloc -rdynamic CMakeFiles/test-core_type_mat2x3.dir/core_type_mat2x3.cpp.o -o test-core_type_mat2x3 make[2]: Leaving directory '/tmp/B.gUuNec/BUILD/glm/build' make[1]: Entering directory '/tmp/B.gUuNec/BUILD/glm/build' [ 10%] Built target test-core_type_mat2x3 make[1]: Leaving directory '/tmp/B.gUuNec/BUILD/glm/build' /usr/bin/make -f test/core/CMakeFiles/test-core_force_pure.dir/build.make test/core/CMakeFiles/test-core_force_pure.dir/depend make[2]: Entering directory '/tmp/B.gUuNec/BUILD/glm/build' [ 9%] Linking CXX executable test-core_type_mat4x3 cd /tmp/B.gUuNec/BUILD/glm/build/test/core && /usr/bin/cmake -E cmake_link_script CMakeFiles/test-core_type_mat4x3.dir/link.txt --verbose=1 /usr/bin/x86_64-pld-linux-g++ -O2 -fwrapv -pipe -Wformat -Werror=format-security -gdwarf-4 -fno-debug-types-section -fvar-tracking-assignments -g2 -Wp,-D_FORTIFY_SOURCE=2 -fstack-protector-strong --param=ssp-buffer-size=4 -fPIC -march=x86-64 -gdwarf-4 -fno-debug-types-section -fvar-tracking-assignments -g2 -DNDEBUG -DQT_NO_DEBUG -Wl,--as-needed -Wl,--no-copy-dt-needed-entries -Wl,-z,relro -Wl,-z,combreloc -rdynamic CMakeFiles/test-core_type_mat4x3.dir/core_type_mat4x3.cpp.o -o test-core_type_mat4x3 make[2]: Leaving directory '/tmp/B.gUuNec/BUILD/glm/build' make[2]: Entering directory '/tmp/B.gUuNec/BUILD/glm/build' cd /tmp/B.gUuNec/BUILD/glm/build && /usr/bin/cmake -E cmake_depends "Unix Makefiles" /tmp/B.gUuNec/BUILD/glm /tmp/B.gUuNec/BUILD/glm/test/core /tmp/B.gUuNec/BUILD/glm/build /tmp/B.gUuNec/BUILD/glm/build/test/core /tmp/B.gUuNec/BUILD/glm/build/test/core/CMakeFiles/test-core_force_pure.dir/DependInfo.cmake --color= Scanning dependencies of target test-core_force_pure make[2]: Leaving directory '/tmp/B.gUuNec/BUILD/glm/build' /usr/bin/make -f test/core/CMakeFiles/test-core_force_pure.dir/build.make test/core/CMakeFiles/test-core_force_pure.dir/build make[1]: Entering directory '/tmp/B.gUuNec/BUILD/glm/build' [ 10%] Built target test-core_type_mat4x3 make[1]: Leaving directory '/tmp/B.gUuNec/BUILD/glm/build' /usr/bin/make -f test/core/CMakeFiles/test-core_func_integer.dir/build.make test/core/CMakeFiles/test-core_func_integer.dir/depend make[2]: Entering directory '/tmp/B.gUuNec/BUILD/glm/build' [ 9%] Linking CXX executable test-core_type_mat2x4 cd /tmp/B.gUuNec/BUILD/glm/build/test/core && /usr/bin/cmake -E cmake_link_script CMakeFiles/test-core_type_mat2x4.dir/link.txt --verbose=1 /usr/bin/x86_64-pld-linux-g++ -O2 -fwrapv -pipe -Wformat -Werror=format-security -gdwarf-4 -fno-debug-types-section -fvar-tracking-assignments -g2 -Wp,-D_FORTIFY_SOURCE=2 -fstack-protector-strong --param=ssp-buffer-size=4 -fPIC -march=x86-64 -gdwarf-4 -fno-debug-types-section -fvar-tracking-assignments -g2 -DNDEBUG -DQT_NO_DEBUG -Wl,--as-needed -Wl,--no-copy-dt-needed-entries -Wl,-z,relro -Wl,-z,combreloc -rdynamic CMakeFiles/test-core_type_mat2x4.dir/core_type_mat2x4.cpp.o -o test-core_type_mat2x4 make[2]: Leaving directory '/tmp/B.gUuNec/BUILD/glm/build' make[1]: Entering directory '/tmp/B.gUuNec/BUILD/glm/build' [ 10%] Built target test-core_type_mat2x4 make[1]: Leaving directory '/tmp/B.gUuNec/BUILD/glm/build' /usr/bin/make -f test/core/CMakeFiles/test-core_func_exponential.dir/build.make test/core/CMakeFiles/test-core_func_exponential.dir/depend make[2]: Entering directory '/tmp/B.gUuNec/BUILD/glm/build' cd /tmp/B.gUuNec/BUILD/glm/build && /usr/bin/cmake -E cmake_depends "Unix Makefiles" /tmp/B.gUuNec/BUILD/glm /tmp/B.gUuNec/BUILD/glm/test/core /tmp/B.gUuNec/BUILD/glm/build /tmp/B.gUuNec/BUILD/glm/build/test/core /tmp/B.gUuNec/BUILD/glm/build/test/core/CMakeFiles/test-core_func_integer.dir/DependInfo.cmake --color= Scanning dependencies of target test-core_func_integer make[2]: Leaving directory '/tmp/B.gUuNec/BUILD/glm/build' /usr/bin/make -f test/core/CMakeFiles/test-core_func_integer.dir/build.make test/core/CMakeFiles/test-core_func_integer.dir/build make[2]: Entering directory '/tmp/B.gUuNec/BUILD/glm/build' cd /tmp/B.gUuNec/BUILD/glm/build && /usr/bin/cmake -E cmake_depends "Unix Makefiles" /tmp/B.gUuNec/BUILD/glm /tmp/B.gUuNec/BUILD/glm/test/core /tmp/B.gUuNec/BUILD/glm/build /tmp/B.gUuNec/BUILD/glm/build/test/core /tmp/B.gUuNec/BUILD/glm/build/test/core/CMakeFiles/test-core_func_exponential.dir/DependInfo.cmake --color= Scanning dependencies of target test-core_func_exponential make[2]: Leaving directory '/tmp/B.gUuNec/BUILD/glm/build' /usr/bin/make -f test/core/CMakeFiles/test-core_func_exponential.dir/build.make test/core/CMakeFiles/test-core_func_exponential.dir/build make[2]: Entering directory '/tmp/B.gUuNec/BUILD/glm/build' [ 7%] Building CXX object test/core/CMakeFiles/test-core_type_mat4x2.dir/core_type_mat4x2.cpp.o cd /tmp/B.gUuNec/BUILD/glm/build/test/core && /usr/bin/x86_64-pld-linux-g++ -I/tmp/B.gUuNec/BUILD/glm -O2 -fwrapv -pipe -Wformat -Werror=format-security -gdwarf-4 -fno-debug-types-section -fvar-tracking-assignments -g2 -Wp,-D_FORTIFY_SOURCE=2 -fstack-protector-strong --param=ssp-buffer-size=4 -fPIC -march=x86-64 -gdwarf-4 -fno-debug-types-section -fvar-tracking-assignments -g2 -DNDEBUG -DQT_NO_DEBUG -Wno-long-long -o CMakeFiles/test-core_type_mat4x2.dir/core_type_mat4x2.cpp.o -c /tmp/B.gUuNec/BUILD/glm/test/core/core_type_mat4x2.cpp make[2]: Leaving directory '/tmp/B.gUuNec/BUILD/glm/build' make[2]: Entering directory '/tmp/B.gUuNec/BUILD/glm/build' [ 11%] Linking CXX executable test-core_type_mat4x2 cd /tmp/B.gUuNec/BUILD/glm/build/test/core && /usr/bin/cmake -E cmake_link_script CMakeFiles/test-core_type_mat4x2.dir/link.txt --verbose=1 /usr/bin/x86_64-pld-linux-g++ -O2 -fwrapv -pipe -Wformat -Werror=format-security -gdwarf-4 -fno-debug-types-section -fvar-tracking-assignments -g2 -Wp,-D_FORTIFY_SOURCE=2 -fstack-protector-strong --param=ssp-buffer-size=4 -fPIC -march=x86-64 -gdwarf-4 -fno-debug-types-section -fvar-tracking-assignments -g2 -DNDEBUG -DQT_NO_DEBUG -Wl,--as-needed -Wl,--no-copy-dt-needed-entries -Wl,-z,relro -Wl,-z,combreloc -rdynamic CMakeFiles/test-core_type_mat4x2.dir/core_type_mat4x2.cpp.o -o test-core_type_mat4x2 make[2]: Leaving directory '/tmp/B.gUuNec/BUILD/glm/build' make[1]: Entering directory '/tmp/B.gUuNec/BUILD/glm/build' [ 11%] Built target test-core_type_mat4x2 make[1]: Leaving directory '/tmp/B.gUuNec/BUILD/glm/build' /usr/bin/make -f test/core/CMakeFiles/test-core_setup_precision.dir/build.make test/core/CMakeFiles/test-core_setup_precision.dir/depend make[2]: Entering directory '/tmp/B.gUuNec/BUILD/glm/build' cd /tmp/B.gUuNec/BUILD/glm/build && /usr/bin/cmake -E cmake_depends "Unix Makefiles" /tmp/B.gUuNec/BUILD/glm /tmp/B.gUuNec/BUILD/glm/test/core /tmp/B.gUuNec/BUILD/glm/build /tmp/B.gUuNec/BUILD/glm/build/test/core /tmp/B.gUuNec/BUILD/glm/build/test/core/CMakeFiles/test-core_setup_precision.dir/DependInfo.cmake --color= Scanning dependencies of target test-core_setup_precision make[2]: Leaving directory '/tmp/B.gUuNec/BUILD/glm/build' /usr/bin/make -f test/core/CMakeFiles/test-core_setup_precision.dir/build.make test/core/CMakeFiles/test-core_setup_precision.dir/build make[2]: Entering directory '/tmp/B.gUuNec/BUILD/glm/build' [ 10%] Building CXX object test/core/CMakeFiles/test-core_force_unrestricted_gentype.dir/core_force_unrestricted_gentype.cpp.o cd /tmp/B.gUuNec/BUILD/glm/build/test/core && /usr/bin/x86_64-pld-linux-g++ -I/tmp/B.gUuNec/BUILD/glm -O2 -fwrapv -pipe -Wformat -Werror=format-security -gdwarf-4 -fno-debug-types-section -fvar-tracking-assignments -g2 -Wp,-D_FORTIFY_SOURCE=2 -fstack-protector-strong --param=ssp-buffer-size=4 -fPIC -march=x86-64 -gdwarf-4 -fno-debug-types-section -fvar-tracking-assignments -g2 -DNDEBUG -DQT_NO_DEBUG -Wno-long-long -o CMakeFiles/test-core_force_unrestricted_gentype.dir/core_force_unrestricted_gentype.cpp.o -c /tmp/B.gUuNec/BUILD/glm/test/core/core_force_unrestricted_gentype.cpp make[2]: Leaving directory '/tmp/B.gUuNec/BUILD/glm/build' make[2]: Entering directory '/tmp/B.gUuNec/BUILD/glm/build' [ 8%] Building CXX object test/core/CMakeFiles/test-core_type_mat3x2.dir/core_type_mat3x2.cpp.o cd /tmp/B.gUuNec/BUILD/glm/build/test/core && /usr/bin/x86_64-pld-linux-g++ -I/tmp/B.gUuNec/BUILD/glm -O2 -fwrapv -pipe -Wformat -Werror=format-security -gdwarf-4 -fno-debug-types-section -fvar-tracking-assignments -g2 -Wp,-D_FORTIFY_SOURCE=2 -fstack-protector-strong --param=ssp-buffer-size=4 -fPIC -march=x86-64 -gdwarf-4 -fno-debug-types-section -fvar-tracking-assignments -g2 -DNDEBUG -DQT_NO_DEBUG -Wno-long-long -o CMakeFiles/test-core_type_mat3x2.dir/core_type_mat3x2.cpp.o -c /tmp/B.gUuNec/BUILD/glm/test/core/core_type_mat3x2.cpp make[2]: Leaving directory '/tmp/B.gUuNec/BUILD/glm/build' make[2]: Entering directory '/tmp/B.gUuNec/BUILD/glm/build' [ 11%] Linking CXX executable test-core_force_unrestricted_gentype cd /tmp/B.gUuNec/BUILD/glm/build/test/core && /usr/bin/cmake -E cmake_link_script CMakeFiles/test-core_force_unrestricted_gentype.dir/link.txt --verbose=1 /usr/bin/x86_64-pld-linux-g++ -O2 -fwrapv -pipe -Wformat -Werror=format-security -gdwarf-4 -fno-debug-types-section -fvar-tracking-assignments -g2 -Wp,-D_FORTIFY_SOURCE=2 -fstack-protector-strong --param=ssp-buffer-size=4 -fPIC -march=x86-64 -gdwarf-4 -fno-debug-types-section -fvar-tracking-assignments -g2 -DNDEBUG -DQT_NO_DEBUG -Wl,--as-needed -Wl,--no-copy-dt-needed-entries -Wl,-z,relro -Wl,-z,combreloc -rdynamic CMakeFiles/test-core_force_unrestricted_gentype.dir/core_force_unrestricted_gentype.cpp.o -o test-core_force_unrestricted_gentype make[2]: Leaving directory '/tmp/B.gUuNec/BUILD/glm/build' make[1]: Entering directory '/tmp/B.gUuNec/BUILD/glm/build' [ 12%] Built target test-core_force_unrestricted_gentype make[1]: Leaving directory '/tmp/B.gUuNec/BUILD/glm/build' /usr/bin/make -f test/core/CMakeFiles/test-core_type_int.dir/build.make test/core/CMakeFiles/test-core_type_int.dir/depend make[2]: Entering directory '/tmp/B.gUuNec/BUILD/glm/build' [ 12%] Linking CXX executable test-core_type_mat3x2 cd /tmp/B.gUuNec/BUILD/glm/build/test/core && /usr/bin/cmake -E cmake_link_script CMakeFiles/test-core_type_mat3x2.dir/link.txt --verbose=1 /usr/bin/x86_64-pld-linux-g++ -O2 -fwrapv -pipe -Wformat -Werror=format-security -gdwarf-4 -fno-debug-types-section -fvar-tracking-assignments -g2 -Wp,-D_FORTIFY_SOURCE=2 -fstack-protector-strong --param=ssp-buffer-size=4 -fPIC -march=x86-64 -gdwarf-4 -fno-debug-types-section -fvar-tracking-assignments -g2 -DNDEBUG -DQT_NO_DEBUG -Wl,--as-needed -Wl,--no-copy-dt-needed-entries -Wl,-z,relro -Wl,-z,combreloc -rdynamic CMakeFiles/test-core_type_mat3x2.dir/core_type_mat3x2.cpp.o -o test-core_type_mat3x2 make[2]: Leaving directory '/tmp/B.gUuNec/BUILD/glm/build' make[1]: Entering directory '/tmp/B.gUuNec/BUILD/glm/build' [ 12%] Built target test-core_type_mat3x2 make[1]: Leaving directory '/tmp/B.gUuNec/BUILD/glm/build' /usr/bin/make -f test/core/CMakeFiles/test-core_type_aligned.dir/build.make test/core/CMakeFiles/test-core_type_aligned.dir/depend make[2]: Entering directory '/tmp/B.gUuNec/BUILD/glm/build' cd /tmp/B.gUuNec/BUILD/glm/build && /usr/bin/cmake -E cmake_depends "Unix Makefiles" /tmp/B.gUuNec/BUILD/glm /tmp/B.gUuNec/BUILD/glm/test/core /tmp/B.gUuNec/BUILD/glm/build /tmp/B.gUuNec/BUILD/glm/build/test/core /tmp/B.gUuNec/BUILD/glm/build/test/core/CMakeFiles/test-core_type_int.dir/DependInfo.cmake --color= Scanning dependencies of target test-core_type_int make[2]: Leaving directory '/tmp/B.gUuNec/BUILD/glm/build' /usr/bin/make -f test/core/CMakeFiles/test-core_type_int.dir/build.make test/core/CMakeFiles/test-core_type_int.dir/build make[2]: Entering directory '/tmp/B.gUuNec/BUILD/glm/build' cd /tmp/B.gUuNec/BUILD/glm/build && /usr/bin/cmake -E cmake_depends "Unix Makefiles" /tmp/B.gUuNec/BUILD/glm /tmp/B.gUuNec/BUILD/glm/test/core /tmp/B.gUuNec/BUILD/glm/build /tmp/B.gUuNec/BUILD/glm/build/test/core /tmp/B.gUuNec/BUILD/glm/build/test/core/CMakeFiles/test-core_type_aligned.dir/DependInfo.cmake --color= Scanning dependencies of target test-core_type_aligned make[2]: Leaving directory '/tmp/B.gUuNec/BUILD/glm/build' /usr/bin/make -f test/core/CMakeFiles/test-core_type_aligned.dir/build.make test/core/CMakeFiles/test-core_type_aligned.dir/build make[2]: Entering directory '/tmp/B.gUuNec/BUILD/glm/build' [ 11%] Building CXX object test/core/CMakeFiles/test-core_func_exponential.dir/core_func_exponential.cpp.o cd /tmp/B.gUuNec/BUILD/glm/build/test/core && /usr/bin/x86_64-pld-linux-g++ -I/tmp/B.gUuNec/BUILD/glm -O2 -fwrapv -pipe -Wformat -Werror=format-security -gdwarf-4 -fno-debug-types-section -fvar-tracking-assignments -g2 -Wp,-D_FORTIFY_SOURCE=2 -fstack-protector-strong --param=ssp-buffer-size=4 -fPIC -march=x86-64 -gdwarf-4 -fno-debug-types-section -fvar-tracking-assignments -g2 -DNDEBUG -DQT_NO_DEBUG -Wno-long-long -o CMakeFiles/test-core_func_exponential.dir/core_func_exponential.cpp.o -c /tmp/B.gUuNec/BUILD/glm/test/core/core_func_exponential.cpp make[2]: Leaving directory '/tmp/B.gUuNec/BUILD/glm/build' make[2]: Entering directory '/tmp/B.gUuNec/BUILD/glm/build' [ 9%] Building CXX object test/core/CMakeFiles/test-core_type_mat3x4.dir/core_type_mat3x4.cpp.o cd /tmp/B.gUuNec/BUILD/glm/build/test/core && /usr/bin/x86_64-pld-linux-g++ -I/tmp/B.gUuNec/BUILD/glm -O2 -fwrapv -pipe -Wformat -Werror=format-security -gdwarf-4 -fno-debug-types-section -fvar-tracking-assignments -g2 -Wp,-D_FORTIFY_SOURCE=2 -fstack-protector-strong --param=ssp-buffer-size=4 -fPIC -march=x86-64 -gdwarf-4 -fno-debug-types-section -fvar-tracking-assignments -g2 -DNDEBUG -DQT_NO_DEBUG -Wno-long-long -o CMakeFiles/test-core_type_mat3x4.dir/core_type_mat3x4.cpp.o -c /tmp/B.gUuNec/BUILD/glm/test/core/core_type_mat3x4.cpp make[2]: Leaving directory '/tmp/B.gUuNec/BUILD/glm/build' make[2]: Entering directory '/tmp/B.gUuNec/BUILD/glm/build' [ 13%] Linking CXX executable test-core_func_exponential cd /tmp/B.gUuNec/BUILD/glm/build/test/core && /usr/bin/cmake -E cmake_link_script CMakeFiles/test-core_func_exponential.dir/link.txt --verbose=1 /usr/bin/x86_64-pld-linux-g++ -O2 -fwrapv -pipe -Wformat -Werror=format-security -gdwarf-4 -fno-debug-types-section -fvar-tracking-assignments -g2 -Wp,-D_FORTIFY_SOURCE=2 -fstack-protector-strong --param=ssp-buffer-size=4 -fPIC -march=x86-64 -gdwarf-4 -fno-debug-types-section -fvar-tracking-assignments -g2 -DNDEBUG -DQT_NO_DEBUG -Wl,--as-needed -Wl,--no-copy-dt-needed-entries -Wl,-z,relro -Wl,-z,combreloc -rdynamic CMakeFiles/test-core_func_exponential.dir/core_func_exponential.cpp.o -o test-core_func_exponential make[2]: Leaving directory '/tmp/B.gUuNec/BUILD/glm/build' make[2]: Entering directory '/tmp/B.gUuNec/BUILD/glm/build' [ 14%] Linking CXX executable test-core_type_mat3x4 cd /tmp/B.gUuNec/BUILD/glm/build/test/core && /usr/bin/cmake -E cmake_link_script CMakeFiles/test-core_type_mat3x4.dir/link.txt --verbose=1 /usr/bin/x86_64-pld-linux-g++ -O2 -fwrapv -pipe -Wformat -Werror=format-security -gdwarf-4 -fno-debug-types-section -fvar-tracking-assignments -g2 -Wp,-D_FORTIFY_SOURCE=2 -fstack-protector-strong --param=ssp-buffer-size=4 -fPIC -march=x86-64 -gdwarf-4 -fno-debug-types-section -fvar-tracking-assignments -g2 -DNDEBUG -DQT_NO_DEBUG -Wl,--as-needed -Wl,--no-copy-dt-needed-entries -Wl,-z,relro -Wl,-z,combreloc -rdynamic CMakeFiles/test-core_type_mat3x4.dir/core_type_mat3x4.cpp.o -o test-core_type_mat3x4 make[2]: Leaving directory '/tmp/B.gUuNec/BUILD/glm/build' make[1]: Entering directory '/tmp/B.gUuNec/BUILD/glm/build' [ 14%] Built target test-core_type_mat3x4 make[1]: Leaving directory '/tmp/B.gUuNec/BUILD/glm/build' /usr/bin/make -f test/core/CMakeFiles/test-core_type_mat4x4.dir/build.make test/core/CMakeFiles/test-core_type_mat4x4.dir/depend make[1]: Entering directory '/tmp/B.gUuNec/BUILD/glm/build' [ 14%] Built target test-core_func_exponential make[1]: Leaving directory '/tmp/B.gUuNec/BUILD/glm/build' /usr/bin/make -f test/core/CMakeFiles/test-core_func_integer_bit_count.dir/build.make test/core/CMakeFiles/test-core_func_integer_bit_count.dir/depend make[2]: Entering directory '/tmp/B.gUuNec/BUILD/glm/build' cd /tmp/B.gUuNec/BUILD/glm/build && /usr/bin/cmake -E cmake_depends "Unix Makefiles" /tmp/B.gUuNec/BUILD/glm /tmp/B.gUuNec/BUILD/glm/test/core /tmp/B.gUuNec/BUILD/glm/build /tmp/B.gUuNec/BUILD/glm/build/test/core /tmp/B.gUuNec/BUILD/glm/build/test/core/CMakeFiles/test-core_func_integer_bit_count.dir/DependInfo.cmake --color= Scanning dependencies of target test-core_func_integer_bit_count make[2]: Leaving directory '/tmp/B.gUuNec/BUILD/glm/build' /usr/bin/make -f test/core/CMakeFiles/test-core_func_integer_bit_count.dir/build.make test/core/CMakeFiles/test-core_func_integer_bit_count.dir/build make[2]: Entering directory '/tmp/B.gUuNec/BUILD/glm/build' cd /tmp/B.gUuNec/BUILD/glm/build && /usr/bin/cmake -E cmake_depends "Unix Makefiles" /tmp/B.gUuNec/BUILD/glm /tmp/B.gUuNec/BUILD/glm/test/core /tmp/B.gUuNec/BUILD/glm/build /tmp/B.gUuNec/BUILD/glm/build/test/core /tmp/B.gUuNec/BUILD/glm/build/test/core/CMakeFiles/test-core_type_mat4x4.dir/DependInfo.cmake --color= Scanning dependencies of target test-core_type_mat4x4 make[2]: Leaving directory '/tmp/B.gUuNec/BUILD/glm/build' /usr/bin/make -f test/core/CMakeFiles/test-core_type_mat4x4.dir/build.make test/core/CMakeFiles/test-core_type_mat4x4.dir/build make[2]: Entering directory '/tmp/B.gUuNec/BUILD/glm/build' [ 14%] Building CXX object test/core/CMakeFiles/test-core_func_integer_bit_count.dir/core_func_integer_bit_count.cpp.o cd /tmp/B.gUuNec/BUILD/glm/build/test/core && /usr/bin/x86_64-pld-linux-g++ -I/tmp/B.gUuNec/BUILD/glm -O2 -fwrapv -pipe -Wformat -Werror=format-security -gdwarf-4 -fno-debug-types-section -fvar-tracking-assignments -g2 -Wp,-D_FORTIFY_SOURCE=2 -fstack-protector-strong --param=ssp-buffer-size=4 -fPIC -march=x86-64 -gdwarf-4 -fno-debug-types-section -fvar-tracking-assignments -g2 -DNDEBUG -DQT_NO_DEBUG -Wno-long-long -o CMakeFiles/test-core_func_integer_bit_count.dir/core_func_integer_bit_count.cpp.o -c /tmp/B.gUuNec/BUILD/glm/test/core/core_func_integer_bit_count.cpp make[2]: Leaving directory '/tmp/B.gUuNec/BUILD/glm/build' make[2]: Entering directory '/tmp/B.gUuNec/BUILD/glm/build' [ 15%] Linking CXX executable test-core_func_integer_bit_count cd /tmp/B.gUuNec/BUILD/glm/build/test/core && /usr/bin/cmake -E cmake_link_script CMakeFiles/test-core_func_integer_bit_count.dir/link.txt --verbose=1 /usr/bin/x86_64-pld-linux-g++ -O2 -fwrapv -pipe -Wformat -Werror=format-security -gdwarf-4 -fno-debug-types-section -fvar-tracking-assignments -g2 -Wp,-D_FORTIFY_SOURCE=2 -fstack-protector-strong --param=ssp-buffer-size=4 -fPIC -march=x86-64 -gdwarf-4 -fno-debug-types-section -fvar-tracking-assignments -g2 -DNDEBUG -DQT_NO_DEBUG -Wl,--as-needed -Wl,--no-copy-dt-needed-entries -Wl,-z,relro -Wl,-z,combreloc -rdynamic CMakeFiles/test-core_func_integer_bit_count.dir/core_func_integer_bit_count.cpp.o -o test-core_func_integer_bit_count make[2]: Leaving directory '/tmp/B.gUuNec/BUILD/glm/build' make[1]: Entering directory '/tmp/B.gUuNec/BUILD/glm/build' [ 15%] Built target test-core_func_integer_bit_count make[1]: Leaving directory '/tmp/B.gUuNec/BUILD/glm/build' /usr/bin/make -f test/core/CMakeFiles/test-core_type_float.dir/build.make test/core/CMakeFiles/test-core_type_float.dir/depend make[2]: Entering directory '/tmp/B.gUuNec/BUILD/glm/build' [ 11%] Building CXX object test/core/CMakeFiles/test-core_setup_precision.dir/core_setup_precision.cpp.o cd /tmp/B.gUuNec/BUILD/glm/build/test/core && /usr/bin/x86_64-pld-linux-g++ -I/tmp/B.gUuNec/BUILD/glm -O2 -fwrapv -pipe -Wformat -Werror=format-security -gdwarf-4 -fno-debug-types-section -fvar-tracking-assignments -g2 -Wp,-D_FORTIFY_SOURCE=2 -fstack-protector-strong --param=ssp-buffer-size=4 -fPIC -march=x86-64 -gdwarf-4 -fno-debug-types-section -fvar-tracking-assignments -g2 -DNDEBUG -DQT_NO_DEBUG -Wno-long-long -o CMakeFiles/test-core_setup_precision.dir/core_setup_precision.cpp.o -c /tmp/B.gUuNec/BUILD/glm/test/core/core_setup_precision.cpp make[2]: Leaving directory '/tmp/B.gUuNec/BUILD/glm/build' make[2]: Entering directory '/tmp/B.gUuNec/BUILD/glm/build' cd /tmp/B.gUuNec/BUILD/glm/build && /usr/bin/cmake -E cmake_depends "Unix Makefiles" /tmp/B.gUuNec/BUILD/glm /tmp/B.gUuNec/BUILD/glm/test/core /tmp/B.gUuNec/BUILD/glm/build /tmp/B.gUuNec/BUILD/glm/build/test/core /tmp/B.gUuNec/BUILD/glm/build/test/core/CMakeFiles/test-core_type_float.dir/DependInfo.cmake --color= Scanning dependencies of target test-core_type_float make[2]: Leaving directory '/tmp/B.gUuNec/BUILD/glm/build' /usr/bin/make -f test/core/CMakeFiles/test-core_type_float.dir/build.make test/core/CMakeFiles/test-core_type_float.dir/build make[2]: Entering directory '/tmp/B.gUuNec/BUILD/glm/build' [ 13%] Building CXX object test/core/CMakeFiles/test-core_type_aligned.dir/core_type_aligned.cpp.o cd /tmp/B.gUuNec/BUILD/glm/build/test/core && /usr/bin/x86_64-pld-linux-g++ -I/tmp/B.gUuNec/BUILD/glm -O2 -fwrapv -pipe -Wformat -Werror=format-security -gdwarf-4 -fno-debug-types-section -fvar-tracking-assignments -g2 -Wp,-D_FORTIFY_SOURCE=2 -fstack-protector-strong --param=ssp-buffer-size=4 -fPIC -march=x86-64 -gdwarf-4 -fno-debug-types-section -fvar-tracking-assignments -g2 -DNDEBUG -DQT_NO_DEBUG -Wno-long-long -o CMakeFiles/test-core_type_aligned.dir/core_type_aligned.cpp.o -c /tmp/B.gUuNec/BUILD/glm/test/core/core_type_aligned.cpp make[2]: Leaving directory '/tmp/B.gUuNec/BUILD/glm/build' make[2]: Entering directory '/tmp/B.gUuNec/BUILD/glm/build' [ 15%] Linking CXX executable test-core_type_aligned cd /tmp/B.gUuNec/BUILD/glm/build/test/core && /usr/bin/cmake -E cmake_link_script CMakeFiles/test-core_type_aligned.dir/link.txt --verbose=1 /usr/bin/x86_64-pld-linux-g++ -O2 -fwrapv -pipe -Wformat -Werror=format-security -gdwarf-4 -fno-debug-types-section -fvar-tracking-assignments -g2 -Wp,-D_FORTIFY_SOURCE=2 -fstack-protector-strong --param=ssp-buffer-size=4 -fPIC -march=x86-64 -gdwarf-4 -fno-debug-types-section -fvar-tracking-assignments -g2 -DNDEBUG -DQT_NO_DEBUG -Wl,--as-needed -Wl,--no-copy-dt-needed-entries -Wl,-z,relro -Wl,-z,combreloc -rdynamic CMakeFiles/test-core_type_aligned.dir/core_type_aligned.cpp.o -o test-core_type_aligned make[2]: Leaving directory '/tmp/B.gUuNec/BUILD/glm/build' make[1]: Entering directory '/tmp/B.gUuNec/BUILD/glm/build' [ 15%] Built target test-core_type_aligned make[1]: Leaving directory '/tmp/B.gUuNec/BUILD/glm/build' /usr/bin/make -f test/core/CMakeFiles/test-core_type_vec4.dir/build.make test/core/CMakeFiles/test-core_type_vec4.dir/depend make[2]: Entering directory '/tmp/B.gUuNec/BUILD/glm/build' [ 15%] Linking CXX executable test-core_setup_precision cd /tmp/B.gUuNec/BUILD/glm/build/test/core && /usr/bin/cmake -E cmake_link_script CMakeFiles/test-core_setup_precision.dir/link.txt --verbose=1 /usr/bin/x86_64-pld-linux-g++ -O2 -fwrapv -pipe -Wformat -Werror=format-security -gdwarf-4 -fno-debug-types-section -fvar-tracking-assignments -g2 -Wp,-D_FORTIFY_SOURCE=2 -fstack-protector-strong --param=ssp-buffer-size=4 -fPIC -march=x86-64 -gdwarf-4 -fno-debug-types-section -fvar-tracking-assignments -g2 -DNDEBUG -DQT_NO_DEBUG -Wl,--as-needed -Wl,--no-copy-dt-needed-entries -Wl,-z,relro -Wl,-z,combreloc -rdynamic CMakeFiles/test-core_setup_precision.dir/core_setup_precision.cpp.o -o test-core_setup_precision make[2]: Leaving directory '/tmp/B.gUuNec/BUILD/glm/build' make[1]: Entering directory '/tmp/B.gUuNec/BUILD/glm/build' [ 15%] Built target test-core_setup_precision make[1]: Leaving directory '/tmp/B.gUuNec/BUILD/glm/build' /usr/bin/make -f test/core/CMakeFiles/test-core_type_vec1.dir/build.make test/core/CMakeFiles/test-core_type_vec1.dir/depend make[2]: Entering directory '/tmp/B.gUuNec/BUILD/glm/build' cd /tmp/B.gUuNec/BUILD/glm/build && /usr/bin/cmake -E cmake_depends "Unix Makefiles" /tmp/B.gUuNec/BUILD/glm /tmp/B.gUuNec/BUILD/glm/test/core /tmp/B.gUuNec/BUILD/glm/build /tmp/B.gUuNec/BUILD/glm/build/test/core /tmp/B.gUuNec/BUILD/glm/build/test/core/CMakeFiles/test-core_type_vec4.dir/DependInfo.cmake --color= Scanning dependencies of target test-core_type_vec4 make[2]: Leaving directory '/tmp/B.gUuNec/BUILD/glm/build' /usr/bin/make -f test/core/CMakeFiles/test-core_type_vec4.dir/build.make test/core/CMakeFiles/test-core_type_vec4.dir/build make[2]: Entering directory '/tmp/B.gUuNec/BUILD/glm/build' [ 13%] Building CXX object test/core/CMakeFiles/test-core_type_int.dir/core_type_int.cpp.o cd /tmp/B.gUuNec/BUILD/glm/build/test/core && /usr/bin/x86_64-pld-linux-g++ -I/tmp/B.gUuNec/BUILD/glm -O2 -fwrapv -pipe -Wformat -Werror=format-security -gdwarf-4 -fno-debug-types-section -fvar-tracking-assignments -g2 -Wp,-D_FORTIFY_SOURCE=2 -fstack-protector-strong --param=ssp-buffer-size=4 -fPIC -march=x86-64 -gdwarf-4 -fno-debug-types-section -fvar-tracking-assignments -g2 -DNDEBUG -DQT_NO_DEBUG -Wno-long-long -o CMakeFiles/test-core_type_int.dir/core_type_int.cpp.o -c /tmp/B.gUuNec/BUILD/glm/test/core/core_type_int.cpp make[2]: Leaving directory '/tmp/B.gUuNec/BUILD/glm/build' make[2]: Entering directory '/tmp/B.gUuNec/BUILD/glm/build' cd /tmp/B.gUuNec/BUILD/glm/build && /usr/bin/cmake -E cmake_depends "Unix Makefiles" /tmp/B.gUuNec/BUILD/glm /tmp/B.gUuNec/BUILD/glm/test/core /tmp/B.gUuNec/BUILD/glm/build /tmp/B.gUuNec/BUILD/glm/build/test/core /tmp/B.gUuNec/BUILD/glm/build/test/core/CMakeFiles/test-core_type_vec1.dir/DependInfo.cmake --color= Scanning dependencies of target test-core_type_vec1 make[2]: Leaving directory '/tmp/B.gUuNec/BUILD/glm/build' /usr/bin/make -f test/core/CMakeFiles/test-core_type_vec1.dir/build.make test/core/CMakeFiles/test-core_type_vec1.dir/build make[2]: Entering directory '/tmp/B.gUuNec/BUILD/glm/build' [ 16%] Linking CXX executable test-core_type_int cd /tmp/B.gUuNec/BUILD/glm/build/test/core && /usr/bin/cmake -E cmake_link_script CMakeFiles/test-core_type_int.dir/link.txt --verbose=1 /usr/bin/x86_64-pld-linux-g++ -O2 -fwrapv -pipe -Wformat -Werror=format-security -gdwarf-4 -fno-debug-types-section -fvar-tracking-assignments -g2 -Wp,-D_FORTIFY_SOURCE=2 -fstack-protector-strong --param=ssp-buffer-size=4 -fPIC -march=x86-64 -gdwarf-4 -fno-debug-types-section -fvar-tracking-assignments -g2 -DNDEBUG -DQT_NO_DEBUG -Wl,--as-needed -Wl,--no-copy-dt-needed-entries -Wl,-z,relro -Wl,-z,combreloc -rdynamic CMakeFiles/test-core_type_int.dir/core_type_int.cpp.o -o test-core_type_int make[2]: Leaving directory '/tmp/B.gUuNec/BUILD/glm/build' make[1]: Entering directory '/tmp/B.gUuNec/BUILD/glm/build' [ 16%] Built target test-core_type_int make[1]: Leaving directory '/tmp/B.gUuNec/BUILD/glm/build' /usr/bin/make -f test/core/CMakeFiles/test-core_func_geometric.dir/build.make test/core/CMakeFiles/test-core_func_geometric.dir/depend make[2]: Entering directory '/tmp/B.gUuNec/BUILD/glm/build' cd /tmp/B.gUuNec/BUILD/glm/build && /usr/bin/cmake -E cmake_depends "Unix Makefiles" /tmp/B.gUuNec/BUILD/glm /tmp/B.gUuNec/BUILD/glm/test/core /tmp/B.gUuNec/BUILD/glm/build /tmp/B.gUuNec/BUILD/glm/build/test/core /tmp/B.gUuNec/BUILD/glm/build/test/core/CMakeFiles/test-core_func_geometric.dir/DependInfo.cmake --color= Scanning dependencies of target test-core_func_geometric make[2]: Leaving directory '/tmp/B.gUuNec/BUILD/glm/build' /usr/bin/make -f test/core/CMakeFiles/test-core_func_geometric.dir/build.make test/core/CMakeFiles/test-core_func_geometric.dir/build make[2]: Entering directory '/tmp/B.gUuNec/BUILD/glm/build' [ 16%] Building CXX object test/core/CMakeFiles/test-core_type_vec1.dir/core_type_vec1.cpp.o cd /tmp/B.gUuNec/BUILD/glm/build/test/core && /usr/bin/x86_64-pld-linux-g++ -I/tmp/B.gUuNec/BUILD/glm -O2 -fwrapv -pipe -Wformat -Werror=format-security -gdwarf-4 -fno-debug-types-section -fvar-tracking-assignments -g2 -Wp,-D_FORTIFY_SOURCE=2 -fstack-protector-strong --param=ssp-buffer-size=4 -fPIC -march=x86-64 -gdwarf-4 -fno-debug-types-section -fvar-tracking-assignments -g2 -DNDEBUG -DQT_NO_DEBUG -Wno-long-long -o CMakeFiles/test-core_type_vec1.dir/core_type_vec1.cpp.o -c /tmp/B.gUuNec/BUILD/glm/test/core/core_type_vec1.cpp make[2]: Leaving directory '/tmp/B.gUuNec/BUILD/glm/build' make[2]: Entering directory '/tmp/B.gUuNec/BUILD/glm/build' [ 10%] Building CXX object test/core/CMakeFiles/test-core_func_integer.dir/core_func_integer.cpp.o cd /tmp/B.gUuNec/BUILD/glm/build/test/core && /usr/bin/x86_64-pld-linux-g++ -I/tmp/B.gUuNec/BUILD/glm -O2 -fwrapv -pipe -Wformat -Werror=format-security -gdwarf-4 -fno-debug-types-section -fvar-tracking-assignments -g2 -Wp,-D_FORTIFY_SOURCE=2 -fstack-protector-strong --param=ssp-buffer-size=4 -fPIC -march=x86-64 -gdwarf-4 -fno-debug-types-section -fvar-tracking-assignments -g2 -DNDEBUG -DQT_NO_DEBUG -Wno-long-long -o CMakeFiles/test-core_func_integer.dir/core_func_integer.cpp.o -c /tmp/B.gUuNec/BUILD/glm/test/core/core_func_integer.cpp make[2]: Leaving directory '/tmp/B.gUuNec/BUILD/glm/build' make[2]: Entering directory '/tmp/B.gUuNec/BUILD/glm/build' [ 17%] Linking CXX executable test-core_type_vec1 cd /tmp/B.gUuNec/BUILD/glm/build/test/core && /usr/bin/cmake -E cmake_link_script CMakeFiles/test-core_type_vec1.dir/link.txt --verbose=1 /usr/bin/x86_64-pld-linux-g++ -O2 -fwrapv -pipe -Wformat -Werror=format-security -gdwarf-4 -fno-debug-types-section -fvar-tracking-assignments -g2 -Wp,-D_FORTIFY_SOURCE=2 -fstack-protector-strong --param=ssp-buffer-size=4 -fPIC -march=x86-64 -gdwarf-4 -fno-debug-types-section -fvar-tracking-assignments -g2 -DNDEBUG -DQT_NO_DEBUG -Wl,--as-needed -Wl,--no-copy-dt-needed-entries -Wl,-z,relro -Wl,-z,combreloc -rdynamic CMakeFiles/test-core_type_vec1.dir/core_type_vec1.cpp.o -o test-core_type_vec1 make[2]: Leaving directory '/tmp/B.gUuNec/BUILD/glm/build' make[2]: Entering directory '/tmp/B.gUuNec/BUILD/glm/build' [ 18%] Linking CXX executable test-core_func_integer cd /tmp/B.gUuNec/BUILD/glm/build/test/core && /usr/bin/cmake -E cmake_link_script CMakeFiles/test-core_func_integer.dir/link.txt --verbose=1 /usr/bin/x86_64-pld-linux-g++ -O2 -fwrapv -pipe -Wformat -Werror=format-security -gdwarf-4 -fno-debug-types-section -fvar-tracking-assignments -g2 -Wp,-D_FORTIFY_SOURCE=2 -fstack-protector-strong --param=ssp-buffer-size=4 -fPIC -march=x86-64 -gdwarf-4 -fno-debug-types-section -fvar-tracking-assignments -g2 -DNDEBUG -DQT_NO_DEBUG -Wl,--as-needed -Wl,--no-copy-dt-needed-entries -Wl,-z,relro -Wl,-z,combreloc -rdynamic CMakeFiles/test-core_func_integer.dir/core_func_integer.cpp.o -o test-core_func_integer make[2]: Leaving directory '/tmp/B.gUuNec/BUILD/glm/build' make[1]: Entering directory '/tmp/B.gUuNec/BUILD/glm/build' [ 18%] Built target test-core_type_vec1 make[1]: Leaving directory '/tmp/B.gUuNec/BUILD/glm/build' /usr/bin/make -f test/core/CMakeFiles/test-core_type_vec2.dir/build.make test/core/CMakeFiles/test-core_type_vec2.dir/depend make[1]: Entering directory '/tmp/B.gUuNec/BUILD/glm/build' [ 18%] Built target test-core_func_integer make[1]: Leaving directory '/tmp/B.gUuNec/BUILD/glm/build' /usr/bin/make -f test/core/CMakeFiles/test-core_setup_force_cxx98.dir/build.make test/core/CMakeFiles/test-core_setup_force_cxx98.dir/depend make[2]: Entering directory '/tmp/B.gUuNec/BUILD/glm/build' cd /tmp/B.gUuNec/BUILD/glm/build && /usr/bin/cmake -E cmake_depends "Unix Makefiles" /tmp/B.gUuNec/BUILD/glm /tmp/B.gUuNec/BUILD/glm/test/core /tmp/B.gUuNec/BUILD/glm/build /tmp/B.gUuNec/BUILD/glm/build/test/core /tmp/B.gUuNec/BUILD/glm/build/test/core/CMakeFiles/test-core_type_vec2.dir/DependInfo.cmake --color= Scanning dependencies of target test-core_type_vec2 make[2]: Leaving directory '/tmp/B.gUuNec/BUILD/glm/build' /usr/bin/make -f test/core/CMakeFiles/test-core_type_vec2.dir/build.make test/core/CMakeFiles/test-core_type_vec2.dir/build make[2]: Entering directory '/tmp/B.gUuNec/BUILD/glm/build' [ 15%] Building CXX object test/core/CMakeFiles/test-core_type_float.dir/core_type_float.cpp.o cd /tmp/B.gUuNec/BUILD/glm/build/test/core && /usr/bin/x86_64-pld-linux-g++ -I/tmp/B.gUuNec/BUILD/glm -O2 -fwrapv -pipe -Wformat -Werror=format-security -gdwarf-4 -fno-debug-types-section -fvar-tracking-assignments -g2 -Wp,-D_FORTIFY_SOURCE=2 -fstack-protector-strong --param=ssp-buffer-size=4 -fPIC -march=x86-64 -gdwarf-4 -fno-debug-types-section -fvar-tracking-assignments -g2 -DNDEBUG -DQT_NO_DEBUG -Wno-long-long -o CMakeFiles/test-core_type_float.dir/core_type_float.cpp.o -c /tmp/B.gUuNec/BUILD/glm/test/core/core_type_float.cpp make[2]: Leaving directory '/tmp/B.gUuNec/BUILD/glm/build' make[2]: Entering directory '/tmp/B.gUuNec/BUILD/glm/build' cd /tmp/B.gUuNec/BUILD/glm/build && /usr/bin/cmake -E cmake_depends "Unix Makefiles" /tmp/B.gUuNec/BUILD/glm /tmp/B.gUuNec/BUILD/glm/test/core /tmp/B.gUuNec/BUILD/glm/build /tmp/B.gUuNec/BUILD/glm/build/test/core /tmp/B.gUuNec/BUILD/glm/build/test/core/CMakeFiles/test-core_setup_force_cxx98.dir/DependInfo.cmake --color= Scanning dependencies of target test-core_setup_force_cxx98 make[2]: Leaving directory '/tmp/B.gUuNec/BUILD/glm/build' /usr/bin/make -f test/core/CMakeFiles/test-core_setup_force_cxx98.dir/build.make test/core/CMakeFiles/test-core_setup_force_cxx98.dir/build make[2]: Entering directory '/tmp/B.gUuNec/BUILD/glm/build' [ 20%] Linking CXX executable test-core_type_float cd /tmp/B.gUuNec/BUILD/glm/build/test/core && /usr/bin/cmake -E cmake_link_script CMakeFiles/test-core_type_float.dir/link.txt --verbose=1 /usr/bin/x86_64-pld-linux-g++ -O2 -fwrapv -pipe -Wformat -Werror=format-security -gdwarf-4 -fno-debug-types-section -fvar-tracking-assignments -g2 -Wp,-D_FORTIFY_SOURCE=2 -fstack-protector-strong --param=ssp-buffer-size=4 -fPIC -march=x86-64 -gdwarf-4 -fno-debug-types-section -fvar-tracking-assignments -g2 -DNDEBUG -DQT_NO_DEBUG -Wl,--as-needed -Wl,--no-copy-dt-needed-entries -Wl,-z,relro -Wl,-z,combreloc -rdynamic CMakeFiles/test-core_type_float.dir/core_type_float.cpp.o -o test-core_type_float make[2]: Leaving directory '/tmp/B.gUuNec/BUILD/glm/build' make[1]: Entering directory '/tmp/B.gUuNec/BUILD/glm/build' [ 20%] Built target test-core_type_float make[1]: Leaving directory '/tmp/B.gUuNec/BUILD/glm/build' /usr/bin/make -f test/core/CMakeFiles/test-core_func_common.dir/build.make test/core/CMakeFiles/test-core_func_common.dir/depend make[2]: Entering directory '/tmp/B.gUuNec/BUILD/glm/build' cd /tmp/B.gUuNec/BUILD/glm/build && /usr/bin/cmake -E cmake_depends "Unix Makefiles" /tmp/B.gUuNec/BUILD/glm /tmp/B.gUuNec/BUILD/glm/test/core /tmp/B.gUuNec/BUILD/glm/build /tmp/B.gUuNec/BUILD/glm/build/test/core /tmp/B.gUuNec/BUILD/glm/build/test/core/CMakeFiles/test-core_func_common.dir/DependInfo.cmake --color= Scanning dependencies of target test-core_func_common make[2]: Leaving directory '/tmp/B.gUuNec/BUILD/glm/build' /usr/bin/make -f test/core/CMakeFiles/test-core_func_common.dir/build.make test/core/CMakeFiles/test-core_func_common.dir/build make[2]: Entering directory '/tmp/B.gUuNec/BUILD/glm/build' [ 19%] Building CXX object test/core/CMakeFiles/test-core_setup_force_cxx98.dir/core_setup_force_cxx98.cpp.o cd /tmp/B.gUuNec/BUILD/glm/build/test/core && /usr/bin/x86_64-pld-linux-g++ -I/tmp/B.gUuNec/BUILD/glm -O2 -fwrapv -pipe -Wformat -Werror=format-security -gdwarf-4 -fno-debug-types-section -fvar-tracking-assignments -g2 -Wp,-D_FORTIFY_SOURCE=2 -fstack-protector-strong --param=ssp-buffer-size=4 -fPIC -march=x86-64 -gdwarf-4 -fno-debug-types-section -fvar-tracking-assignments -g2 -DNDEBUG -DQT_NO_DEBUG -Wno-long-long -o CMakeFiles/test-core_setup_force_cxx98.dir/core_setup_force_cxx98.cpp.o -c /tmp/B.gUuNec/BUILD/glm/test/core/core_setup_force_cxx98.cpp make[2]: Leaving directory '/tmp/B.gUuNec/BUILD/glm/build' make[2]: Entering directory '/tmp/B.gUuNec/BUILD/glm/build' [ 21%] Linking CXX executable test-core_setup_force_cxx98 cd /tmp/B.gUuNec/BUILD/glm/build/test/core && /usr/bin/cmake -E cmake_link_script CMakeFiles/test-core_setup_force_cxx98.dir/link.txt --verbose=1 /usr/bin/x86_64-pld-linux-g++ -O2 -fwrapv -pipe -Wformat -Werror=format-security -gdwarf-4 -fno-debug-types-section -fvar-tracking-assignments -g2 -Wp,-D_FORTIFY_SOURCE=2 -fstack-protector-strong --param=ssp-buffer-size=4 -fPIC -march=x86-64 -gdwarf-4 -fno-debug-types-section -fvar-tracking-assignments -g2 -DNDEBUG -DQT_NO_DEBUG -Wl,--as-needed -Wl,--no-copy-dt-needed-entries -Wl,-z,relro -Wl,-z,combreloc -rdynamic CMakeFiles/test-core_setup_force_cxx98.dir/core_setup_force_cxx98.cpp.o -o test-core_setup_force_cxx98 make[2]: Leaving directory '/tmp/B.gUuNec/BUILD/glm/build' make[1]: Entering directory '/tmp/B.gUuNec/BUILD/glm/build' [ 21%] Built target test-core_setup_force_cxx98 make[1]: Leaving directory '/tmp/B.gUuNec/BUILD/glm/build' /usr/bin/make -f test/core/CMakeFiles/test-core_func_integer_find_lsb.dir/build.make test/core/CMakeFiles/test-core_func_integer_find_lsb.dir/depend make[2]: Entering directory '/tmp/B.gUuNec/BUILD/glm/build' [ 16%] Building CXX object test/core/CMakeFiles/test-core_func_geometric.dir/core_func_geometric.cpp.o cd /tmp/B.gUuNec/BUILD/glm/build/test/core && /usr/bin/x86_64-pld-linux-g++ -I/tmp/B.gUuNec/BUILD/glm -O2 -fwrapv -pipe -Wformat -Werror=format-security -gdwarf-4 -fno-debug-types-section -fvar-tracking-assignments -g2 -Wp,-D_FORTIFY_SOURCE=2 -fstack-protector-strong --param=ssp-buffer-size=4 -fPIC -march=x86-64 -gdwarf-4 -fno-debug-types-section -fvar-tracking-assignments -g2 -DNDEBUG -DQT_NO_DEBUG -Wno-long-long -o CMakeFiles/test-core_func_geometric.dir/core_func_geometric.cpp.o -c /tmp/B.gUuNec/BUILD/glm/test/core/core_func_geometric.cpp make[2]: Leaving directory '/tmp/B.gUuNec/BUILD/glm/build' make[2]: Entering directory '/tmp/B.gUuNec/BUILD/glm/build' cd /tmp/B.gUuNec/BUILD/glm/build && /usr/bin/cmake -E cmake_depends "Unix Makefiles" /tmp/B.gUuNec/BUILD/glm /tmp/B.gUuNec/BUILD/glm/test/core /tmp/B.gUuNec/BUILD/glm/build /tmp/B.gUuNec/BUILD/glm/build/test/core /tmp/B.gUuNec/BUILD/glm/build/test/core/CMakeFiles/test-core_func_integer_find_lsb.dir/DependInfo.cmake --color= Scanning dependencies of target test-core_func_integer_find_lsb make[2]: Leaving directory '/tmp/B.gUuNec/BUILD/glm/build' /usr/bin/make -f test/core/CMakeFiles/test-core_func_integer_find_lsb.dir/build.make test/core/CMakeFiles/test-core_func_integer_find_lsb.dir/build make[2]: Entering directory '/tmp/B.gUuNec/BUILD/glm/build' [ 22%] Linking CXX executable test-core_func_geometric cd /tmp/B.gUuNec/BUILD/glm/build/test/core && /usr/bin/cmake -E cmake_link_script CMakeFiles/test-core_func_geometric.dir/link.txt --verbose=1 /usr/bin/x86_64-pld-linux-g++ -O2 -fwrapv -pipe -Wformat -Werror=format-security -gdwarf-4 -fno-debug-types-section -fvar-tracking-assignments -g2 -Wp,-D_FORTIFY_SOURCE=2 -fstack-protector-strong --param=ssp-buffer-size=4 -fPIC -march=x86-64 -gdwarf-4 -fno-debug-types-section -fvar-tracking-assignments -g2 -DNDEBUG -DQT_NO_DEBUG -Wl,--as-needed -Wl,--no-copy-dt-needed-entries -Wl,-z,relro -Wl,-z,combreloc -rdynamic CMakeFiles/test-core_func_geometric.dir/core_func_geometric.cpp.o -o test-core_func_geometric make[2]: Leaving directory '/tmp/B.gUuNec/BUILD/glm/build' make[1]: Entering directory '/tmp/B.gUuNec/BUILD/glm/build' [ 23%] Built target test-core_func_geometric make[1]: Leaving directory '/tmp/B.gUuNec/BUILD/glm/build' /usr/bin/make -f test/core/CMakeFiles/test-core_type_mat2x2.dir/build.make test/core/CMakeFiles/test-core_type_mat2x2.dir/depend make[2]: Entering directory '/tmp/B.gUuNec/BUILD/glm/build' cd /tmp/B.gUuNec/BUILD/glm/build && /usr/bin/cmake -E cmake_depends "Unix Makefiles" /tmp/B.gUuNec/BUILD/glm /tmp/B.gUuNec/BUILD/glm/test/core /tmp/B.gUuNec/BUILD/glm/build /tmp/B.gUuNec/BUILD/glm/build/test/core /tmp/B.gUuNec/BUILD/glm/build/test/core/CMakeFiles/test-core_type_mat2x2.dir/DependInfo.cmake --color= Scanning dependencies of target test-core_type_mat2x2 make[2]: Leaving directory '/tmp/B.gUuNec/BUILD/glm/build' /usr/bin/make -f test/core/CMakeFiles/test-core_type_mat2x2.dir/build.make test/core/CMakeFiles/test-core_type_mat2x2.dir/build make[2]: Entering directory '/tmp/B.gUuNec/BUILD/glm/build' [ 15%] Building CXX object test/core/CMakeFiles/test-core_type_mat4x4.dir/core_type_mat4x4.cpp.o cd /tmp/B.gUuNec/BUILD/glm/build/test/core && /usr/bin/x86_64-pld-linux-g++ -I/tmp/B.gUuNec/BUILD/glm -O2 -fwrapv -pipe -Wformat -Werror=format-security -gdwarf-4 -fno-debug-types-section -fvar-tracking-assignments -g2 -Wp,-D_FORTIFY_SOURCE=2 -fstack-protector-strong --param=ssp-buffer-size=4 -fPIC -march=x86-64 -gdwarf-4 -fno-debug-types-section -fvar-tracking-assignments -g2 -DNDEBUG -DQT_NO_DEBUG -Wno-long-long -o CMakeFiles/test-core_type_mat4x4.dir/core_type_mat4x4.cpp.o -c /tmp/B.gUuNec/BUILD/glm/test/core/core_type_mat4x4.cpp make[2]: Leaving directory '/tmp/B.gUuNec/BUILD/glm/build' make[2]: Entering directory '/tmp/B.gUuNec/BUILD/glm/build' [ 23%] Building CXX object test/core/CMakeFiles/test-core_func_integer_find_lsb.dir/core_func_integer_find_lsb.cpp.o cd /tmp/B.gUuNec/BUILD/glm/build/test/core && /usr/bin/x86_64-pld-linux-g++ -I/tmp/B.gUuNec/BUILD/glm -O2 -fwrapv -pipe -Wformat -Werror=format-security -gdwarf-4 -fno-debug-types-section -fvar-tracking-assignments -g2 -Wp,-D_FORTIFY_SOURCE=2 -fstack-protector-strong --param=ssp-buffer-size=4 -fPIC -march=x86-64 -gdwarf-4 -fno-debug-types-section -fvar-tracking-assignments -g2 -DNDEBUG -DQT_NO_DEBUG -Wno-long-long -o CMakeFiles/test-core_func_integer_find_lsb.dir/core_func_integer_find_lsb.cpp.o -c /tmp/B.gUuNec/BUILD/glm/test/core/core_func_integer_find_lsb.cpp make[2]: Leaving directory '/tmp/B.gUuNec/BUILD/glm/build' make[2]: Entering directory '/tmp/B.gUuNec/BUILD/glm/build' [ 23%] Linking CXX executable test-core_type_mat4x4 cd /tmp/B.gUuNec/BUILD/glm/build/test/core && /usr/bin/cmake -E cmake_link_script CMakeFiles/test-core_type_mat4x4.dir/link.txt --verbose=1 /usr/bin/x86_64-pld-linux-g++ -O2 -fwrapv -pipe -Wformat -Werror=format-security -gdwarf-4 -fno-debug-types-section -fvar-tracking-assignments -g2 -Wp,-D_FORTIFY_SOURCE=2 -fstack-protector-strong --param=ssp-buffer-size=4 -fPIC -march=x86-64 -gdwarf-4 -fno-debug-types-section -fvar-tracking-assignments -g2 -DNDEBUG -DQT_NO_DEBUG -Wl,--as-needed -Wl,--no-copy-dt-needed-entries -Wl,-z,relro -Wl,-z,combreloc -rdynamic CMakeFiles/test-core_type_mat4x4.dir/core_type_mat4x4.cpp.o -o test-core_type_mat4x4 make[2]: Leaving directory '/tmp/B.gUuNec/BUILD/glm/build' make[2]: Entering directory '/tmp/B.gUuNec/BUILD/glm/build' [ 23%] Linking CXX executable test-core_func_integer_find_lsb cd /tmp/B.gUuNec/BUILD/glm/build/test/core && /usr/bin/cmake -E cmake_link_script CMakeFiles/test-core_func_integer_find_lsb.dir/link.txt --verbose=1 /usr/bin/x86_64-pld-linux-g++ -O2 -fwrapv -pipe -Wformat -Werror=format-security -gdwarf-4 -fno-debug-types-section -fvar-tracking-assignments -g2 -Wp,-D_FORTIFY_SOURCE=2 -fstack-protector-strong --param=ssp-buffer-size=4 -fPIC -march=x86-64 -gdwarf-4 -fno-debug-types-section -fvar-tracking-assignments -g2 -DNDEBUG -DQT_NO_DEBUG -Wl,--as-needed -Wl,--no-copy-dt-needed-entries -Wl,-z,relro -Wl,-z,combreloc -rdynamic CMakeFiles/test-core_func_integer_find_lsb.dir/core_func_integer_find_lsb.cpp.o -o test-core_func_integer_find_lsb make[2]: Leaving directory '/tmp/B.gUuNec/BUILD/glm/build' make[1]: Entering directory '/tmp/B.gUuNec/BUILD/glm/build' [ 23%] Built target test-core_type_mat4x4 make[1]: Leaving directory '/tmp/B.gUuNec/BUILD/glm/build' /usr/bin/make -f test/core/CMakeFiles/test-core_type_mat3x3.dir/build.make test/core/CMakeFiles/test-core_type_mat3x3.dir/depend make[1]: Entering directory '/tmp/B.gUuNec/BUILD/glm/build' [ 23%] Built target test-core_func_integer_find_lsb make[1]: Leaving directory '/tmp/B.gUuNec/BUILD/glm/build' /usr/bin/make -f test/core/CMakeFiles/test-core_func_matrix.dir/build.make test/core/CMakeFiles/test-core_func_matrix.dir/depend make[2]: Entering directory '/tmp/B.gUuNec/BUILD/glm/build' cd /tmp/B.gUuNec/BUILD/glm/build && /usr/bin/cmake -E cmake_depends "Unix Makefiles" /tmp/B.gUuNec/BUILD/glm /tmp/B.gUuNec/BUILD/glm/test/core /tmp/B.gUuNec/BUILD/glm/build /tmp/B.gUuNec/BUILD/glm/build/test/core /tmp/B.gUuNec/BUILD/glm/build/test/core/CMakeFiles/test-core_type_mat3x3.dir/DependInfo.cmake --color= Scanning dependencies of target test-core_type_mat3x3 make[2]: Leaving directory '/tmp/B.gUuNec/BUILD/glm/build' /usr/bin/make -f test/core/CMakeFiles/test-core_type_mat3x3.dir/build.make test/core/CMakeFiles/test-core_type_mat3x3.dir/build make[2]: Entering directory '/tmp/B.gUuNec/BUILD/glm/build' cd /tmp/B.gUuNec/BUILD/glm/build && /usr/bin/cmake -E cmake_depends "Unix Makefiles" /tmp/B.gUuNec/BUILD/glm /tmp/B.gUuNec/BUILD/glm/test/core /tmp/B.gUuNec/BUILD/glm/build /tmp/B.gUuNec/BUILD/glm/build/test/core /tmp/B.gUuNec/BUILD/glm/build/test/core/CMakeFiles/test-core_func_matrix.dir/DependInfo.cmake --color= Scanning dependencies of target test-core_func_matrix make[2]: Leaving directory '/tmp/B.gUuNec/BUILD/glm/build' /usr/bin/make -f test/core/CMakeFiles/test-core_func_matrix.dir/build.make test/core/CMakeFiles/test-core_func_matrix.dir/build make[2]: Entering directory '/tmp/B.gUuNec/BUILD/glm/build' [ 23%] Building CXX object test/core/CMakeFiles/test-core_type_mat2x2.dir/core_type_mat2x2.cpp.o cd /tmp/B.gUuNec/BUILD/glm/build/test/core && /usr/bin/x86_64-pld-linux-g++ -I/tmp/B.gUuNec/BUILD/glm -O2 -fwrapv -pipe -Wformat -Werror=format-security -gdwarf-4 -fno-debug-types-section -fvar-tracking-assignments -g2 -Wp,-D_FORTIFY_SOURCE=2 -fstack-protector-strong --param=ssp-buffer-size=4 -fPIC -march=x86-64 -gdwarf-4 -fno-debug-types-section -fvar-tracking-assignments -g2 -DNDEBUG -DQT_NO_DEBUG -Wno-long-long -o CMakeFiles/test-core_type_mat2x2.dir/core_type_mat2x2.cpp.o -c /tmp/B.gUuNec/BUILD/glm/test/core/core_type_mat2x2.cpp make[2]: Leaving directory '/tmp/B.gUuNec/BUILD/glm/build' make[2]: Entering directory '/tmp/B.gUuNec/BUILD/glm/build' [ 24%] Linking CXX executable test-core_type_mat2x2 cd /tmp/B.gUuNec/BUILD/glm/build/test/core && /usr/bin/cmake -E cmake_link_script CMakeFiles/test-core_type_mat2x2.dir/link.txt --verbose=1 /usr/bin/x86_64-pld-linux-g++ -O2 -fwrapv -pipe -Wformat -Werror=format-security -gdwarf-4 -fno-debug-types-section -fvar-tracking-assignments -g2 -Wp,-D_FORTIFY_SOURCE=2 -fstack-protector-strong --param=ssp-buffer-size=4 -fPIC -march=x86-64 -gdwarf-4 -fno-debug-types-section -fvar-tracking-assignments -g2 -DNDEBUG -DQT_NO_DEBUG -Wl,--as-needed -Wl,--no-copy-dt-needed-entries -Wl,-z,relro -Wl,-z,combreloc -rdynamic CMakeFiles/test-core_type_mat2x2.dir/core_type_mat2x2.cpp.o -o test-core_type_mat2x2 make[2]: Leaving directory '/tmp/B.gUuNec/BUILD/glm/build' make[1]: Entering directory '/tmp/B.gUuNec/BUILD/glm/build' [ 24%] Built target test-core_type_mat2x2 make[1]: Leaving directory '/tmp/B.gUuNec/BUILD/glm/build' /usr/bin/make -f test/core/CMakeFiles/test-core_type_cast.dir/build.make test/core/CMakeFiles/test-core_type_cast.dir/depend make[2]: Entering directory '/tmp/B.gUuNec/BUILD/glm/build' cd /tmp/B.gUuNec/BUILD/glm/build && /usr/bin/cmake -E cmake_depends "Unix Makefiles" /tmp/B.gUuNec/BUILD/glm /tmp/B.gUuNec/BUILD/glm/test/core /tmp/B.gUuNec/BUILD/glm/build /tmp/B.gUuNec/BUILD/glm/build/test/core /tmp/B.gUuNec/BUILD/glm/build/test/core/CMakeFiles/test-core_type_cast.dir/DependInfo.cmake --color= Scanning dependencies of target test-core_type_cast make[2]: Leaving directory '/tmp/B.gUuNec/BUILD/glm/build' /usr/bin/make -f test/core/CMakeFiles/test-core_type_cast.dir/build.make test/core/CMakeFiles/test-core_type_cast.dir/build make[2]: Entering directory '/tmp/B.gUuNec/BUILD/glm/build' [ 21%] Building CXX object test/core/CMakeFiles/test-core_func_common.dir/core_func_common.cpp.o cd /tmp/B.gUuNec/BUILD/glm/build/test/core && /usr/bin/x86_64-pld-linux-g++ -I/tmp/B.gUuNec/BUILD/glm -O2 -fwrapv -pipe -Wformat -Werror=format-security -gdwarf-4 -fno-debug-types-section -fvar-tracking-assignments -g2 -Wp,-D_FORTIFY_SOURCE=2 -fstack-protector-strong --param=ssp-buffer-size=4 -fPIC -march=x86-64 -gdwarf-4 -fno-debug-types-section -fvar-tracking-assignments -g2 -DNDEBUG -DQT_NO_DEBUG -Wno-long-long -o CMakeFiles/test-core_func_common.dir/core_func_common.cpp.o -c /tmp/B.gUuNec/BUILD/glm/test/core/core_func_common.cpp make[2]: Leaving directory '/tmp/B.gUuNec/BUILD/glm/build' make[2]: Entering directory '/tmp/B.gUuNec/BUILD/glm/build' [ 25%] Linking CXX executable test-core_func_common cd /tmp/B.gUuNec/BUILD/glm/build/test/core && /usr/bin/cmake -E cmake_link_script CMakeFiles/test-core_func_common.dir/link.txt --verbose=1 /usr/bin/x86_64-pld-linux-g++ -O2 -fwrapv -pipe -Wformat -Werror=format-security -gdwarf-4 -fno-debug-types-section -fvar-tracking-assignments -g2 -Wp,-D_FORTIFY_SOURCE=2 -fstack-protector-strong --param=ssp-buffer-size=4 -fPIC -march=x86-64 -gdwarf-4 -fno-debug-types-section -fvar-tracking-assignments -g2 -DNDEBUG -DQT_NO_DEBUG -Wl,--as-needed -Wl,--no-copy-dt-needed-entries -Wl,-z,relro -Wl,-z,combreloc -rdynamic CMakeFiles/test-core_func_common.dir/core_func_common.cpp.o -o test-core_func_common make[2]: Leaving directory '/tmp/B.gUuNec/BUILD/glm/build' make[2]: Entering directory '/tmp/B.gUuNec/BUILD/glm/build' [ 23%] Building CXX object test/core/CMakeFiles/test-core_type_mat3x3.dir/core_type_mat3x3.cpp.o cd /tmp/B.gUuNec/BUILD/glm/build/test/core && /usr/bin/x86_64-pld-linux-g++ -I/tmp/B.gUuNec/BUILD/glm -O2 -fwrapv -pipe -Wformat -Werror=format-security -gdwarf-4 -fno-debug-types-section -fvar-tracking-assignments -g2 -Wp,-D_FORTIFY_SOURCE=2 -fstack-protector-strong --param=ssp-buffer-size=4 -fPIC -march=x86-64 -gdwarf-4 -fno-debug-types-section -fvar-tracking-assignments -g2 -DNDEBUG -DQT_NO_DEBUG -Wno-long-long -o CMakeFiles/test-core_type_mat3x3.dir/core_type_mat3x3.cpp.o -c /tmp/B.gUuNec/BUILD/glm/test/core/core_type_mat3x3.cpp make[2]: Leaving directory '/tmp/B.gUuNec/BUILD/glm/build' make[2]: Entering directory '/tmp/B.gUuNec/BUILD/glm/build' [ 24%] Building CXX object test/core/CMakeFiles/test-core_func_matrix.dir/core_func_matrix.cpp.o cd /tmp/B.gUuNec/BUILD/glm/build/test/core && /usr/bin/x86_64-pld-linux-g++ -I/tmp/B.gUuNec/BUILD/glm -O2 -fwrapv -pipe -Wformat -Werror=format-security -gdwarf-4 -fno-debug-types-section -fvar-tracking-assignments -g2 -Wp,-D_FORTIFY_SOURCE=2 -fstack-protector-strong --param=ssp-buffer-size=4 -fPIC -march=x86-64 -gdwarf-4 -fno-debug-types-section -fvar-tracking-assignments -g2 -DNDEBUG -DQT_NO_DEBUG -Wno-long-long -o CMakeFiles/test-core_func_matrix.dir/core_func_matrix.cpp.o -c /tmp/B.gUuNec/BUILD/glm/test/core/core_func_matrix.cpp /tmp/B.gUuNec/BUILD/glm/test/core/core_func_matrix.cpp: In function 'int test_matrixCompMult()': /tmp/B.gUuNec/BUILD/glm/test/core/core_func_matrix.cpp:19:34: internal compiler error: in gimplify_expr, at gimplify.c:12385 mat2 expected = mat2(0, 1, 4, 9); ^ Please submit a full bug report, with preprocessed source if appropriate. See <http://bugs.pld-linux.org> for instructions. make[2]: *** [test/core/CMakeFiles/test-core_func_matrix.dir/build.make:66: test/core/CMakeFiles/test-core_func_matrix.dir/core_func_matrix.cpp.o] Error 1 make[2]: Leaving directory '/tmp/B.gUuNec/BUILD/glm/build' make[1]: *** [CMakeFiles/Makefile2:1482: test/core/CMakeFiles/test-core_func_matrix.dir/all] Error 2 make[1]: *** Waiting for unfinished jobs.... make[1]: Entering directory '/tmp/B.gUuNec/BUILD/glm/build' [ 26%] Built target test-core_func_common make[1]: Leaving directory '/tmp/B.gUuNec/BUILD/glm/build' make[2]: Entering directory '/tmp/B.gUuNec/BUILD/glm/build' [ 26%] Linking CXX executable test-core_type_mat3x3 cd /tmp/B.gUuNec/BUILD/glm/build/test/core && /usr/bin/cmake -E cmake_link_script CMakeFiles/test-core_type_mat3x3.dir/link.txt --verbose=1 /usr/bin/x86_64-pld-linux-g++ -O2 -fwrapv -pipe -Wformat -Werror=format-security -gdwarf-4 -fno-debug-types-section -fvar-tracking-assignments -g2 -Wp,-D_FORTIFY_SOURCE=2 -fstack-protector-strong --param=ssp-buffer-size=4 -fPIC -march=x86-64 -gdwarf-4 -fno-debug-types-section -fvar-tracking-assignments -g2 -DNDEBUG -DQT_NO_DEBUG -Wl,--as-needed -Wl,--no-copy-dt-needed-entries -Wl,-z,relro -Wl,-z,combreloc -rdynamic CMakeFiles/test-core_type_mat3x3.dir/core_type_mat3x3.cpp.o -o test-core_type_mat3x3 make[2]: Leaving directory '/tmp/B.gUuNec/BUILD/glm/build' make[1]: Entering directory '/tmp/B.gUuNec/BUILD/glm/build' [ 26%] Built target test-core_type_mat3x3 make[1]: Leaving directory '/tmp/B.gUuNec/BUILD/glm/build' make[2]: Entering directory '/tmp/B.gUuNec/BUILD/glm/build' [ 6%] Building CXX object glm/CMakeFiles/glm_dummy.dir/detail/glm.cpp.o cd /tmp/B.gUuNec/BUILD/glm/build/glm && /usr/bin/x86_64-pld-linux-g++ -I/tmp/B.gUuNec/BUILD/glm -I/tmp/B.gUuNec/BUILD/glm/glm/.. -O2 -fwrapv -pipe -Wformat -Werror=format-security -gdwarf-4 -fno-debug-types-section -fvar-tracking-assignments -g2 -Wp,-D_FORTIFY_SOURCE=2 -fstack-protector-strong --param=ssp-buffer-size=4 -fPIC -march=x86-64 -gdwarf-4 -fno-debug-types-section -fvar-tracking-assignments -g2 -DNDEBUG -DQT_NO_DEBUG -Wno-long-long -o CMakeFiles/glm_dummy.dir/detail/glm.cpp.o -c /tmp/B.gUuNec/BUILD/glm/glm/detail/glm.cpp make[2]: Leaving directory '/tmp/B.gUuNec/BUILD/glm/build' make[2]: Entering directory '/tmp/B.gUuNec/BUILD/glm/build' [ 27%] Linking CXX executable glm_dummy cd /tmp/B.gUuNec/BUILD/glm/build/glm && /usr/bin/cmake -E cmake_link_script CMakeFiles/glm_dummy.dir/link.txt --verbose=1 /usr/bin/x86_64-pld-linux-g++ -O2 -fwrapv -pipe -Wformat -Werror=format-security -gdwarf-4 -fno-debug-types-section -fvar-tracking-assignments -g2 -Wp,-D_FORTIFY_SOURCE=2 -fstack-protector-strong --param=ssp-buffer-size=4 -fPIC -march=x86-64 -gdwarf-4 -fno-debug-types-section -fvar-tracking-assignments -g2 -DNDEBUG -DQT_NO_DEBUG -Wl,--as-needed -Wl,--no-copy-dt-needed-entries -Wl,-z,relro -Wl,-z,combreloc -rdynamic CMakeFiles/glm_dummy.dir/detail/dummy.cpp.o CMakeFiles/glm_dummy.dir/detail/glm.cpp.o -o glm_dummy make[2]: Leaving directory '/tmp/B.gUuNec/BUILD/glm/build' make[1]: Entering directory '/tmp/B.gUuNec/BUILD/glm/build' [ 27%] Built target glm_dummy make[1]: Leaving directory '/tmp/B.gUuNec/BUILD/glm/build' make[2]: Entering directory '/tmp/B.gUuNec/BUILD/glm/build' [ 9%] Building CXX object test/core/CMakeFiles/test-core_type_vec3.dir/core_type_vec3.cpp.o cd /tmp/B.gUuNec/BUILD/glm/build/test/core && /usr/bin/x86_64-pld-linux-g++ -I/tmp/B.gUuNec/BUILD/glm -O2 -fwrapv -pipe -Wformat -Werror=format-security -gdwarf-4 -fno-debug-types-section -fvar-tracking-assignments -g2 -Wp,-D_FORTIFY_SOURCE=2 -fstack-protector-strong --param=ssp-buffer-size=4 -fPIC -march=x86-64 -gdwarf-4 -fno-debug-types-section -fvar-tracking-assignments -g2 -DNDEBUG -DQT_NO_DEBUG -Wno-long-long -o CMakeFiles/test-core_type_vec3.dir/core_type_vec3.cpp.o -c /tmp/B.gUuNec/BUILD/glm/test/core/core_type_vec3.cpp make[2]: Leaving directory '/tmp/B.gUuNec/BUILD/glm/build' make[2]: Entering directory '/tmp/B.gUuNec/BUILD/glm/build' [ 28%] Linking CXX executable test-core_type_vec3 cd /tmp/B.gUuNec/BUILD/glm/build/test/core && /usr/bin/cmake -E cmake_link_script CMakeFiles/test-core_type_vec3.dir/link.txt --verbose=1 /usr/bin/x86_64-pld-linux-g++ -O2 -fwrapv -pipe -Wformat -Werror=format-security -gdwarf-4 -fno-debug-types-section -fvar-tracking-assignments -g2 -Wp,-D_FORTIFY_SOURCE=2 -fstack-protector-strong --param=ssp-buffer-size=4 -fPIC -march=x86-64 -gdwarf-4 -fno-debug-types-section -fvar-tracking-assignments -g2 -DNDEBUG -DQT_NO_DEBUG -Wl,--as-needed -Wl,--no-copy-dt-needed-entries -Wl,-z,relro -Wl,-z,combreloc -rdynamic CMakeFiles/test-core_type_vec3.dir/core_type_vec3.cpp.o -o test-core_type_vec3 make[2]: Leaving directory '/tmp/B.gUuNec/BUILD/glm/build' make[1]: Entering directory '/tmp/B.gUuNec/BUILD/glm/build' [ 28%] Built target test-core_type_vec3 make[1]: Leaving directory '/tmp/B.gUuNec/BUILD/glm/build' make[2]: Entering directory '/tmp/B.gUuNec/BUILD/glm/build' [ 25%] Building CXX object test/core/CMakeFiles/test-core_type_cast.dir/core_type_cast.cpp.o cd /tmp/B.gUuNec/BUILD/glm/build/test/core && /usr/bin/x86_64-pld-linux-g++ -I/tmp/B.gUuNec/BUILD/glm -O2 -fwrapv -pipe -Wformat -Werror=format-security -gdwarf-4 -fno-debug-types-section -fvar-tracking-assignments -g2 -Wp,-D_FORTIFY_SOURCE=2 -fstack-protector-strong --param=ssp-buffer-size=4 -fPIC -march=x86-64 -gdwarf-4 -fno-debug-types-section -fvar-tracking-assignments -g2 -DNDEBUG -DQT_NO_DEBUG -Wno-long-long -o CMakeFiles/test-core_type_cast.dir/core_type_cast.cpp.o -c /tmp/B.gUuNec/BUILD/glm/test/core/core_type_cast.cpp make[2]: Leaving directory '/tmp/B.gUuNec/BUILD/glm/build' make[2]: Entering directory '/tmp/B.gUuNec/BUILD/glm/build' [ 28%] Linking CXX executable test-core_type_cast cd /tmp/B.gUuNec/BUILD/glm/build/test/core && /usr/bin/cmake -E cmake_link_script CMakeFiles/test-core_type_cast.dir/link.txt --verbose=1 /usr/bin/x86_64-pld-linux-g++ -O2 -fwrapv -pipe -Wformat -Werror=format-security -gdwarf-4 -fno-debug-types-section -fvar-tracking-assignments -g2 -Wp,-D_FORTIFY_SOURCE=2 -fstack-protector-strong --param=ssp-buffer-size=4 -fPIC -march=x86-64 -gdwarf-4 -fno-debug-types-section -fvar-tracking-assignments -g2 -DNDEBUG -DQT_NO_DEBUG -Wl,--as-needed -Wl,--no-copy-dt-needed-entries -Wl,-z,relro -Wl,-z,combreloc -rdynamic CMakeFiles/test-core_type_cast.dir/core_type_cast.cpp.o -o test-core_type_cast make[2]: Leaving directory '/tmp/B.gUuNec/BUILD/glm/build' make[1]: Entering directory '/tmp/B.gUuNec/BUILD/glm/build' [ 28%] Built target test-core_type_cast make[1]: Leaving directory '/tmp/B.gUuNec/BUILD/glm/build' make[2]: Entering directory '/tmp/B.gUuNec/BUILD/glm/build' [ 18%] Building CXX object test/core/CMakeFiles/test-core_type_vec2.dir/core_type_vec2.cpp.o cd /tmp/B.gUuNec/BUILD/glm/build/test/core && /usr/bin/x86_64-pld-linux-g++ -I/tmp/B.gUuNec/BUILD/glm -O2 -fwrapv -pipe -Wformat -Werror=format-security -gdwarf-4 -fno-debug-types-section -fvar-tracking-assignments -g2 -Wp,-D_FORTIFY_SOURCE=2 -fstack-protector-strong --param=ssp-buffer-size=4 -fPIC -march=x86-64 -gdwarf-4 -fno-debug-types-section -fvar-tracking-assignments -g2 -DNDEBUG -DQT_NO_DEBUG -Wno-long-long -o CMakeFiles/test-core_type_vec2.dir/core_type_vec2.cpp.o -c /tmp/B.gUuNec/BUILD/glm/test/core/core_type_vec2.cpp make[2]: Leaving directory '/tmp/B.gUuNec/BUILD/glm/build' make[2]: Entering directory '/tmp/B.gUuNec/BUILD/glm/build' [ 29%] Linking CXX executable test-core_type_vec2 cd /tmp/B.gUuNec/BUILD/glm/build/test/core && /usr/bin/cmake -E cmake_link_script CMakeFiles/test-core_type_vec2.dir/link.txt --verbose=1 /usr/bin/x86_64-pld-linux-g++ -O2 -fwrapv -pipe -Wformat -Werror=format-security -gdwarf-4 -fno-debug-types-section -fvar-tracking-assignments -g2 -Wp,-D_FORTIFY_SOURCE=2 -fstack-protector-strong --param=ssp-buffer-size=4 -fPIC -march=x86-64 -gdwarf-4 -fno-debug-types-section -fvar-tracking-assignments -g2 -DNDEBUG -DQT_NO_DEBUG -Wl,--as-needed -Wl,--no-copy-dt-needed-entries -Wl,-z,relro -Wl,-z,combreloc -rdynamic CMakeFiles/test-core_type_vec2.dir/core_type_vec2.cpp.o -o test-core_type_vec2 make[2]: Leaving directory '/tmp/B.gUuNec/BUILD/glm/build' make[1]: Entering directory '/tmp/B.gUuNec/BUILD/glm/build' [ 29%] Built target test-core_type_vec2 make[1]: Leaving directory '/tmp/B.gUuNec/BUILD/glm/build' make[2]: Entering directory '/tmp/B.gUuNec/BUILD/glm/build' [ 10%] Building CXX object test/core/CMakeFiles/test-core_force_pure.dir/core_force_pure.cpp.o cd /tmp/B.gUuNec/BUILD/glm/build/test/core && /usr/bin/x86_64-pld-linux-g++ -I/tmp/B.gUuNec/BUILD/glm -O2 -fwrapv -pipe -Wformat -Werror=format-security -gdwarf-4 -fno-debug-types-section -fvar-tracking-assignments -g2 -Wp,-D_FORTIFY_SOURCE=2 -fstack-protector-strong --param=ssp-buffer-size=4 -fPIC -march=x86-64 -gdwarf-4 -fno-debug-types-section -fvar-tracking-assignments -g2 -DNDEBUG -DQT_NO_DEBUG -Wno-long-long -o CMakeFiles/test-core_force_pure.dir/core_force_pure.cpp.o -c /tmp/B.gUuNec/BUILD/glm/test/core/core_force_pure.cpp make[2]: Leaving directory '/tmp/B.gUuNec/BUILD/glm/build' make[2]: Entering directory '/tmp/B.gUuNec/BUILD/glm/build' [ 29%] Linking CXX executable test-core_force_pure cd /tmp/B.gUuNec/BUILD/glm/build/test/core && /usr/bin/cmake -E cmake_link_script CMakeFiles/test-core_force_pure.dir/link.txt --verbose=1 /usr/bin/x86_64-pld-linux-g++ -O2 -fwrapv -pipe -Wformat -Werror=format-security -gdwarf-4 -fno-debug-types-section -fvar-tracking-assignments -g2 -Wp,-D_FORTIFY_SOURCE=2 -fstack-protector-strong --param=ssp-buffer-size=4 -fPIC -march=x86-64 -gdwarf-4 -fno-debug-types-section -fvar-tracking-assignments -g2 -DNDEBUG -DQT_NO_DEBUG -Wl,--as-needed -Wl,--no-copy-dt-needed-entries -Wl,-z,relro -Wl,-z,combreloc -rdynamic CMakeFiles/test-core_force_pure.dir/core_force_pure.cpp.o -o test-core_force_pure make[2]: Leaving directory '/tmp/B.gUuNec/BUILD/glm/build' make[1]: Entering directory '/tmp/B.gUuNec/BUILD/glm/build' [ 29%] Built target test-core_force_pure make[1]: Leaving directory '/tmp/B.gUuNec/BUILD/glm/build' make[2]: Entering directory '/tmp/B.gUuNec/BUILD/glm/build' [ 15%] Building CXX object test/core/CMakeFiles/test-core_type_vec4.dir/core_type_vec4.cpp.o cd /tmp/B.gUuNec/BUILD/glm/build/test/core && /usr/bin/x86_64-pld-linux-g++ -I/tmp/B.gUuNec/BUILD/glm -O2 -fwrapv -pipe -Wformat -Werror=format-security -gdwarf-4 -fno-debug-types-section -fvar-tracking-assignments -g2 -Wp,-D_FORTIFY_SOURCE=2 -fstack-protector-strong --param=ssp-buffer-size=4 -fPIC -march=x86-64 -gdwarf-4 -fno-debug-types-section -fvar-tracking-assignments -g2 -DNDEBUG -DQT_NO_DEBUG -Wno-long-long -o CMakeFiles/test-core_type_vec4.dir/core_type_vec4.cpp.o -c /tmp/B.gUuNec/BUILD/glm/test/core/core_type_vec4.cpp make[2]: Leaving directory '/tmp/B.gUuNec/BUILD/glm/build' make[2]: Entering directory '/tmp/B.gUuNec/BUILD/glm/build' [ 29%] Linking CXX executable test-core_type_vec4 cd /tmp/B.gUuNec/BUILD/glm/build/test/core && /usr/bin/cmake -E cmake_link_script CMakeFiles/test-core_type_vec4.dir/link.txt --verbose=1 /usr/bin/x86_64-pld-linux-g++ -O2 -fwrapv -pipe -Wformat -Werror=format-security -gdwarf-4 -fno-debug-types-section -fvar-tracking-assignments -g2 -Wp,-D_FORTIFY_SOURCE=2 -fstack-protector-strong --param=ssp-buffer-size=4 -fPIC -march=x86-64 -gdwarf-4 -fno-debug-types-section -fvar-tracking-assignments -g2 -DNDEBUG -DQT_NO_DEBUG -Wl,--as-needed -Wl,--no-copy-dt-needed-entries -Wl,-z,relro -Wl,-z,combreloc -rdynamic CMakeFiles/test-core_type_vec4.dir/core_type_vec4.cpp.o -o test-core_type_vec4 make[2]: Leaving directory '/tmp/B.gUuNec/BUILD/glm/build' make[1]: Entering directory '/tmp/B.gUuNec/BUILD/glm/build' [ 29%] Built target test-core_type_vec4 make[1]: Leaving directory '/tmp/B.gUuNec/BUILD/glm/build' make: *** [Makefile:144: all] Error 2 error: Bad exit status from /tmp/B.gUuNec/BUILD/tmp/rpm-tmp.41436 (%build) RPM build errors: Bad exit status from /tmp/B.gUuNec/BUILD/tmp/rpm-tmp.41436 (%build) ended at: Sat Jul 28 08:35:21 2018, done in 0:00:20.646224 error: No files produced. mesg: ttyname failed: Inappropriate ioctl for device + chmod -R u+rwX /tmp/B.gUuNec/BUILD + rm -rf /tmp/B.gUuNec/tmp /tmp/B.gUuNec/BUILD mesg: ttyname failed: Inappropriate ioctl for device + rm -rf /tmp/B.gUuNec Begin-PLD-Builder-Info Build-Time: user:88.02s sys:7.40s real:24.48s (faults io:0 non-io:1934080) End-PLD-Builder-Info
[Back to list of logs] [View rpm -qa of builder]