FailedOk

th/SRPMS[OK]
th/x32[OK]
th/i686[OK]
th/x86_64[OK]

ac/SRPMS[OK]
ac/i386[OK]
ac/i586[OK]
ac/i686[OK]
ac/alpha[OK]
ac/amd64[OK]
ac/athlon[OK]
ac/ppc[OK]
ac/sparc[OK]
ac/sparc64[OK]

Advanced Search
main()
Powered by PLD Linux
(c) 2002-2018 PLD Team
$Revision: 1.37 $
Powered by GNOME.
Your IP: 54.196.42.8

GLM cae90238-0884-4ef8-bbfe-cd63f4e742b3

Status:Failed
Source URL:ftp://buildlogs.pld-linux.org/th/x86_64/FAIL/GLM,cae90238-0884-4ef8-bbfe-cd63f4e742b3.bz2
text/plain URL:View!
full text:View!
rpm -qa of builder:View!
Date:2018/07/28 08:35:21
Runtime:0:00:20.646224

Toc:

  • error 1
  • /tmp/B.gUuNec/BUILD/glm/test/core/core_func_matrix.cpp:19:34: internal compiler error: in gimplify_expr, at gimplify.c:12385
  • error 2
  • make[2]: *** [test/core/CMakeFiles/test-core_func_matrix.dir/build.make:66: test/core/CMakeFiles/test-core_func_matrix.dir/core_func_matrix.cpp.o] Error 1
  • error 3
  • make[1]: *** [CMakeFiles/Makefile2:1482: test/core/CMakeFiles/test-core_func_matrix.dir/all] Error 2
  • error 4
  • error: Bad exit status from /tmp/B.gUuNec/BUILD/tmp/rpm-tmp.41436 (%build)
  • error 5
  • RPM build errors:
  • error 6
  • error: No files produced.

Content:

make[2]: Leaving directory '/tmp/B.gUuNec/BUILD/glm/build'
make[1]: Entering directory '/tmp/B.gUuNec/BUILD/glm/build'
[ 21%] Built target test-core_setup_force_cxx98
make[1]: Leaving directory '/tmp/B.gUuNec/BUILD/glm/build'
/usr/bin/make -f test/core/CMakeFiles/test-core_func_integer_find_lsb.dir/build.make test/core/CMakeFiles/test-core_func_integer_find_lsb.dir/depend
make[2]: Entering directory '/tmp/B.gUuNec/BUILD/glm/build'
[ 16%] Building CXX object test/core/CMakeFiles/test-core_func_geometric.dir/core_func_geometric.cpp.o
cd /tmp/B.gUuNec/BUILD/glm/build/test/core && /usr/bin/x86_64-pld-linux-g++   -I/tmp/B.gUuNec/BUILD/glm  -O2 -fwrapv -pipe -Wformat -Werror=format-security -gdwarf-4 -fno-debug-types-section -fvar-tracking-assignments -g2 -Wp,-D_FORTIFY_SOURCE=2 -fstack-protector-strong --param=ssp-buffer-size=4 -fPIC -march=x86-64 -gdwarf-4 -fno-debug-types-section -fvar-tracking-assignments -g2  -DNDEBUG -DQT_NO_DEBUG   -Wno-long-long -o CMakeFiles/test-core_func_geometric.dir/core_func_geometric.cpp.o -c /tmp/B.gUuNec/BUILD/glm/test/core/core_func_geometric.cpp
make[2]: Leaving directory '/tmp/B.gUuNec/BUILD/glm/build'
make[2]: Entering directory '/tmp/B.gUuNec/BUILD/glm/build'
cd /tmp/B.gUuNec/BUILD/glm/build && /usr/bin/cmake -E cmake_depends "Unix Makefiles" /tmp/B.gUuNec/BUILD/glm /tmp/B.gUuNec/BUILD/glm/test/core /tmp/B.gUuNec/BUILD/glm/build /tmp/B.gUuNec/BUILD/glm/build/test/core /tmp/B.gUuNec/BUILD/glm/build/test/core/CMakeFiles/test-core_func_integer_find_lsb.dir/DependInfo.cmake --color=
Scanning dependencies of target test-core_func_integer_find_lsb
make[2]: Leaving directory '/tmp/B.gUuNec/BUILD/glm/build'
/usr/bin/make -f test/core/CMakeFiles/test-core_func_integer_find_lsb.dir/build.make test/core/CMakeFiles/test-core_func_integer_find_lsb.dir/build
make[2]: Entering directory '/tmp/B.gUuNec/BUILD/glm/build'
[ 22%] Linking CXX executable test-core_func_geometric
cd /tmp/B.gUuNec/BUILD/glm/build/test/core && /usr/bin/cmake -E cmake_link_script CMakeFiles/test-core_func_geometric.dir/link.txt --verbose=1
/usr/bin/x86_64-pld-linux-g++  -O2 -fwrapv -pipe -Wformat -Werror=format-security -gdwarf-4 -fno-debug-types-section -fvar-tracking-assignments -g2 -Wp,-D_FORTIFY_SOURCE=2 -fstack-protector-strong --param=ssp-buffer-size=4 -fPIC -march=x86-64 -gdwarf-4 -fno-debug-types-section -fvar-tracking-assignments -g2  -DNDEBUG -DQT_NO_DEBUG  -Wl,--as-needed -Wl,--no-copy-dt-needed-entries -Wl,-z,relro -Wl,-z,combreloc -rdynamic CMakeFiles/test-core_func_geometric.dir/core_func_geometric.cpp.o  -o test-core_func_geometric 
make[2]: Leaving directory '/tmp/B.gUuNec/BUILD/glm/build'
make[1]: Entering directory '/tmp/B.gUuNec/BUILD/glm/build'
[ 23%] Built target test-core_func_geometric
make[1]: Leaving directory '/tmp/B.gUuNec/BUILD/glm/build'
/usr/bin/make -f test/core/CMakeFiles/test-core_type_mat2x2.dir/build.make test/core/CMakeFiles/test-core_type_mat2x2.dir/depend
make[2]: Entering directory '/tmp/B.gUuNec/BUILD/glm/build'
cd /tmp/B.gUuNec/BUILD/glm/build && /usr/bin/cmake -E cmake_depends "Unix Makefiles" /tmp/B.gUuNec/BUILD/glm /tmp/B.gUuNec/BUILD/glm/test/core /tmp/B.gUuNec/BUILD/glm/build /tmp/B.gUuNec/BUILD/glm/build/test/core /tmp/B.gUuNec/BUILD/glm/build/test/core/CMakeFiles/test-core_type_mat2x2.dir/DependInfo.cmake --color=
Scanning dependencies of target test-core_type_mat2x2
make[2]: Leaving directory '/tmp/B.gUuNec/BUILD/glm/build'
/usr/bin/make -f test/core/CMakeFiles/test-core_type_mat2x2.dir/build.make test/core/CMakeFiles/test-core_type_mat2x2.dir/build
make[2]: Entering directory '/tmp/B.gUuNec/BUILD/glm/build'
[ 15%] Building CXX object test/core/CMakeFiles/test-core_type_mat4x4.dir/core_type_mat4x4.cpp.o
cd /tmp/B.gUuNec/BUILD/glm/build/test/core && /usr/bin/x86_64-pld-linux-g++   -I/tmp/B.gUuNec/BUILD/glm  -O2 -fwrapv -pipe -Wformat -Werror=format-security -gdwarf-4 -fno-debug-types-section -fvar-tracking-assignments -g2 -Wp,-D_FORTIFY_SOURCE=2 -fstack-protector-strong --param=ssp-buffer-size=4 -fPIC -march=x86-64 -gdwarf-4 -fno-debug-types-section -fvar-tracking-assignments -g2  -DNDEBUG -DQT_NO_DEBUG   -Wno-long-long -o CMakeFiles/test-core_type_mat4x4.dir/core_type_mat4x4.cpp.o -c /tmp/B.gUuNec/BUILD/glm/test/core/core_type_mat4x4.cpp
make[2]: Leaving directory '/tmp/B.gUuNec/BUILD/glm/build'
make[2]: Entering directory '/tmp/B.gUuNec/BUILD/glm/build'
[ 23%] Building CXX object test/core/CMakeFiles/test-core_func_integer_find_lsb.dir/core_func_integer_find_lsb.cpp.o
cd /tmp/B.gUuNec/BUILD/glm/build/test/core && /usr/bin/x86_64-pld-linux-g++   -I/tmp/B.gUuNec/BUILD/glm  -O2 -fwrapv -pipe -Wformat -Werror=format-security -gdwarf-4 -fno-debug-types-section -fvar-tracking-assignments -g2 -Wp,-D_FORTIFY_SOURCE=2 -fstack-protector-strong --param=ssp-buffer-size=4 -fPIC -march=x86-64 -gdwarf-4 -fno-debug-types-section -fvar-tracking-assignments -g2  -DNDEBUG -DQT_NO_DEBUG   -Wno-long-long -o CMakeFiles/test-core_func_integer_find_lsb.dir/core_func_integer_find_lsb.cpp.o -c /tmp/B.gUuNec/BUILD/glm/test/core/core_func_integer_find_lsb.cpp
make[2]: Leaving directory '/tmp/B.gUuNec/BUILD/glm/build'
make[2]: Entering directory '/tmp/B.gUuNec/BUILD/glm/build'
[ 23%] Linking CXX executable test-core_type_mat4x4
cd /tmp/B.gUuNec/BUILD/glm/build/test/core && /usr/bin/cmake -E cmake_link_script CMakeFiles/test-core_type_mat4x4.dir/link.txt --verbose=1
/usr/bin/x86_64-pld-linux-g++  -O2 -fwrapv -pipe -Wformat -Werror=format-security -gdwarf-4 -fno-debug-types-section -fvar-tracking-assignments -g2 -Wp,-D_FORTIFY_SOURCE=2 -fstack-protector-strong --param=ssp-buffer-size=4 -fPIC -march=x86-64 -gdwarf-4 -fno-debug-types-section -fvar-tracking-assignments -g2  -DNDEBUG -DQT_NO_DEBUG  -Wl,--as-needed -Wl,--no-copy-dt-needed-entries -Wl,-z,relro -Wl,-z,combreloc -rdynamic CMakeFiles/test-core_type_mat4x4.dir/core_type_mat4x4.cpp.o  -o test-core_type_mat4x4 
make[2]: Leaving directory '/tmp/B.gUuNec/BUILD/glm/build'
make[2]: Entering directory '/tmp/B.gUuNec/BUILD/glm/build'
[ 23%] Linking CXX executable test-core_func_integer_find_lsb
cd /tmp/B.gUuNec/BUILD/glm/build/test/core && /usr/bin/cmake -E cmake_link_script CMakeFiles/test-core_func_integer_find_lsb.dir/link.txt --verbose=1
/usr/bin/x86_64-pld-linux-g++  -O2 -fwrapv -pipe -Wformat -Werror=format-security -gdwarf-4 -fno-debug-types-section -fvar-tracking-assignments -g2 -Wp,-D_FORTIFY_SOURCE=2 -fstack-protector-strong --param=ssp-buffer-size=4 -fPIC -march=x86-64 -gdwarf-4 -fno-debug-types-section -fvar-tracking-assignments -g2  -DNDEBUG -DQT_NO_DEBUG  -Wl,--as-needed -Wl,--no-copy-dt-needed-entries -Wl,-z,relro -Wl,-z,combreloc -rdynamic CMakeFiles/test-core_func_integer_find_lsb.dir/core_func_integer_find_lsb.cpp.o  -o test-core_func_integer_find_lsb 
make[2]: Leaving directory '/tmp/B.gUuNec/BUILD/glm/build'
make[1]: Entering directory '/tmp/B.gUuNec/BUILD/glm/build'
[ 23%] Built target test-core_type_mat4x4
make[1]: Leaving directory '/tmp/B.gUuNec/BUILD/glm/build'
/usr/bin/make -f test/core/CMakeFiles/test-core_type_mat3x3.dir/build.make test/core/CMakeFiles/test-core_type_mat3x3.dir/depend
make[1]: Entering directory '/tmp/B.gUuNec/BUILD/glm/build'
[ 23%] Built target test-core_func_integer_find_lsb
make[1]: Leaving directory '/tmp/B.gUuNec/BUILD/glm/build'
/usr/bin/make -f test/core/CMakeFiles/test-core_func_matrix.dir/build.make test/core/CMakeFiles/test-core_func_matrix.dir/depend
make[2]: Entering directory '/tmp/B.gUuNec/BUILD/glm/build'
cd /tmp/B.gUuNec/BUILD/glm/build && /usr/bin/cmake -E cmake_depends "Unix Makefiles" /tmp/B.gUuNec/BUILD/glm /tmp/B.gUuNec/BUILD/glm/test/core /tmp/B.gUuNec/BUILD/glm/build /tmp/B.gUuNec/BUILD/glm/build/test/core /tmp/B.gUuNec/BUILD/glm/build/test/core/CMakeFiles/test-core_type_mat3x3.dir/DependInfo.cmake --color=
Scanning dependencies of target test-core_type_mat3x3
make[2]: Leaving directory '/tmp/B.gUuNec/BUILD/glm/build'
/usr/bin/make -f test/core/CMakeFiles/test-core_type_mat3x3.dir/build.make test/core/CMakeFiles/test-core_type_mat3x3.dir/build
make[2]: Entering directory '/tmp/B.gUuNec/BUILD/glm/build'
cd /tmp/B.gUuNec/BUILD/glm/build && /usr/bin/cmake -E cmake_depends "Unix Makefiles" /tmp/B.gUuNec/BUILD/glm /tmp/B.gUuNec/BUILD/glm/test/core /tmp/B.gUuNec/BUILD/glm/build /tmp/B.gUuNec/BUILD/glm/build/test/core /tmp/B.gUuNec/BUILD/glm/build/test/core/CMakeFiles/test-core_func_matrix.dir/DependInfo.cmake --color=
Scanning dependencies of target test-core_func_matrix
make[2]: Leaving directory '/tmp/B.gUuNec/BUILD/glm/build'
/usr/bin/make -f test/core/CMakeFiles/test-core_func_matrix.dir/build.make test/core/CMakeFiles/test-core_func_matrix.dir/build
make[2]: Entering directory '/tmp/B.gUuNec/BUILD/glm/build'
[ 23%] Building CXX object test/core/CMakeFiles/test-core_type_mat2x2.dir/core_type_mat2x2.cpp.o
cd /tmp/B.gUuNec/BUILD/glm/build/test/core && /usr/bin/x86_64-pld-linux-g++   -I/tmp/B.gUuNec/BUILD/glm  -O2 -fwrapv -pipe -Wformat -Werror=format-security -gdwarf-4 -fno-debug-types-section -fvar-tracking-assignments -g2 -Wp,-D_FORTIFY_SOURCE=2 -fstack-protector-strong --param=ssp-buffer-size=4 -fPIC -march=x86-64 -gdwarf-4 -fno-debug-types-section -fvar-tracking-assignments -g2  -DNDEBUG -DQT_NO_DEBUG   -Wno-long-long -o CMakeFiles/test-core_type_mat2x2.dir/core_type_mat2x2.cpp.o -c /tmp/B.gUuNec/BUILD/glm/test/core/core_type_mat2x2.cpp
make[2]: Leaving directory '/tmp/B.gUuNec/BUILD/glm/build'
make[2]: Entering directory '/tmp/B.gUuNec/BUILD/glm/build'
[ 24%] Linking CXX executable test-core_type_mat2x2
cd /tmp/B.gUuNec/BUILD/glm/build/test/core && /usr/bin/cmake -E cmake_link_script CMakeFiles/test-core_type_mat2x2.dir/link.txt --verbose=1
/usr/bin/x86_64-pld-linux-g++  -O2 -fwrapv -pipe -Wformat -Werror=format-security -gdwarf-4 -fno-debug-types-section -fvar-tracking-assignments -g2 -Wp,-D_FORTIFY_SOURCE=2 -fstack-protector-strong --param=ssp-buffer-size=4 -fPIC -march=x86-64 -gdwarf-4 -fno-debug-types-section -fvar-tracking-assignments -g2  -DNDEBUG -DQT_NO_DEBUG  -Wl,--as-needed -Wl,--no-copy-dt-needed-entries -Wl,-z,relro -Wl,-z,combreloc -rdynamic CMakeFiles/test-core_type_mat2x2.dir/core_type_mat2x2.cpp.o  -o test-core_type_mat2x2 
make[2]: Leaving directory '/tmp/B.gUuNec/BUILD/glm/build'
make[1]: Entering directory '/tmp/B.gUuNec/BUILD/glm/build'
[ 24%] Built target test-core_type_mat2x2
make[1]: Leaving directory '/tmp/B.gUuNec/BUILD/glm/build'
/usr/bin/make -f test/core/CMakeFiles/test-core_type_cast.dir/build.make test/core/CMakeFiles/test-core_type_cast.dir/depend
make[2]: Entering directory '/tmp/B.gUuNec/BUILD/glm/build'
cd /tmp/B.gUuNec/BUILD/glm/build && /usr/bin/cmake -E cmake_depends "Unix Makefiles" /tmp/B.gUuNec/BUILD/glm /tmp/B.gUuNec/BUILD/glm/test/core /tmp/B.gUuNec/BUILD/glm/build /tmp/B.gUuNec/BUILD/glm/build/test/core /tmp/B.gUuNec/BUILD/glm/build/test/core/CMakeFiles/test-core_type_cast.dir/DependInfo.cmake --color=
Scanning dependencies of target test-core_type_cast
make[2]: Leaving directory '/tmp/B.gUuNec/BUILD/glm/build'
/usr/bin/make -f test/core/CMakeFiles/test-core_type_cast.dir/build.make test/core/CMakeFiles/test-core_type_cast.dir/build
make[2]: Entering directory '/tmp/B.gUuNec/BUILD/glm/build'
[ 21%] Building CXX object test/core/CMakeFiles/test-core_func_common.dir/core_func_common.cpp.o
cd /tmp/B.gUuNec/BUILD/glm/build/test/core && /usr/bin/x86_64-pld-linux-g++   -I/tmp/B.gUuNec/BUILD/glm  -O2 -fwrapv -pipe -Wformat -Werror=format-security -gdwarf-4 -fno-debug-types-section -fvar-tracking-assignments -g2 -Wp,-D_FORTIFY_SOURCE=2 -fstack-protector-strong --param=ssp-buffer-size=4 -fPIC -march=x86-64 -gdwarf-4 -fno-debug-types-section -fvar-tracking-assignments -g2  -DNDEBUG -DQT_NO_DEBUG   -Wno-long-long -o CMakeFiles/test-core_func_common.dir/core_func_common.cpp.o -c /tmp/B.gUuNec/BUILD/glm/test/core/core_func_common.cpp
make[2]: Leaving directory '/tmp/B.gUuNec/BUILD/glm/build'
make[2]: Entering directory '/tmp/B.gUuNec/BUILD/glm/build'
[ 25%] Linking CXX executable test-core_func_common
cd /tmp/B.gUuNec/BUILD/glm/build/test/core && /usr/bin/cmake -E cmake_link_script CMakeFiles/test-core_func_common.dir/link.txt --verbose=1
/usr/bin/x86_64-pld-linux-g++  -O2 -fwrapv -pipe -Wformat -Werror=format-security -gdwarf-4 -fno-debug-types-section -fvar-tracking-assignments -g2 -Wp,-D_FORTIFY_SOURCE=2 -fstack-protector-strong --param=ssp-buffer-size=4 -fPIC -march=x86-64 -gdwarf-4 -fno-debug-types-section -fvar-tracking-assignments -g2  -DNDEBUG -DQT_NO_DEBUG  -Wl,--as-needed -Wl,--no-copy-dt-needed-entries -Wl,-z,relro -Wl,-z,combreloc -rdynamic CMakeFiles/test-core_func_common.dir/core_func_common.cpp.o  -o test-core_func_common 
make[2]: Leaving directory '/tmp/B.gUuNec/BUILD/glm/build'
make[2]: Entering directory '/tmp/B.gUuNec/BUILD/glm/build'
[ 23%] Building CXX object test/core/CMakeFiles/test-core_type_mat3x3.dir/core_type_mat3x3.cpp.o
cd /tmp/B.gUuNec/BUILD/glm/build/test/core && /usr/bin/x86_64-pld-linux-g++   -I/tmp/B.gUuNec/BUILD/glm  -O2 -fwrapv -pipe -Wformat -Werror=format-security -gdwarf-4 -fno-debug-types-section -fvar-tracking-assignments -g2 -Wp,-D_FORTIFY_SOURCE=2 -fstack-protector-strong --param=ssp-buffer-size=4 -fPIC -march=x86-64 -gdwarf-4 -fno-debug-types-section -fvar-tracking-assignments -g2  -DNDEBUG -DQT_NO_DEBUG   -Wno-long-long -o CMakeFiles/test-core_type_mat3x3.dir/core_type_mat3x3.cpp.o -c /tmp/B.gUuNec/BUILD/glm/test/core/core_type_mat3x3.cpp
make[2]: Leaving directory '/tmp/B.gUuNec/BUILD/glm/build'
make[2]: Entering directory '/tmp/B.gUuNec/BUILD/glm/build'
[ 24%] Building CXX object test/core/CMakeFiles/test-core_func_matrix.dir/core_func_matrix.cpp.o
cd /tmp/B.gUuNec/BUILD/glm/build/test/core && /usr/bin/x86_64-pld-linux-g++   -I/tmp/B.gUuNec/BUILD/glm  -O2 -fwrapv -pipe -Wformat -Werror=format-security -gdwarf-4 -fno-debug-types-section -fvar-tracking-assignments -g2 -Wp,-D_FORTIFY_SOURCE=2 -fstack-protector-strong --param=ssp-buffer-size=4 -fPIC -march=x86-64 -gdwarf-4 -fno-debug-types-section -fvar-tracking-assignments -g2  -DNDEBUG -DQT_NO_DEBUG   -Wno-long-long -o CMakeFiles/test-core_func_matrix.dir/core_func_matrix.cpp.o -c /tmp/B.gUuNec/BUILD/glm/test/core/core_func_matrix.cpp
/tmp/B.gUuNec/BUILD/glm/test/core/core_func_matrix.cpp: In function 'int test_matrixCompMult()':
/tmp/B.gUuNec/BUILD/glm/test/core/core_func_matrix.cpp:19:34: internal compiler error: in gimplify_expr, at gimplify.c:12385
   mat2 expected = mat2(0, 1, 4, 9);
                                  ^
Please submit a full bug report,
with preprocessed source if appropriate.
See <http://bugs.pld-linux.org> for instructions.
make[2]: *** [test/core/CMakeFiles/test-core_func_matrix.dir/build.make:66: test/core/CMakeFiles/test-core_func_matrix.dir/core_func_matrix.cpp.o] Error 1
make[2]: Leaving directory '/tmp/B.gUuNec/BUILD/glm/build'
make[1]: *** [CMakeFiles/Makefile2:1482: test/core/CMakeFiles/test-core_func_matrix.dir/all] Error 2
make[1]: *** Waiting for unfinished jobs....
make[1]: Entering directory '/tmp/B.gUuNec/BUILD/glm/build'
[ 26%] Built target test-core_func_common
make[1]: Leaving directory '/tmp/B.gUuNec/BUILD/glm/build'
make[2]: Entering directory '/tmp/B.gUuNec/BUILD/glm/build'
[ 26%] Linking CXX executable test-core_type_mat3x3
cd /tmp/B.gUuNec/BUILD/glm/build/test/core && /usr/bin/cmake -E cmake_link_script CMakeFiles/test-core_type_mat3x3.dir/link.txt --verbose=1
/usr/bin/x86_64-pld-linux-g++  -O2 -fwrapv -pipe -Wformat -Werror=format-security -gdwarf-4 -fno-debug-types-section -fvar-tracking-assignments -g2 -Wp,-D_FORTIFY_SOURCE=2 -fstack-protector-strong --param=ssp-buffer-size=4 -fPIC -march=x86-64 -gdwarf-4 -fno-debug-types-section -fvar-tracking-assignments -g2  -DNDEBUG -DQT_NO_DEBUG  -Wl,--as-needed -Wl,--no-copy-dt-needed-entries -Wl,-z,relro -Wl,-z,combreloc -rdynamic CMakeFiles/test-core_type_mat3x3.dir/core_type_mat3x3.cpp.o  -o test-core_type_mat3x3 
make[2]: Leaving directory '/tmp/B.gUuNec/BUILD/glm/build'
make[1]: Entering directory '/tmp/B.gUuNec/BUILD/glm/build'
[ 26%] Built target test-core_type_mat3x3
make[1]: Leaving directory '/tmp/B.gUuNec/BUILD/glm/build'
make[2]: Entering directory '/tmp/B.gUuNec/BUILD/glm/build'
[  6%] Building CXX object glm/CMakeFiles/glm_dummy.dir/detail/glm.cpp.o
cd /tmp/B.gUuNec/BUILD/glm/build/glm && /usr/bin/x86_64-pld-linux-g++   -I/tmp/B.gUuNec/BUILD/glm -I/tmp/B.gUuNec/BUILD/glm/glm/..  -O2 -fwrapv -pipe -Wformat -Werror=format-security -gdwarf-4 -fno-debug-types-section -fvar-tracking-assignments -g2 -Wp,-D_FORTIFY_SOURCE=2 -fstack-protector-strong --param=ssp-buffer-size=4 -fPIC -march=x86-64 -gdwarf-4 -fno-debug-types-section -fvar-tracking-assignments -g2  -DNDEBUG -DQT_NO_DEBUG   -Wno-long-long -o CMakeFiles/glm_dummy.dir/detail/glm.cpp.o -c /tmp/B.gUuNec/BUILD/glm/glm/detail/glm.cpp
make[2]: Leaving directory '/tmp/B.gUuNec/BUILD/glm/build'
make[2]: Entering directory '/tmp/B.gUuNec/BUILD/glm/build'
[ 27%] Linking CXX executable glm_dummy
cd /tmp/B.gUuNec/BUILD/glm/build/glm && /usr/bin/cmake -E cmake_link_script CMakeFiles/glm_dummy.dir/link.txt --verbose=1
/usr/bin/x86_64-pld-linux-g++  -O2 -fwrapv -pipe -Wformat -Werror=format-security -gdwarf-4 -fno-debug-types-section -fvar-tracking-assignments -g2 -Wp,-D_FORTIFY_SOURCE=2 -fstack-protector-strong --param=ssp-buffer-size=4 -fPIC -march=x86-64 -gdwarf-4 -fno-debug-types-section -fvar-tracking-assignments -g2  -DNDEBUG -DQT_NO_DEBUG  -Wl,--as-needed -Wl,--no-copy-dt-needed-entries -Wl,-z,relro -Wl,-z,combreloc -rdynamic CMakeFiles/glm_dummy.dir/detail/dummy.cpp.o CMakeFiles/glm_dummy.dir/detail/glm.cpp.o  -o glm_dummy 
make[2]: Leaving directory '/tmp/B.gUuNec/BUILD/glm/build'
make[1]: Entering directory '/tmp/B.gUuNec/BUILD/glm/build'
[ 27%] Built target glm_dummy
make[1]: Leaving directory '/tmp/B.gUuNec/BUILD/glm/build'
make[2]: Entering directory '/tmp/B.gUuNec/BUILD/glm/build'
[  9%] Building CXX object test/core/CMakeFiles/test-core_type_vec3.dir/core_type_vec3.cpp.o
cd /tmp/B.gUuNec/BUILD/glm/build/test/core && /usr/bin/x86_64-pld-linux-g++   -I/tmp/B.gUuNec/BUILD/glm  -O2 -fwrapv -pipe -Wformat -Werror=format-security -gdwarf-4 -fno-debug-types-section -fvar-tracking-assignments -g2 -Wp,-D_FORTIFY_SOURCE=2 -fstack-protector-strong --param=ssp-buffer-size=4 -fPIC -march=x86-64 -gdwarf-4 -fno-debug-types-section -fvar-tracking-assignments -g2  -DNDEBUG -DQT_NO_DEBUG   -Wno-long-long -o CMakeFiles/test-core_type_vec3.dir/core_type_vec3.cpp.o -c /tmp/B.gUuNec/BUILD/glm/test/core/core_type_vec3.cpp
make[2]: Leaving directory '/tmp/B.gUuNec/BUILD/glm/build'
make[2]: Entering directory '/tmp/B.gUuNec/BUILD/glm/build'
[ 28%] Linking CXX executable test-core_type_vec3
cd /tmp/B.gUuNec/BUILD/glm/build/test/core && /usr/bin/cmake -E cmake_link_script CMakeFiles/test-core_type_vec3.dir/link.txt --verbose=1
/usr/bin/x86_64-pld-linux-g++  -O2 -fwrapv -pipe -Wformat -Werror=format-security -gdwarf-4 -fno-debug-types-section -fvar-tracking-assignments -g2 -Wp,-D_FORTIFY_SOURCE=2 -fstack-protector-strong --param=ssp-buffer-size=4 -fPIC -march=x86-64 -gdwarf-4 -fno-debug-types-section -fvar-tracking-assignments -g2  -DNDEBUG -DQT_NO_DEBUG  -Wl,--as-needed -Wl,--no-copy-dt-needed-entries -Wl,-z,relro -Wl,-z,combreloc -rdynamic CMakeFiles/test-core_type_vec3.dir/core_type_vec3.cpp.o  -o test-core_type_vec3 
make[2]: Leaving directory '/tmp/B.gUuNec/BUILD/glm/build'
make[1]: Entering directory '/tmp/B.gUuNec/BUILD/glm/build'
[ 28%] Built target test-core_type_vec3
make[1]: Leaving directory '/tmp/B.gUuNec/BUILD/glm/build'
make[2]: Entering directory '/tmp/B.gUuNec/BUILD/glm/build'
[ 25%] Building CXX object test/core/CMakeFiles/test-core_type_cast.dir/core_type_cast.cpp.o
cd /tmp/B.gUuNec/BUILD/glm/build/test/core && /usr/bin/x86_64-pld-linux-g++   -I/tmp/B.gUuNec/BUILD/glm  -O2 -fwrapv -pipe -Wformat -Werror=format-security -gdwarf-4 -fno-debug-types-section -fvar-tracking-assignments -g2 -Wp,-D_FORTIFY_SOURCE=2 -fstack-protector-strong --param=ssp-buffer-size=4 -fPIC -march=x86-64 -gdwarf-4 -fno-debug-types-section -fvar-tracking-assignments -g2  -DNDEBUG -DQT_NO_DEBUG   -Wno-long-long -o CMakeFiles/test-core_type_cast.dir/core_type_cast.cpp.o -c /tmp/B.gUuNec/BUILD/glm/test/core/core_type_cast.cpp
make[2]: Leaving directory '/tmp/B.gUuNec/BUILD/glm/build'
make[2]: Entering directory '/tmp/B.gUuNec/BUILD/glm/build'
[ 28%] Linking CXX executable test-core_type_cast
cd /tmp/B.gUuNec/BUILD/glm/build/test/core && /usr/bin/cmake -E cmake_link_script CMakeFiles/test-core_type_cast.dir/link.txt --verbose=1
/usr/bin/x86_64-pld-linux-g++  -O2 -fwrapv -pipe -Wformat -Werror=format-security -gdwarf-4 -fno-debug-types-section -fvar-tracking-assignments -g2 -Wp,-D_FORTIFY_SOURCE=2 -fstack-protector-strong --param=ssp-buffer-size=4 -fPIC -march=x86-64 -gdwarf-4 -fno-debug-types-section -fvar-tracking-assignments -g2  -DNDEBUG -DQT_NO_DEBUG  -Wl,--as-needed -Wl,--no-copy-dt-needed-entries -Wl,-z,relro -Wl,-z,combreloc -rdynamic CMakeFiles/test-core_type_cast.dir/core_type_cast.cpp.o  -o test-core_type_cast 
make[2]: Leaving directory '/tmp/B.gUuNec/BUILD/glm/build'
make[1]: Entering directory '/tmp/B.gUuNec/BUILD/glm/build'
[ 28%] Built target test-core_type_cast
make[1]: Leaving directory '/tmp/B.gUuNec/BUILD/glm/build'
make[2]: Entering directory '/tmp/B.gUuNec/BUILD/glm/build'
[ 18%] Building CXX object test/core/CMakeFiles/test-core_type_vec2.dir/core_type_vec2.cpp.o
cd /tmp/B.gUuNec/BUILD/glm/build/test/core && /usr/bin/x86_64-pld-linux-g++   -I/tmp/B.gUuNec/BUILD/glm  -O2 -fwrapv -pipe -Wformat -Werror=format-security -gdwarf-4 -fno-debug-types-section -fvar-tracking-assignments -g2 -Wp,-D_FORTIFY_SOURCE=2 -fstack-protector-strong --param=ssp-buffer-size=4 -fPIC -march=x86-64 -gdwarf-4 -fno-debug-types-section -fvar-tracking-assignments -g2  -DNDEBUG -DQT_NO_DEBUG   -Wno-long-long -o CMakeFiles/test-core_type_vec2.dir/core_type_vec2.cpp.o -c /tmp/B.gUuNec/BUILD/glm/test/core/core_type_vec2.cpp
make[2]: Leaving directory '/tmp/B.gUuNec/BUILD/glm/build'
make[2]: Entering directory '/tmp/B.gUuNec/BUILD/glm/build'
[ 29%] Linking CXX executable test-core_type_vec2
cd /tmp/B.gUuNec/BUILD/glm/build/test/core && /usr/bin/cmake -E cmake_link_script CMakeFiles/test-core_type_vec2.dir/link.txt --verbose=1
/usr/bin/x86_64-pld-linux-g++  -O2 -fwrapv -pipe -Wformat -Werror=format-security -gdwarf-4 -fno-debug-types-section -fvar-tracking-assignments -g2 -Wp,-D_FORTIFY_SOURCE=2 -fstack-protector-strong --param=ssp-buffer-size=4 -fPIC -march=x86-64 -gdwarf-4 -fno-debug-types-section -fvar-tracking-assignments -g2  -DNDEBUG -DQT_NO_DEBUG  -Wl,--as-needed -Wl,--no-copy-dt-needed-entries -Wl,-z,relro -Wl,-z,combreloc -rdynamic CMakeFiles/test-core_type_vec2.dir/core_type_vec2.cpp.o  -o test-core_type_vec2 
make[2]: Leaving directory '/tmp/B.gUuNec/BUILD/glm/build'
make[1]: Entering directory '/tmp/B.gUuNec/BUILD/glm/build'
[ 29%] Built target test-core_type_vec2
make[1]: Leaving directory '/tmp/B.gUuNec/BUILD/glm/build'
make[2]: Entering directory '/tmp/B.gUuNec/BUILD/glm/build'
[ 10%] Building CXX object test/core/CMakeFiles/test-core_force_pure.dir/core_force_pure.cpp.o
cd /tmp/B.gUuNec/BUILD/glm/build/test/core && /usr/bin/x86_64-pld-linux-g++   -I/tmp/B.gUuNec/BUILD/glm  -O2 -fwrapv -pipe -Wformat -Werror=format-security -gdwarf-4 -fno-debug-types-section -fvar-tracking-assignments -g2 -Wp,-D_FORTIFY_SOURCE=2 -fstack-protector-strong --param=ssp-buffer-size=4 -fPIC -march=x86-64 -gdwarf-4 -fno-debug-types-section -fvar-tracking-assignments -g2  -DNDEBUG -DQT_NO_DEBUG   -Wno-long-long -o CMakeFiles/test-core_force_pure.dir/core_force_pure.cpp.o -c /tmp/B.gUuNec/BUILD/glm/test/core/core_force_pure.cpp
make[2]: Leaving directory '/tmp/B.gUuNec/BUILD/glm/build'
make[2]: Entering directory '/tmp/B.gUuNec/BUILD/glm/build'
[ 29%] Linking CXX executable test-core_force_pure
cd /tmp/B.gUuNec/BUILD/glm/build/test/core && /usr/bin/cmake -E cmake_link_script CMakeFiles/test-core_force_pure.dir/link.txt --verbose=1
/usr/bin/x86_64-pld-linux-g++  -O2 -fwrapv -pipe -Wformat -Werror=format-security -gdwarf-4 -fno-debug-types-section -fvar-tracking-assignments -g2 -Wp,-D_FORTIFY_SOURCE=2 -fstack-protector-strong --param=ssp-buffer-size=4 -fPIC -march=x86-64 -gdwarf-4 -fno-debug-types-section -fvar-tracking-assignments -g2  -DNDEBUG -DQT_NO_DEBUG  -Wl,--as-needed -Wl,--no-copy-dt-needed-entries -Wl,-z,relro -Wl,-z,combreloc -rdynamic CMakeFiles/test-core_force_pure.dir/core_force_pure.cpp.o  -o test-core_force_pure 
make[2]: Leaving directory '/tmp/B.gUuNec/BUILD/glm/build'
make[1]: Entering directory '/tmp/B.gUuNec/BUILD/glm/build'
[ 29%] Built target test-core_force_pure
make[1]: Leaving directory '/tmp/B.gUuNec/BUILD/glm/build'
make[2]: Entering directory '/tmp/B.gUuNec/BUILD/glm/build'
[ 15%] Building CXX object test/core/CMakeFiles/test-core_type_vec4.dir/core_type_vec4.cpp.o
cd /tmp/B.gUuNec/BUILD/glm/build/test/core && /usr/bin/x86_64-pld-linux-g++   -I/tmp/B.gUuNec/BUILD/glm  -O2 -fwrapv -pipe -Wformat -Werror=format-security -gdwarf-4 -fno-debug-types-section -fvar-tracking-assignments -g2 -Wp,-D_FORTIFY_SOURCE=2 -fstack-protector-strong --param=ssp-buffer-size=4 -fPIC -march=x86-64 -gdwarf-4 -fno-debug-types-section -fvar-tracking-assignments -g2  -DNDEBUG -DQT_NO_DEBUG   -Wno-long-long -o CMakeFiles/test-core_type_vec4.dir/core_type_vec4.cpp.o -c /tmp/B.gUuNec/BUILD/glm/test/core/core_type_vec4.cpp
make[2]: Leaving directory '/tmp/B.gUuNec/BUILD/glm/build'
make[2]: Entering directory '/tmp/B.gUuNec/BUILD/glm/build'
[ 29%] Linking CXX executable test-core_type_vec4
cd /tmp/B.gUuNec/BUILD/glm/build/test/core && /usr/bin/cmake -E cmake_link_script CMakeFiles/test-core_type_vec4.dir/link.txt --verbose=1
/usr/bin/x86_64-pld-linux-g++  -O2 -fwrapv -pipe -Wformat -Werror=format-security -gdwarf-4 -fno-debug-types-section -fvar-tracking-assignments -g2 -Wp,-D_FORTIFY_SOURCE=2 -fstack-protector-strong --param=ssp-buffer-size=4 -fPIC -march=x86-64 -gdwarf-4 -fno-debug-types-section -fvar-tracking-assignments -g2  -DNDEBUG -DQT_NO_DEBUG  -Wl,--as-needed -Wl,--no-copy-dt-needed-entries -Wl,-z,relro -Wl,-z,combreloc -rdynamic CMakeFiles/test-core_type_vec4.dir/core_type_vec4.cpp.o  -o test-core_type_vec4 
make[2]: Leaving directory '/tmp/B.gUuNec/BUILD/glm/build'
make[1]: Entering directory '/tmp/B.gUuNec/BUILD/glm/build'
[ 29%] Built target test-core_type_vec4
make[1]: Leaving directory '/tmp/B.gUuNec/BUILD/glm/build'
make: *** [Makefile:144: all] Error 2
error: Bad exit status from /tmp/B.gUuNec/BUILD/tmp/rpm-tmp.41436 (%build)


RPM build errors:
    Bad exit status from /tmp/B.gUuNec/BUILD/tmp/rpm-tmp.41436 (%build)
ended at: Sat Jul 28 08:35:21 2018, done in 0:00:20.646224
error: No files produced.
mesg: ttyname failed: Inappropriate ioctl for device
+ chmod -R u+rwX /tmp/B.gUuNec/BUILD
+ rm -rf /tmp/B.gUuNec/tmp /tmp/B.gUuNec/BUILD
mesg: ttyname failed: Inappropriate ioctl for device
+ rm -rf /tmp/B.gUuNec
Begin-PLD-Builder-Info
Build-Time: user:88.02s sys:7.40s real:24.48s (faults io:0 non-io:1934080)

End-PLD-Builder-Info
[Back to list of logs] [View rpm -qa of builder]