FailedOk

th/SRPMS[OK]
th/x32[OK]
th/i686[OK]
th/x86_64[OK]

ac/SRPMS[OK]
ac/i386[OK]
ac/i586[OK]
ac/i686[OK]
ac/alpha[OK]
ac/amd64[OK]
ac/athlon[OK]
ac/ppc[OK]
ac/sparc[OK]
ac/sparc64[OK]

Advanced Search
main()
Powered by PLD Linux
(c) 2002-2017 PLD Team
$Revision: 1.37 $
Powered by quantum bogodynamics.
Your IP: 54.92.201.232

OpenNI 51a57a82-42fe-477a-b06e-95bb37f462e7

Status:Failed
Source URL:ftp://buildlogs.pld-linux.org/th/x86_64/FAIL/OpenNI,51a57a82-42fe-477a-b06e-95bb37f462e7.bz2
text/plain URL:View!
rpm -qa of builder:View!
Date:2017/11/28 23:59:03
Runtime:0:00:19.104273

Toc:

  • prep
  • Executing(%prep): /bin/sh -e /tmp/B.jXlV1P/BUILD/tmp/rpm-tmp.32781
  • build
  • Executing(%build): /bin/sh -e /tmp/B.jXlV1P/BUILD/tmp/rpm-tmp.32781
  • error 1
  • /usr/include/c++/7.2.0/system_error:115:5: error: expected unqualified-id before 'int'
  • error 2
  • /usr/include/c++/7.2.0/system_error:115:5: error: expected ')' before 'int'
  • error 3
  • /usr/include/c++/7.2.0/system_error:115:5: error: expected ')' before 'int'
  • error 4
  • /usr/include/c++/7.2.0/system_error:115:5: error: expected ')' before 'int'
  • error 5
  • /usr/include/c++/7.2.0/system_error:118:5: error: expected unqualified-id before 'const'
  • error 6
  • /usr/include/c++/7.2.0/system_error:118:5: error: expected ')' before 'const'
  • error 7
  • /usr/include/c++/7.2.0/system_error:118:5: error: expected ')' before 'const'
  • error 8
  • /usr/include/c++/7.2.0/system_error:118:5: error: expected ')' before 'const'
  • error 9
  • /usr/include/c++/7.2.0/system_error: In function 'bool std::operator==(const std::error_code&, const std::error_condition&)':
  • error 10
  • ../../../../../Samples/NiViewer/glh/glh_linear.h:80:33: error: expected unqualified-id before '(' token
  • error 11
  • ../../../../../Samples/NiViewer/glh/glh_linear.h:80:42: error: no match for 'operator+' (operand types are 'const std::error_condition' and 'float')
  • error 12
  • ../../../../../Samples/NiViewer/glh/glh_linear.h:80:67: error: no match for 'operator-' (operand types are 'const std::error_condition' and 'float')
  • error 13
  • ../../../../../Samples/NiViewer/glh/glh_linear.h:80:33: error: expected unqualified-id before '(' token
  • error 14
  • ../../../../../Samples/NiViewer/glh/glh_linear.h:80:38: error: no match for 'operator<' (operand types are 'const std::error_code' and 'float')
  • error 15
  • /usr/include/c++/7.2.0/system_error:208:3: note: candidate: bool std::operator<(const std::error_code&, const std::error_code&)
  • error 16
  • /usr/include/c++/7.2.0/system_error:208:3: note: no known conversion for argument 2 from 'float' to 'const std::error_code&'
  • error 17
  • /usr/include/c++/7.2.0/system_error:282:3: note: candidate: bool std::operator<(const std::error_condition&, const std::error_condition&)
  • error 18
  • /usr/include/c++/7.2.0/system_error:282:3: note: no known conversion for argument 1 from 'const std::error_code' to 'const std::error_condition&'
  • error 19
  • ../../../../../Samples/NiViewer/glh/glh_linear.h:80:63: error: no match for 'operator>' (operand types are 'const std::error_code' and 'float')
  • error 20
  • /usr/include/c++/7.2.0/system_error: In function 'bool std::operator==(const std::error_condition&, const std::error_code&)':
  • error 21
  • ../../../../../Samples/NiViewer/glh/glh_linear.h:80:33: error: expected unqualified-id before '(' token
  • error 22
  • ../../../../../Samples/NiViewer/glh/glh_linear.h:80:42: error: no match for 'operator+' (operand types are 'const std::error_condition' and 'float')
  • error 23
  • ../../../../../Samples/NiViewer/glh/glh_linear.h:80:67: error: no match for 'operator-' (operand types are 'const std::error_condition' and 'float')
  • error 24
  • ../../../../../Samples/NiViewer/glh/glh_linear.h:80:33: error: expected unqualified-id before '(' token
  • error 25
  • ../../../../../Samples/NiViewer/glh/glh_linear.h:80:38: error: no match for 'operator<' (operand types are 'const std::error_code' and 'float')
  • error 26
  • /usr/include/c++/7.2.0/system_error:208:3: note: candidate: bool std::operator<(const std::error_code&, const std::error_code&)
  • error 27
  • /usr/include/c++/7.2.0/system_error:208:3: note: no known conversion for argument 2 from 'float' to 'const std::error_code&'
  • error 28
  • /usr/include/c++/7.2.0/system_error:282:3: note: candidate: bool std::operator<(const std::error_condition&, const std::error_condition&)
  • error 29
  • /usr/include/c++/7.2.0/system_error:282:3: note: no known conversion for argument 1 from 'const std::error_code' to 'const std::error_condition&'
  • error 30
  • ../../../../../Samples/NiViewer/glh/glh_linear.h:80:63: error: no match for 'operator>' (operand types are 'const std::error_code' and 'float')
  • error 31
  • error: Bad exit status from /tmp/B.jXlV1P/BUILD/tmp/rpm-tmp.32781 (%build)
  • error 32
  • RPM build errors:
  • error 33
  • error: No files produced.

Content:

request from: baggins
checking if we should skip the build
started at: Tue Nov 28 23:58:37 2017
fetching https://srcbuilder.pld-linux.org/th//srpms/51a57a82-42fe-477a-b06e-95bb37f462e7/OpenNI-1.5.7.10-4.src.rpm
fetched 23390996 bytes, 4033.6 K/s
installing srpm: OpenNI-1.5.7.10-4.src.rpm
mesg: ttyname failed: Inappropriate ioctl for device
+ install -d /tmp/B.jXlV1P/BUILD /tmp/B.jXlV1P/RPMS
+ LC_ALL=en_US.UTF-8
+ rpm -qp --changelog OpenNI-1.5.7.10-4.src.rpm
* Tue Nov 28 2017 PLD Linux Team <feedback@pld-linux.org>
- For complete changelog see: http://git.pld-linux.org/?p=packages/OpenNI.git;a=log;h=master
+ rpm -Uhv --nodeps --define '_topdir /tmp/B.jXlV1P' --define '_specdir %{_topdir}' --define '_sourcedir %{_specdir}' --define '_rpmdir %{_topdir}/RPMS' --define '_builddir %{_topdir}/BUILD' OpenNI-1.5.7.10-4.src.rpm Preparing... ################################################## OpenNI ################################################## + rm -f OpenNI-1.5.7.10-4.src.rpm mesg: ttyname failed: Inappropriate ioctl for device + install -m 700 -d /tmp/B.jXlV1P/BUILD/tmp mesg: ttyname failed: Inappropriate ioctl for device + TMPDIR=/tmp/B.jXlV1P/BUILD/tmp + exec nice -n 0 rpmbuild -bp --short-circuit --nodeps --define '_topdir /tmp/B.jXlV1P' --define '_specdir %{_topdir}' --define '_sourcedir %{_specdir}' --define '_rpmdir %{_topdir}/RPMS' --define '_builddir %{_topdir}/BUILD' --target x86_64-pld-linux --define 'prep exit 0' /tmp/B.jXlV1P/OpenNI.spec Building target platforms: x86_64-pld-linux checking BuildConflict-ing packages no BuildConflicts found checking BR rpm: Building target platforms: x86_64-pld-linux no BR needed building RPM using: set -ex; : build-id: 51a57a82-42fe-477a-b06e-95bb37f462e7; TMPDIR=/tmp/B.jXlV1P/BUILD/tmp exec nice -n 0 rpmbuild -bb --define '_smp_mflags -j5' --define '_make_opts -Otarget' --define '_pld_builder 1' --define '_topdir /tmp/B.jXlV1P' --define '_specdir %{_topdir}' --define '_sourcedir %{_specdir}' --define '_rpmdir %{_topdir}/RPMS' --define '_builddir %{_topdir}/BUILD' --target x86_64-pld-linux /tmp/B.jXlV1P/OpenNI.spec mesg: ttyname failed: Inappropriate ioctl for device + : build-id: 51a57a82-42fe-477a-b06e-95bb37f462e7 + TMPDIR=/tmp/B.jXlV1P/BUILD/tmp + exec nice -n 0 rpmbuild -bb --define '_smp_mflags -j5' --define '_make_opts -Otarget' --define '_pld_builder 1' --define '_topdir /tmp/B.jXlV1P' --define '_specdir %{_topdir}' --define '_sourcedir %{_specdir}' --define '_rpmdir %{_topdir}/RPMS' --define '_builddir %{_topdir}/BUILD' --target x86_64-pld-linux /tmp/B.jXlV1P/OpenNI.spec Building target platforms: x86_64-pld-linux Executing(%prep): /bin/sh -e /tmp/B.jXlV1P/BUILD/tmp/rpm-tmp.32781 + umask 022 + cd /tmp/B.jXlV1P/BUILD + cd /tmp/B.jXlV1P/BUILD + rm -rf OpenNI-OpenNI-1e9524f + /usr/bin/gzip -dc /tmp/B.jXlV1P/OpenNI-1.5.7.10.tar.gz + /bin/tar -xf - + STATUS=0 + '[' 0 -ne 0 ']' + cd OpenNI-OpenNI-1e9524f + /bin/id -u + '[' 1000 '=' 0 ']' + /bin/id -u + '[' 1000 '=' 0 ']' + /bin/chmod -Rf a+rX,u+w,g-w,o-w . + /bin/sed -i -e 's,\r$,,' Platform/Linux/Build/Samples/NiUserTracker/Makefile + echo 'Patch #0 (OpenNI-system-libs.patch):' Patch #0 (OpenNI-system-libs.patch): + '[' -f /tmp/B.jXlV1P/OpenNI-system-libs.patch ']' + /bin/cat /tmp/B.jXlV1P/OpenNI-system-libs.patch + /usr/bin/patch -s -p1 + echo 'Patch #1 (OpenNI-nosse.patch):' Patch #1 (OpenNI-nosse.patch): + '[' -f /tmp/B.jXlV1P/OpenNI-nosse.patch ']' + /bin/cat /tmp/B.jXlV1P/OpenNI-nosse.patch + /usr/bin/patch -s -p1 + exit 0 Executing(%build): /bin/sh -e /tmp/B.jXlV1P/BUILD/tmp/rpm-tmp.32781 TMP=/home/users/builder/tmp HOME=/home/users/builder PATH=/home/users/builder/GNUstep/Tools:/usr/local/bin:/usr/bin:/bin:/home/users/builder/bin TMPDIR=/tmp/B.jXlV1P/BUILD/tmp + umask 022 + cd /tmp/B.jXlV1P/BUILD + cd OpenNI-OpenNI-1e9524f + /usr/bin/make -Otarget -j5 -C Platform/Linux/Build clean /usr/bin/make -C OpenNI clean /usr/bin/make -C Modules/nimCodecs clean /usr/bin/make -C Modules/nimMockNodes clean /usr/bin/make -C Modules/nimRecorder clean /usr/bin/make -C Utils/niReg clean make[1]: Entering directory '/tmp/B.jXlV1P/BUILD/OpenNI-OpenNI-1e9524f/Platform/Linux/Build/Modules/nimCodecs' rm -rf ../../../Bin/x64-Release/libnimCodecs.so make[1]: Leaving directory '/tmp/B.jXlV1P/BUILD/OpenNI-OpenNI-1e9524f/Platform/Linux/Build/Modules/nimCodecs' make[1]: Entering directory '/tmp/B.jXlV1P/BUILD/OpenNI-OpenNI-1e9524f/Platform/Linux/Build/Modules/nimCodecs' rm -rf ./x64-Release/XnUncompressedCodec.o ./x64-Release/Xn16zEmbTablesCodec.o ./x64-Release/XnCodecs.o ./x64-Release/XnJpegCodec.o ./x64-Release/XnStreamCompression.o ./x64-Release/XnCodec.o ./x64-Release/Xn16zCodec.o ./x64-Release/Xn8zCodec.o ./x64-Release/ExportedCodec.o make[1]: Leaving directory '/tmp/B.jXlV1P/BUILD/OpenNI-OpenNI-1e9524f/Platform/Linux/Build/Modules/nimCodecs' make[1]: Entering directory '/tmp/B.jXlV1P/BUILD/OpenNI-OpenNI-1e9524f/Platform/Linux/Build/Modules/nimCodecs' rm -rf ./x64-Release/XnUncompressedCodec.d ./x64-Release/Xn16zEmbTablesCodec.d ./x64-Release/XnCodecs.d ./x64-Release/XnJpegCodec.d ./x64-Release/XnStreamCompression.d ./x64-Release/XnCodec.d ./x64-Release/Xn16zCodec.d ./x64-Release/Xn8zCodec.d ./x64-Release/ExportedCodec.d make[1]: Leaving directory '/tmp/B.jXlV1P/BUILD/OpenNI-OpenNI-1e9524f/Platform/Linux/Build/Modules/nimCodecs' /usr/bin/make -C Utils/niLicense clean make[1]: Entering directory '/tmp/B.jXlV1P/BUILD/OpenNI-OpenNI-1e9524f/Platform/Linux/Build/Modules/nimRecorder' rm -rf ../../../Bin/x64-Release/libnimRecorder.so make[1]: Leaving directory '/tmp/B.jXlV1P/BUILD/OpenNI-OpenNI-1e9524f/Platform/Linux/Build/Modules/nimRecorder' make[1]: Entering directory '/tmp/B.jXlV1P/BUILD/OpenNI-OpenNI-1e9524f/Platform/Linux/Build/Modules/nimRecorder' rm -rf ./x64-Release/RecorderNode.o ./x64-Release/nimRecorder.o ./x64-Release/ExportedPlayer.o ./x64-Release/ExportedRecorder.o ./x64-Release/PlayerNode.o ./x64-Release/DataRecords.o make[1]: Leaving directory '/tmp/B.jXlV1P/BUILD/OpenNI-OpenNI-1e9524f/Platform/Linux/Build/Modules/nimRecorder' make[1]: Entering directory '/tmp/B.jXlV1P/BUILD/OpenNI-OpenNI-1e9524f/Platform/Linux/Build/Modules/nimRecorder' rm -rf ./x64-Release/RecorderNode.d ./x64-Release/nimRecorder.d ./x64-Release/ExportedPlayer.d ./x64-Release/ExportedRecorder.d ./x64-Release/PlayerNode.d ./x64-Release/DataRecords.d make[1]: Leaving directory '/tmp/B.jXlV1P/BUILD/OpenNI-OpenNI-1e9524f/Platform/Linux/Build/Modules/nimRecorder' /usr/bin/make -C Wrappers/OpenNI.jni clean make[1]: Entering directory '/tmp/B.jXlV1P/BUILD/OpenNI-OpenNI-1e9524f/Platform/Linux/Build/Utils/niLicense' rm -rf ../../../Bin/x64-Release/niLicense make[1]: Leaving directory '/tmp/B.jXlV1P/BUILD/OpenNI-OpenNI-1e9524f/Platform/Linux/Build/Utils/niLicense' make[1]: Entering directory '/tmp/B.jXlV1P/BUILD/OpenNI-OpenNI-1e9524f/Platform/Linux/Build/Modules/nimMockNodes' rm -rf ../../../Bin/x64-Release/libnimMockNodes.so make[1]: Leaving directory '/tmp/B.jXlV1P/BUILD/OpenNI-OpenNI-1e9524f/Platform/Linux/Build/Modules/nimMockNodes' make[1]: Entering directory '/tmp/B.jXlV1P/BUILD/OpenNI-OpenNI-1e9524f/Platform/Linux/Build/Modules/nimMockNodes' rm -rf ./x64-Release/ExportedMockNodes.o ./x64-Release/MockAudioGenerator.o ./x64-Release/MockMapGenerator.o ./x64-Release/MockImageGenerator.o ./x64-Release/MockDevice.o ./x64-Release/nimMockNodes.o ./x64-Release/MockIRGenerator.o ./x64-Release/MockDepthGenerator.o ./x64-Release/MockGenerator.o ./x64-Release/MockProductionNode.o make[1]: Leaving directory '/tmp/B.jXlV1P/BUILD/OpenNI-OpenNI-1e9524f/Platform/Linux/Build/Modules/nimMockNodes' make[1]: Entering directory '/tmp/B.jXlV1P/BUILD/OpenNI-OpenNI-1e9524f/Platform/Linux/Build/Modules/nimMockNodes' rm -rf ./x64-Release/ExportedMockNodes.d ./x64-Release/MockAudioGenerator.d ./x64-Release/MockMapGenerator.d ./x64-Release/MockImageGenerator.d ./x64-Release/MockDevice.d ./x64-Release/nimMockNodes.d ./x64-Release/MockIRGenerator.d ./x64-Release/MockDepthGenerator.d ./x64-Release/MockGenerator.d ./x64-Release/MockProductionNode.d make[1]: Leaving directory '/tmp/B.jXlV1P/BUILD/OpenNI-OpenNI-1e9524f/Platform/Linux/Build/Modules/nimMockNodes' make[1]: Entering directory '/tmp/B.jXlV1P/BUILD/OpenNI-OpenNI-1e9524f/Platform/Linux/Build/Utils/niLicense' rm -rf ./x64-Release/niLicense.o make[1]: Leaving directory '/tmp/B.jXlV1P/BUILD/OpenNI-OpenNI-1e9524f/Platform/Linux/Build/Utils/niLicense' /usr/bin/make -C Wrappers/OpenNI.java clean make[1]: Entering directory '/tmp/B.jXlV1P/BUILD/OpenNI-OpenNI-1e9524f/Platform/Linux/Build/Utils/niReg' rm -rf ../../../Bin/x64-Release/niReg make[1]: Leaving directory '/tmp/B.jXlV1P/BUILD/OpenNI-OpenNI-1e9524f/Platform/Linux/Build/Utils/niReg' make[1]: Entering directory '/tmp/B.jXlV1P/BUILD/OpenNI-OpenNI-1e9524f/Platform/Linux/Build/Utils/niReg' rm -rf ./x64-Release/niReg.o make[1]: Leaving directory '/tmp/B.jXlV1P/BUILD/OpenNI-OpenNI-1e9524f/Platform/Linux/Build/Utils/niReg' make[1]: Entering directory '/tmp/B.jXlV1P/BUILD/OpenNI-OpenNI-1e9524f/Platform/Linux/Build/Utils/niLicense' rm -rf ./x64-Release/niLicense.d make[1]: Leaving directory '/tmp/B.jXlV1P/BUILD/OpenNI-OpenNI-1e9524f/Platform/Linux/Build/Utils/niLicense' make[1]: Entering directory '/tmp/B.jXlV1P/BUILD/OpenNI-OpenNI-1e9524f/Platform/Linux/Build/Utils/niReg' rm -rf ./x64-Release/niReg.d make[1]: Leaving directory '/tmp/B.jXlV1P/BUILD/OpenNI-OpenNI-1e9524f/Platform/Linux/Build/Utils/niReg' /usr/bin/make -C Samples/NiSimpleRead clean /usr/bin/make -C Samples/NiBackRecorder clean make[1]: Entering directory '/tmp/B.jXlV1P/BUILD/OpenNI-OpenNI-1e9524f/Platform/Linux/Build/Wrappers/OpenNI.jni' rm -rf ../../../Bin/x64-Release/libOpenNI.jni.so make[1]: Leaving directory '/tmp/B.jXlV1P/BUILD/OpenNI-OpenNI-1e9524f/Platform/Linux/Build/Wrappers/OpenNI.jni' make[1]: Entering directory '/tmp/B.jXlV1P/BUILD/OpenNI-OpenNI-1e9524f/Platform/Linux/Build/Wrappers/OpenNI.java' rm -rf ../../../Bin/x64-Release/org.openni.jar make[1]: Leaving directory '/tmp/B.jXlV1P/BUILD/OpenNI-OpenNI-1e9524f/Platform/Linux/Build/Wrappers/OpenNI.java' make[1]: Entering directory '/tmp/B.jXlV1P/BUILD/OpenNI-OpenNI-1e9524f/Platform/Linux/Build/OpenNI' rm -rf ../../Bin/x64-Release/libOpenNI.so make[1]: Leaving directory '/tmp/B.jXlV1P/BUILD/OpenNI-OpenNI-1e9524f/Platform/Linux/Build/OpenNI' make[1]: Entering directory '/tmp/B.jXlV1P/BUILD/OpenNI-OpenNI-1e9524f/Platform/Linux/Build/Wrappers/OpenNI.jni' rm -rf ./x64-Release/org_openni_NativeMethods.o ./x64-Release/OpenNI.jni.o make[1]: Leaving directory '/tmp/B.jXlV1P/BUILD/OpenNI-OpenNI-1e9524f/Platform/Linux/Build/Wrappers/OpenNI.jni' make[1]: Entering directory '/tmp/B.jXlV1P/BUILD/OpenNI-OpenNI-1e9524f/Platform/Linux/Build/OpenNI' rm -rf ./x64-Release/XnFPSCalculator.o ./x64-Release/XnQueries.o ./x64-Release/XnProfiling.o ./x64-Release/XnTypeManager.o ./x64-Release/XnLogFileWriter.o ./x64-Release/XnUSB.o ./x64-Release/XnLogConsoleWriter.o ./x64-Release/XnEnumerationErrors.o ./x64-Release/XnLicensing.o ./x64-Release/XnBaseNode.o ./x64-Release/XnDumpFileWriter.o ./x64-Release/XnLog.o ./x64-Release/XnOSMemoryProfiling.o ./x64-Release/XnRecorderImpl.o ./x64-Release/XnExportedNodes.o ./x64-Release/XnOS.o ./x64-Release/XnModuleLoader.o ./x64-Release/XnXml.o ./x64-Release/XnUtils.o ./x64-Release/openNI.o ./x64-Release/XnScheduler.o ./x64-Release/XnPlayerImpl.o ./x64-Release/XnXmlScriptNodeExporter.o ./x64-Release/XnNodeWatcher.o ./x64-Release/XnMockNotifier.o ./x64-Release/XnNodeManager.o ./x64-Release/XnStatusRegister.o ./x64-Release/XnXmlScriptNode.o ./x64-Release/XnOpenNI.o ./x64-Release/XnLogAndroidWriter.o ./x64-Release/XnDump.o ./x64-Release/LinuxEvents.o ./x64-Release/LinuxPosixNamedEvents.o ./x64-Release/LinuxStrings.o ./x64-Release/LinuxCriticalSections.o ./x64-Release/LinuxMutex.o ./x64-Release/LinuxPosixEvents.o ./x64-Release/LinuxUSBDevice.o ./x64-Release/LinuxMemory.o ./x64-Release/LinuxSharedLibs.o ./x64-Release/LinuxThreads.o ./x64-Release/LinuxProcesses.o ./x64-Release/LinuxSharedMemory.o ./x64-Release/LinuxDebug.o ./x64-Release/LinuxINI.o ./x64-Release/LinuxNetwork.o ./x64-Release/LinuxKeyboard.o ./x64-Release/XnUSBLinux.o ./x64-Release/LinuxSysVNamedEvents.o ./x64-Release/LinuxFiles.o ./x64-Release/LinuxTime.o ./x64-Release/tinystr.o ./x64-Release/tinyxmlerror.o ./x64-Release/tinyxml.o ./x64-Release/tinyxmlparser.o make[1]: Leaving directory '/tmp/B.jXlV1P/BUILD/OpenNI-OpenNI-1e9524f/Platform/Linux/Build/OpenNI' make[1]: Entering directory '/tmp/B.jXlV1P/BUILD/OpenNI-OpenNI-1e9524f/Platform/Linux/Build/Wrappers/OpenNI.java' rm -rf make[1]: Leaving directory '/tmp/B.jXlV1P/BUILD/OpenNI-OpenNI-1e9524f/Platform/Linux/Build/Wrappers/OpenNI.java' make[1]: Entering directory '/tmp/B.jXlV1P/BUILD/OpenNI-OpenNI-1e9524f/Platform/Linux/Build/Wrappers/OpenNI.jni' rm -rf ./x64-Release/org_openni_NativeMethods.d ./x64-Release/OpenNI.jni.d make[1]: Leaving directory '/tmp/B.jXlV1P/BUILD/OpenNI-OpenNI-1e9524f/Platform/Linux/Build/Wrappers/OpenNI.jni' make[1]: Entering directory '/tmp/B.jXlV1P/BUILD/OpenNI-OpenNI-1e9524f/Platform/Linux/Build/OpenNI' rm -rf ./x64-Release/XnFPSCalculator.d ./x64-Release/XnQueries.d ./x64-Release/XnProfiling.d ./x64-Release/XnTypeManager.d ./x64-Release/XnLogFileWriter.d ./x64-Release/XnUSB.d ./x64-Release/XnLogConsoleWriter.d ./x64-Release/XnEnumerationErrors.d ./x64-Release/XnLicensing.d ./x64-Release/XnBaseNode.d ./x64-Release/XnDumpFileWriter.d ./x64-Release/XnLog.d ./x64-Release/XnOSMemoryProfiling.d ./x64-Release/XnRecorderImpl.d ./x64-Release/XnExportedNodes.d ./x64-Release/XnOS.d ./x64-Release/XnModuleLoader.d ./x64-Release/XnXml.d ./x64-Release/XnUtils.d ./x64-Release/openNI.d ./x64-Release/XnScheduler.d ./x64-Release/XnPlayerImpl.d ./x64-Release/XnXmlScriptNodeExporter.d ./x64-Release/XnNodeWatcher.d ./x64-Release/XnMockNotifier.d ./x64-Release/XnNodeManager.d ./x64-Release/XnStatusRegister.d ./x64-Release/XnXmlScriptNode.d ./x64-Release/XnOpenNI.d ./x64-Release/XnLogAndroidWriter.d ./x64-Release/XnDump.d ./x64-Release/LinuxEvents.d ./x64-Release/LinuxPosixNamedEvents.d ./x64-Release/LinuxStrings.d ./x64-Release/LinuxCriticalSections.d ./x64-Release/LinuxMutex.d ./x64-Release/LinuxPosixEvents.d ./x64-Release/LinuxUSBDevice.d ./x64-Release/LinuxMemory.d ./x64-Release/LinuxSharedLibs.d ./x64-Release/LinuxThreads.d ./x64-Release/LinuxProcesses.d ./x64-Release/LinuxSharedMemory.d ./x64-Release/LinuxDebug.d ./x64-Release/LinuxINI.d ./x64-Release/LinuxNetwork.d ./x64-Release/LinuxKeyboard.d ./x64-Release/XnUSBLinux.d ./x64-Release/LinuxSysVNamedEvents.d ./x64-Release/LinuxFiles.d ./x64-Release/LinuxTime.d ./x64-Release/tinystr.d ./x64-Release/tinyxmlerror.d ./x64-Release/tinyxml.d ./x64-Release/tinyxmlparser.d make[1]: Leaving directory '/tmp/B.jXlV1P/BUILD/OpenNI-OpenNI-1e9524f/Platform/Linux/Build/OpenNI' make[1]: Entering directory '/tmp/B.jXlV1P/BUILD/OpenNI-OpenNI-1e9524f/Platform/Linux/Build/Wrappers/OpenNI.java' rm -rf x64-Release make[1]: Leaving directory '/tmp/B.jXlV1P/BUILD/OpenNI-OpenNI-1e9524f/Platform/Linux/Build/Wrappers/OpenNI.java' /usr/bin/make -C Samples/NiConvertXToONI clean /usr/bin/make -C Samples/NiRecordSynthetic clean make[1]: Entering directory '/tmp/B.jXlV1P/BUILD/OpenNI-OpenNI-1e9524f/Platform/Linux/Build/Samples/NiSimpleRead' rm -rf ../../../Bin/x64-Release/Sample-NiSimpleRead make[1]: Leaving directory '/tmp/B.jXlV1P/BUILD/OpenNI-OpenNI-1e9524f/Platform/Linux/Build/Samples/NiSimpleRead' make[1]: Entering directory '/tmp/B.jXlV1P/BUILD/OpenNI-OpenNI-1e9524f/Platform/Linux/Build/Samples/NiSimpleRead' rm -rf ./x64-Release/NiSimpleRead.o make[1]: Leaving directory '/tmp/B.jXlV1P/BUILD/OpenNI-OpenNI-1e9524f/Platform/Linux/Build/Samples/NiSimpleRead' make[1]: Entering directory '/tmp/B.jXlV1P/BUILD/OpenNI-OpenNI-1e9524f/Platform/Linux/Build/Samples/NiSimpleRead' rm -rf ./x64-Release/NiSimpleRead.d make[1]: Leaving directory '/tmp/B.jXlV1P/BUILD/OpenNI-OpenNI-1e9524f/Platform/Linux/Build/Samples/NiSimpleRead' make[1]: Entering directory '/tmp/B.jXlV1P/BUILD/OpenNI-OpenNI-1e9524f/Platform/Linux/Build/Samples/NiBackRecorder' rm -rf ./x64-Release/main.o /usr/bin/make -C Samples/NiSampleModule clean make[1]: Leaving directory '/tmp/B.jXlV1P/BUILD/OpenNI-OpenNI-1e9524f/Platform/Linux/Build/Samples/NiBackRecorder' make[1]: Entering directory '/tmp/B.jXlV1P/BUILD/OpenNI-OpenNI-1e9524f/Platform/Linux/Build/Samples/NiBackRecorder' rm -rf ../../../Bin/x64-Release/Sample-NiBackRecorder make[1]: Leaving directory '/tmp/B.jXlV1P/BUILD/OpenNI-OpenNI-1e9524f/Platform/Linux/Build/Samples/NiBackRecorder' /usr/bin/make -C Samples/NiSimpleCreate clean make[1]: Entering directory '/tmp/B.jXlV1P/BUILD/OpenNI-OpenNI-1e9524f/Platform/Linux/Build/Samples/NiBackRecorder' rm -rf ./x64-Release/main.d make[1]: Leaving directory '/tmp/B.jXlV1P/BUILD/OpenNI-OpenNI-1e9524f/Platform/Linux/Build/Samples/NiBackRecorder' make[1]: Entering directory '/tmp/B.jXlV1P/BUILD/OpenNI-OpenNI-1e9524f/Platform/Linux/Build/Samples/NiConvertXToONI' rm -rf ../../../Bin/x64-Release/Sample-NiConvertXToONI make[1]: Leaving directory '/tmp/B.jXlV1P/BUILD/OpenNI-OpenNI-1e9524f/Platform/Linux/Build/Samples/NiConvertXToONI' /usr/bin/make -C Samples/NiCRead clean make[1]: Entering directory '/tmp/B.jXlV1P/BUILD/OpenNI-OpenNI-1e9524f/Platform/Linux/Build/Samples/NiConvertXToONI' rm -rf ./x64-Release/NiConvertXToONI.o make[1]: Leaving directory '/tmp/B.jXlV1P/BUILD/OpenNI-OpenNI-1e9524f/Platform/Linux/Build/Samples/NiConvertXToONI' make[1]: Entering directory '/tmp/B.jXlV1P/BUILD/OpenNI-OpenNI-1e9524f/Platform/Linux/Build/Samples/NiConvertXToONI' rm -rf ./x64-Release/NiConvertXToONI.d make[1]: Leaving directory '/tmp/B.jXlV1P/BUILD/OpenNI-OpenNI-1e9524f/Platform/Linux/Build/Samples/NiConvertXToONI' /usr/bin/make -C Samples/NiAudioSample clean make[1]: Entering directory '/tmp/B.jXlV1P/BUILD/OpenNI-OpenNI-1e9524f/Platform/Linux/Build/Samples/NiCRead' rm -rf ../../../Bin/x64-Release/Sample-NiCRead make[1]: Leaving directory '/tmp/B.jXlV1P/BUILD/OpenNI-OpenNI-1e9524f/Platform/Linux/Build/Samples/NiCRead' make[1]: Entering directory '/tmp/B.jXlV1P/BUILD/OpenNI-OpenNI-1e9524f/Platform/Linux/Build/Samples/NiRecordSynthetic' rm -rf ../../../Bin/x64-Release/Sample-NiRecordSynthetic make[1]: Leaving directory '/tmp/B.jXlV1P/BUILD/OpenNI-OpenNI-1e9524f/Platform/Linux/Build/Samples/NiRecordSynthetic' make[1]: Entering directory '/tmp/B.jXlV1P/BUILD/OpenNI-OpenNI-1e9524f/Platform/Linux/Build/Samples/NiCRead' rm -rf ./x64-Release/NiCRead.o make[1]: Leaving directory '/tmp/B.jXlV1P/BUILD/OpenNI-OpenNI-1e9524f/Platform/Linux/Build/Samples/NiCRead' make[1]: Entering directory '/tmp/B.jXlV1P/BUILD/OpenNI-OpenNI-1e9524f/Platform/Linux/Build/Samples/NiSampleModule' rm -rf ../../../Bin/x64-Release/libSample-NiSampleModule.so make[1]: Leaving directory '/tmp/B.jXlV1P/BUILD/OpenNI-OpenNI-1e9524f/Platform/Linux/Build/Samples/NiSampleModule' make[1]: Entering directory '/tmp/B.jXlV1P/BUILD/OpenNI-OpenNI-1e9524f/Platform/Linux/Build/Samples/NiCRead' rm -rf ./x64-Release/NiCRead.d make[1]: Leaving directory '/tmp/B.jXlV1P/BUILD/OpenNI-OpenNI-1e9524f/Platform/Linux/Build/Samples/NiCRead' /usr/bin/make -C Samples/NiSimpleSkeleton clean make[1]: Entering directory '/tmp/B.jXlV1P/BUILD/OpenNI-OpenNI-1e9524f/Platform/Linux/Build/Samples/NiRecordSynthetic' rm -rf ./x64-Release/NiRecordSynthetic.o make[1]: Leaving directory '/tmp/B.jXlV1P/BUILD/OpenNI-OpenNI-1e9524f/Platform/Linux/Build/Samples/NiRecordSynthetic' make[1]: Entering directory '/tmp/B.jXlV1P/BUILD/OpenNI-OpenNI-1e9524f/Platform/Linux/Build/Samples/NiSampleModule' rm -rf ./x64-Release/SampleDepth.o ./x64-Release/ExportedSampleDepth.o ./x64-Release/Registration.o make[1]: Leaving directory '/tmp/B.jXlV1P/BUILD/OpenNI-OpenNI-1e9524f/Platform/Linux/Build/Samples/NiSampleModule' make[1]: Entering directory '/tmp/B.jXlV1P/BUILD/OpenNI-OpenNI-1e9524f/Platform/Linux/Build/Samples/NiAudioSample' rm -rf ../../../Bin/x64-Release/Sample-NiAudioSample make[1]: Leaving directory '/tmp/B.jXlV1P/BUILD/OpenNI-OpenNI-1e9524f/Platform/Linux/Build/Samples/NiAudioSample' make[1]: Entering directory '/tmp/B.jXlV1P/BUILD/OpenNI-OpenNI-1e9524f/Platform/Linux/Build/Samples/NiSampleModule' rm -rf ./x64-Release/SampleDepth.d ./x64-Release/ExportedSampleDepth.d ./x64-Release/Registration.d make[1]: Leaving directory '/tmp/B.jXlV1P/BUILD/OpenNI-OpenNI-1e9524f/Platform/Linux/Build/Samples/NiSampleModule' /usr/bin/make -C Samples/NiSkeletonBenchmark clean make[1]: Entering directory '/tmp/B.jXlV1P/BUILD/OpenNI-OpenNI-1e9524f/Platform/Linux/Build/Samples/NiRecordSynthetic' rm -rf ./x64-Release/NiRecordSynthetic.d make[1]: Leaving directory '/tmp/B.jXlV1P/BUILD/OpenNI-OpenNI-1e9524f/Platform/Linux/Build/Samples/NiRecordSynthetic' make[1]: Entering directory '/tmp/B.jXlV1P/BUILD/OpenNI-OpenNI-1e9524f/Platform/Linux/Build/Samples/NiAudioSample' rm -rf ./x64-Release/NiAudioSample.o make[1]: Leaving directory '/tmp/B.jXlV1P/BUILD/OpenNI-OpenNI-1e9524f/Platform/Linux/Build/Samples/NiAudioSample' make[1]: Entering directory '/tmp/B.jXlV1P/BUILD/OpenNI-OpenNI-1e9524f/Platform/Linux/Build/Samples/NiSimpleCreate' rm -rf ../../../Bin/x64-Release/Sample-NiSimpleCreate make[1]: Leaving directory '/tmp/B.jXlV1P/BUILD/OpenNI-OpenNI-1e9524f/Platform/Linux/Build/Samples/NiSimpleCreate' /usr/bin/make -C Samples/NiViewer clean make[1]: Entering directory '/tmp/B.jXlV1P/BUILD/OpenNI-OpenNI-1e9524f/Platform/Linux/Build/Samples/NiSimpleCreate' rm -rf ./x64-Release/NiSimpleCreate.o make[1]: Leaving directory '/tmp/B.jXlV1P/BUILD/OpenNI-OpenNI-1e9524f/Platform/Linux/Build/Samples/NiSimpleCreate' make[1]: Entering directory '/tmp/B.jXlV1P/BUILD/OpenNI-OpenNI-1e9524f/Platform/Linux/Build/Samples/NiAudioSample' rm -rf ./x64-Release/NiAudioSample.d make[1]: Leaving directory '/tmp/B.jXlV1P/BUILD/OpenNI-OpenNI-1e9524f/Platform/Linux/Build/Samples/NiAudioSample' /usr/bin/make -C Samples/NiSimpleViewer clean make[1]: Entering directory '/tmp/B.jXlV1P/BUILD/OpenNI-OpenNI-1e9524f/Platform/Linux/Build/Samples/NiSimpleCreate' rm -rf ./x64-Release/NiSimpleCreate.d make[1]: Leaving directory '/tmp/B.jXlV1P/BUILD/OpenNI-OpenNI-1e9524f/Platform/Linux/Build/Samples/NiSimpleCreate' /usr/bin/make -C Samples/NiUserTracker clean make[1]: Entering directory '/tmp/B.jXlV1P/BUILD/OpenNI-OpenNI-1e9524f/Platform/Linux/Build/Samples/NiViewer' rm -rf ../../../Bin/x64-Release/NiViewer make[1]: Leaving directory '/tmp/B.jXlV1P/BUILD/OpenNI-OpenNI-1e9524f/Platform/Linux/Build/Samples/NiViewer' make[1]: Entering directory '/tmp/B.jXlV1P/BUILD/OpenNI-OpenNI-1e9524f/Platform/Linux/Build/Samples/NiSkeletonBenchmark' rm -rf ../../../Bin/x64-Release/NiSkeletonBenchmark make[1]: Leaving directory '/tmp/B.jXlV1P/BUILD/OpenNI-OpenNI-1e9524f/Platform/Linux/Build/Samples/NiSkeletonBenchmark' make[1]: Entering directory '/tmp/B.jXlV1P/BUILD/OpenNI-OpenNI-1e9524f/Platform/Linux/Build/Samples/NiSimpleSkeleton' rm -rf ../../../Bin/x64-Release/Sample-NiSimpleSkeleton make[1]: Leaving directory '/tmp/B.jXlV1P/BUILD/OpenNI-OpenNI-1e9524f/Platform/Linux/Build/Samples/NiSimpleSkeleton' make[1]: Entering directory '/tmp/B.jXlV1P/BUILD/OpenNI-OpenNI-1e9524f/Platform/Linux/Build/Samples/NiViewer' rm -rf ./x64-Release/Keyboard.o ./x64-Release/MouseInput.o ./x64-Release/Statistics.o ./x64-Release/Draw.o ./x64-Release/Audio.o ./x64-Release/Capture.o ./x64-Release/Device.o ./x64-Release/Menu.o ./x64-Release/NiViewer.o make[1]: Leaving directory '/tmp/B.jXlV1P/BUILD/OpenNI-OpenNI-1e9524f/Platform/Linux/Build/Samples/NiViewer' make[1]: Entering directory '/tmp/B.jXlV1P/BUILD/OpenNI-OpenNI-1e9524f/Platform/Linux/Build/Samples/NiSimpleSkeleton' rm -rf ./x64-Release/NiSimpleSkeleton.o make[1]: Leaving directory '/tmp/B.jXlV1P/BUILD/OpenNI-OpenNI-1e9524f/Platform/Linux/Build/Samples/NiSimpleSkeleton' make[1]: Entering directory '/tmp/B.jXlV1P/BUILD/OpenNI-OpenNI-1e9524f/Platform/Linux/Build/Samples/NiSimpleViewer' rm -rf ../../../Bin/x64-Release/Sample-NiSimpleViewer make[1]: Leaving directory '/tmp/B.jXlV1P/BUILD/OpenNI-OpenNI-1e9524f/Platform/Linux/Build/Samples/NiSimpleViewer' make[1]: Entering directory '/tmp/B.jXlV1P/BUILD/OpenNI-OpenNI-1e9524f/Platform/Linux/Build/Samples/NiSkeletonBenchmark' rm -rf ./x64-Release/NiSkeletonBenchmark.o make[1]: Leaving directory '/tmp/B.jXlV1P/BUILD/OpenNI-OpenNI-1e9524f/Platform/Linux/Build/Samples/NiSkeletonBenchmark' make[1]: Entering directory '/tmp/B.jXlV1P/BUILD/OpenNI-OpenNI-1e9524f/Platform/Linux/Build/Samples/NiSimpleSkeleton' rm -rf ./x64-Release/NiSimpleSkeleton.d make[1]: Leaving directory '/tmp/B.jXlV1P/BUILD/OpenNI-OpenNI-1e9524f/Platform/Linux/Build/Samples/NiSimpleSkeleton' make[1]: Entering directory '/tmp/B.jXlV1P/BUILD/OpenNI-OpenNI-1e9524f/Platform/Linux/Build/Samples/NiSimpleViewer' rm -rf ./x64-Release/NiSimpleViewer.o make[1]: Leaving directory '/tmp/B.jXlV1P/BUILD/OpenNI-OpenNI-1e9524f/Platform/Linux/Build/Samples/NiSimpleViewer' make[1]: Entering directory '/tmp/B.jXlV1P/BUILD/OpenNI-OpenNI-1e9524f/Platform/Linux/Build/Samples/NiViewer' rm -rf ./x64-Release/Keyboard.d ./x64-Release/MouseInput.d ./x64-Release/Statistics.d ./x64-Release/Draw.d ./x64-Release/Audio.d ./x64-Release/Capture.d ./x64-Release/Device.d ./x64-Release/Menu.d ./x64-Release/NiViewer.d make[1]: Leaving directory '/tmp/B.jXlV1P/BUILD/OpenNI-OpenNI-1e9524f/Platform/Linux/Build/Samples/NiViewer' /usr/bin/make -C Samples/NiUserSelection clean /usr/bin/make -C Samples/NiHandTracker clean make[1]: Entering directory '/tmp/B.jXlV1P/BUILD/OpenNI-OpenNI-1e9524f/Platform/Linux/Build/Samples/NiSkeletonBenchmark' rm -rf ./x64-Release/NiSkeletonBenchmark.d make[1]: Leaving directory '/tmp/B.jXlV1P/BUILD/OpenNI-OpenNI-1e9524f/Platform/Linux/Build/Samples/NiSkeletonBenchmark' /usr/bin/make -C Samples/SimpleRead.java clean make[1]: Entering directory '/tmp/B.jXlV1P/BUILD/OpenNI-OpenNI-1e9524f/Platform/Linux/Build/Samples/NiSimpleViewer' rm -rf ./x64-Release/NiSimpleViewer.d make[1]: Leaving directory '/tmp/B.jXlV1P/BUILD/OpenNI-OpenNI-1e9524f/Platform/Linux/Build/Samples/NiSimpleViewer' /usr/bin/make -C Samples/SimpleViewer.java clean make[1]: Entering directory '/tmp/B.jXlV1P/BUILD/OpenNI-OpenNI-1e9524f/Platform/Linux/Build/Samples/NiUserTracker' rm -rf ../../../Bin/x64-Release/Sample-NiUserTracker make[1]: Leaving directory '/tmp/B.jXlV1P/BUILD/OpenNI-OpenNI-1e9524f/Platform/Linux/Build/Samples/NiUserTracker' make[1]: Entering directory '/tmp/B.jXlV1P/BUILD/OpenNI-OpenNI-1e9524f/Platform/Linux/Build/Samples/SimpleRead.java' rm -rf ../../../Bin/x64-Release/org.openni.Samples.SimpleRead.jar make[1]: Leaving directory '/tmp/B.jXlV1P/BUILD/OpenNI-OpenNI-1e9524f/Platform/Linux/Build/Samples/SimpleRead.java' make[1]: Entering directory '/tmp/B.jXlV1P/BUILD/OpenNI-OpenNI-1e9524f/Platform/Linux/Build/Samples/SimpleRead.java' rm -rf Manifest.txt make[1]: Leaving directory '/tmp/B.jXlV1P/BUILD/OpenNI-OpenNI-1e9524f/Platform/Linux/Build/Samples/SimpleRead.java' make[1]: Entering directory '/tmp/B.jXlV1P/BUILD/OpenNI-OpenNI-1e9524f/Platform/Linux/Build/Samples/NiUserTracker' rm -rf ./x64-Release/opengles.o ./x64-Release/SceneDrawer.o ./x64-Release/main.o make[1]: Leaving directory '/tmp/B.jXlV1P/BUILD/OpenNI-OpenNI-1e9524f/Platform/Linux/Build/Samples/NiUserTracker' make[1]: Entering directory '/tmp/B.jXlV1P/BUILD/OpenNI-OpenNI-1e9524f/Platform/Linux/Build/Samples/SimpleRead.java' rm -rf x64-Release make[1]: Leaving directory '/tmp/B.jXlV1P/BUILD/OpenNI-OpenNI-1e9524f/Platform/Linux/Build/Samples/SimpleRead.java' /usr/bin/make -C Samples/UserTracker.java clean make[1]: Entering directory '/tmp/B.jXlV1P/BUILD/OpenNI-OpenNI-1e9524f/Platform/Linux/Build/Samples/NiUserTracker' rm -rf ./x64-Release/opengles.d ./x64-Release/SceneDrawer.d ./x64-Release/main.d make[1]: Leaving directory '/tmp/B.jXlV1P/BUILD/OpenNI-OpenNI-1e9524f/Platform/Linux/Build/Samples/NiUserTracker' make[1]: Entering directory '/tmp/B.jXlV1P/BUILD/OpenNI-OpenNI-1e9524f/Platform/Linux/Build/Samples/NiHandTracker' rm -rf ../../../Bin/x64-Release/Sample-NiHandTracker make[1]: Leaving directory '/tmp/B.jXlV1P/BUILD/OpenNI-OpenNI-1e9524f/Platform/Linux/Build/Samples/NiHandTracker' make[1]: Entering directory '/tmp/B.jXlV1P/BUILD/OpenNI-OpenNI-1e9524f/Platform/Linux/Build/Samples/SimpleViewer.java' rm -rf ../../../Bin/x64-Release/org.openni.Samples.SimpleViewer.jar make[1]: Leaving directory '/tmp/B.jXlV1P/BUILD/OpenNI-OpenNI-1e9524f/Platform/Linux/Build/Samples/SimpleViewer.java' make[1]: Entering directory '/tmp/B.jXlV1P/BUILD/OpenNI-OpenNI-1e9524f/Platform/Linux/Build/Samples/NiHandTracker' rm -rf ./x64-Release/NiSimpleViewer.o ./x64-Release/NiHandViewer.o ./x64-Release/NiHandTracker.o ./x64-Release/main.o make[1]: Leaving directory '/tmp/B.jXlV1P/BUILD/OpenNI-OpenNI-1e9524f/Platform/Linux/Build/Samples/NiHandTracker' make[1]: Entering directory '/tmp/B.jXlV1P/BUILD/OpenNI-OpenNI-1e9524f/Platform/Linux/Build/Samples/NiHandTracker' rm -rf ./x64-Release/NiSimpleViewer.d ./x64-Release/NiHandViewer.d ./x64-Release/NiHandTracker.d ./x64-Release/main.d make[1]: Leaving directory '/tmp/B.jXlV1P/BUILD/OpenNI-OpenNI-1e9524f/Platform/Linux/Build/Samples/NiHandTracker' make[1]: Entering directory '/tmp/B.jXlV1P/BUILD/OpenNI-OpenNI-1e9524f/Platform/Linux/Build/Samples/SimpleViewer.java' rm -rf Manifest.txt make[1]: Leaving directory '/tmp/B.jXlV1P/BUILD/OpenNI-OpenNI-1e9524f/Platform/Linux/Build/Samples/SimpleViewer.java' make[1]: Entering directory '/tmp/B.jXlV1P/BUILD/OpenNI-OpenNI-1e9524f/Platform/Linux/Build/Samples/SimpleViewer.java' rm -rf x64-Release make[1]: Leaving directory '/tmp/B.jXlV1P/BUILD/OpenNI-OpenNI-1e9524f/Platform/Linux/Build/Samples/SimpleViewer.java' make[1]: Entering directory '/tmp/B.jXlV1P/BUILD/OpenNI-OpenNI-1e9524f/Platform/Linux/Build/Samples/NiUserSelection' rm -rf ../../../Bin/x64-Release/Sample-NiUserSelection make[1]: Leaving directory '/tmp/B.jXlV1P/BUILD/OpenNI-OpenNI-1e9524f/Platform/Linux/Build/Samples/NiUserSelection' make[1]: Entering directory '/tmp/B.jXlV1P/BUILD/OpenNI-OpenNI-1e9524f/Platform/Linux/Build/Samples/NiUserSelection' rm -rf ./x64-Release/UserSelector.o ./x64-Release/DefaultTrackingInitializer.o ./x64-Release/PoseUserSelector.o ./x64-Release/opengles.o ./x64-Release/ExitPoseDetector.o ./x64-Release/SampleManager.o ./x64-Release/TrackingInitializer.o ./x64-Release/SceneDrawer.o ./x64-Release/UserTracker.o ./x64-Release/PoseToggleUserSelector.o ./x64-Release/main.o ./x64-Release/SinglePoseUserSelector.o ./x64-Release/ClosestUserSelector.o make[1]: Leaving directory '/tmp/B.jXlV1P/BUILD/OpenNI-OpenNI-1e9524f/Platform/Linux/Build/Samples/NiUserSelection' make[1]: Entering directory '/tmp/B.jXlV1P/BUILD/OpenNI-OpenNI-1e9524f/Platform/Linux/Build/Samples/NiUserSelection' rm -rf ./x64-Release/UserSelector.d ./x64-Release/DefaultTrackingInitializer.d ./x64-Release/PoseUserSelector.d ./x64-Release/opengles.d ./x64-Release/ExitPoseDetector.d ./x64-Release/SampleManager.d ./x64-Release/TrackingInitializer.d ./x64-Release/SceneDrawer.d ./x64-Release/UserTracker.d ./x64-Release/PoseToggleUserSelector.d ./x64-Release/main.d ./x64-Release/SinglePoseUserSelector.d ./x64-Release/ClosestUserSelector.d make[1]: Leaving directory '/tmp/B.jXlV1P/BUILD/OpenNI-OpenNI-1e9524f/Platform/Linux/Build/Samples/NiUserSelection' make[1]: Entering directory '/tmp/B.jXlV1P/BUILD/OpenNI-OpenNI-1e9524f/Platform/Linux/Build/Samples/UserTracker.java' rm -rf ../../../Bin/x64-Release/org.openni.Samples.UserTracker.jar make[1]: Leaving directory '/tmp/B.jXlV1P/BUILD/OpenNI-OpenNI-1e9524f/Platform/Linux/Build/Samples/UserTracker.java' make[1]: Entering directory '/tmp/B.jXlV1P/BUILD/OpenNI-OpenNI-1e9524f/Platform/Linux/Build/Samples/UserTracker.java' rm -rf Manifest.txt make[1]: Leaving directory '/tmp/B.jXlV1P/BUILD/OpenNI-OpenNI-1e9524f/Platform/Linux/Build/Samples/UserTracker.java' make[1]: Entering directory '/tmp/B.jXlV1P/BUILD/OpenNI-OpenNI-1e9524f/Platform/Linux/Build/Samples/UserTracker.java' rm -rf x64-Release make[1]: Leaving directory '/tmp/B.jXlV1P/BUILD/OpenNI-OpenNI-1e9524f/Platform/Linux/Build/Samples/UserTracker.java' + export 'CFLAGS=-O2 -fwrapv -pipe -Wformat -Werror=format-security -gdwarf-4 -fno-debug-types-section -fvar-tracking-assignments -g2 -Wp,-D_FORTIFY_SOURCE=2 -fstack-protector-strong --param=ssp-buffer-size=4 -fPIC -march=x86-64 -gdwarf-4 -fno-debug-types-section -fvar-tracking-assignments -g2 ' + /usr/bin/make -Otarget -j5 -C Platform/Linux/Build 'CFG=PLD' 'CXX=x86_64-pld-linux-g++' 'HOSTPLATFORM=x64' 'SSE_GENERATION=' /usr/bin/make -C OpenNI make[1]: Entering directory '/tmp/B.jXlV1P/BUILD/OpenNI-OpenNI-1e9524f/Platform/Linux/Build/OpenNI' mkdir -p x64-PLD make[1]: Leaving directory '/tmp/B.jXlV1P/BUILD/OpenNI-OpenNI-1e9524f/Platform/Linux/Build/OpenNI' make[1]: Entering directory '/tmp/B.jXlV1P/BUILD/OpenNI-OpenNI-1e9524f/Platform/Linux/Build/OpenNI' mkdir -p ../../Bin/x64-PLD make[1]: Leaving directory '/tmp/B.jXlV1P/BUILD/OpenNI-OpenNI-1e9524f/Platform/Linux/Build/OpenNI' make[1]: Entering directory '/tmp/B.jXlV1P/BUILD/OpenNI-OpenNI-1e9524f/Platform/Linux/Build/OpenNI' x86_64-pld-linux-g++ -MD -MP -MT "./x64-PLD/XnFPSCalculator.d x64-PLD/XnFPSCalculator.o" -c -O2 -fwrapv -pipe -Wformat -Werror=format-security -gdwarf-4 -fno-debug-types-section -fvar-tracking-assignments -g2 -Wp,-D_FORTIFY_SOURCE=2 -fstack-protector-strong --param=ssp-buffer-size=4 -fPIC -march=x86-64 -gdwarf-4 -fno-debug-types-section -fvar-tracking-assignments -g2 -I../../../../Include -I../../../../Source -I../../../../Externals/TinyXml -DXN_EXPORTS -fPIC -fvisibility=hidden -o x64-PLD/XnFPSCalculator.o ../../../../Source/OpenNI/XnFPSCalculator.cpp make[1]: Leaving directory '/tmp/B.jXlV1P/BUILD/OpenNI-OpenNI-1e9524f/Platform/Linux/Build/OpenNI' make[1]: Entering directory '/tmp/B.jXlV1P/BUILD/OpenNI-OpenNI-1e9524f/Platform/Linux/Build/OpenNI' x86_64-pld-linux-g++ -MD -MP -MT "./x64-PLD/XnProfiling.d x64-PLD/XnProfiling.o" -c -O2 -fwrapv -pipe -Wformat -Werror=format-security -gdwarf-4 -fno-debug-types-section -fvar-tracking-assignments -g2 -Wp,-D_FORTIFY_SOURCE=2 -fstack-protector-strong --param=ssp-buffer-size=4 -fPIC -march=x86-64 -gdwarf-4 -fno-debug-types-section -fvar-tracking-assignments -g2 -I../../../../Include -I../../../../Source -I../../../../Externals/TinyXml -DXN_EXPORTS -fPIC -fvisibility=hidden -o x64-PLD/XnProfiling.o ../../../../Source/OpenNI/XnProfiling.cpp make[1]: Leaving directory '/tmp/B.jXlV1P/BUILD/OpenNI-OpenNI-1e9524f/Platform/Linux/Build/OpenNI' make[1]: Entering directory '/tmp/B.jXlV1P/BUILD/OpenNI-OpenNI-1e9524f/Platform/Linux/Build/OpenNI' x86_64-pld-linux-g++ -MD -MP -MT "./x64-PLD/XnLogFileWriter.d x64-PLD/XnLogFileWriter.o" -c -O2 -fwrapv -pipe -Wformat -Werror=format-security -gdwarf-4 -fno-debug-types-section -fvar-tracking-assignments -g2 -Wp,-D_FORTIFY_SOURCE=2 -fstack-protector-strong --param=ssp-buffer-size=4 -fPIC -march=x86-64 -gdwarf-4 -fno-debug-types-section -fvar-tracking-assignments -g2 -I../../../../Include -I../../../../Source -I../../../../Externals/TinyXml -DXN_EXPORTS -fPIC -fvisibility=hidden -o x64-PLD/XnLogFileWriter.o ../../../../Source/OpenNI/XnLogFileWriter.cpp make[1]: Leaving directory '/tmp/B.jXlV1P/BUILD/OpenNI-OpenNI-1e9524f/Platform/Linux/Build/OpenNI' make[1]: Entering directory '/tmp/B.jXlV1P/BUILD/OpenNI-OpenNI-1e9524f/Platform/Linux/Build/OpenNI' x86_64-pld-linux-g++ -MD -MP -MT "./x64-PLD/XnUSB.d x64-PLD/XnUSB.o" -c -O2 -fwrapv -pipe -Wformat -Werror=format-security -gdwarf-4 -fno-debug-types-section -fvar-tracking-assignments -g2 -Wp,-D_FORTIFY_SOURCE=2 -fstack-protector-strong --param=ssp-buffer-size=4 -fPIC -march=x86-64 -gdwarf-4 -fno-debug-types-section -fvar-tracking-assignments -g2 -I../../../../Include -I../../../../Source -I../../../../Externals/TinyXml -DXN_EXPORTS -fPIC -fvisibility=hidden -o x64-PLD/XnUSB.o ../../../../Source/OpenNI/XnUSB.cpp make[1]: Leaving directory '/tmp/B.jXlV1P/BUILD/OpenNI-OpenNI-1e9524f/Platform/Linux/Build/OpenNI' make[1]: Entering directory '/tmp/B.jXlV1P/BUILD/OpenNI-OpenNI-1e9524f/Platform/Linux/Build/OpenNI' x86_64-pld-linux-g++ -MD -MP -MT "./x64-PLD/XnQueries.d x64-PLD/XnQueries.o" -c -O2 -fwrapv -pipe -Wformat -Werror=format-security -gdwarf-4 -fno-debug-types-section -fvar-tracking-assignments -g2 -Wp,-D_FORTIFY_SOURCE=2 -fstack-protector-strong --param=ssp-buffer-size=4 -fPIC -march=x86-64 -gdwarf-4 -fno-debug-types-section -fvar-tracking-assignments -g2 -I../../../../Include -I../../../../Source -I../../../../Externals/TinyXml -DXN_EXPORTS -fPIC -fvisibility=hidden -o x64-PLD/XnQueries.o ../../../../Source/OpenNI/XnQueries.cpp make[1]: Leaving directory '/tmp/B.jXlV1P/BUILD/OpenNI-OpenNI-1e9524f/Platform/Linux/Build/OpenNI' make[1]: Entering directory '/tmp/B.jXlV1P/BUILD/OpenNI-OpenNI-1e9524f/Platform/Linux/Build/OpenNI' x86_64-pld-linux-g++ -MD -MP -MT "./x64-PLD/XnLogConsoleWriter.d x64-PLD/XnLogConsoleWriter.o" -c -O2 -fwrapv -pipe -Wformat -Werror=format-security -gdwarf-4 -fno-debug-types-section -fvar-tracking-assignments -g2 -Wp,-D_FORTIFY_SOURCE=2 -fstack-protector-strong --param=ssp-buffer-size=4 -fPIC -march=x86-64 -gdwarf-4 -fno-debug-types-section -fvar-tracking-assignments -g2 -I../../../../Include -I../../../../Source -I../../../../Externals/TinyXml -DXN_EXPORTS -fPIC -fvisibility=hidden -o x64-PLD/XnLogConsoleWriter.o ../../../../Source/OpenNI/XnLogConsoleWriter.cpp make[1]: Leaving directory '/tmp/B.jXlV1P/BUILD/OpenNI-OpenNI-1e9524f/Platform/Linux/Build/OpenNI' make[1]: Entering directory '/tmp/B.jXlV1P/BUILD/OpenNI-OpenNI-1e9524f/Platform/Linux/Build/OpenNI' x86_64-pld-linux-g++ -MD -MP -MT "./x64-PLD/XnTypeManager.d x64-PLD/XnTypeManager.o" -c -O2 -fwrapv -pipe -Wformat -Werror=format-security -gdwarf-4 -fno-debug-types-section -fvar-tracking-assignments -g2 -Wp,-D_FORTIFY_SOURCE=2 -fstack-protector-strong --param=ssp-buffer-size=4 -fPIC -march=x86-64 -gdwarf-4 -fno-debug-types-section -fvar-tracking-assignments -g2 -I../../../../Include -I../../../../Source -I../../../../Externals/TinyXml -DXN_EXPORTS -fPIC -fvisibility=hidden -o x64-PLD/XnTypeManager.o ../../../../Source/OpenNI/XnTypeManager.cpp make[1]: Leaving directory '/tmp/B.jXlV1P/BUILD/OpenNI-OpenNI-1e9524f/Platform/Linux/Build/OpenNI' make[1]: Entering directory '/tmp/B.jXlV1P/BUILD/OpenNI-OpenNI-1e9524f/Platform/Linux/Build/OpenNI' x86_64-pld-linux-g++ -MD -MP -MT "./x64-PLD/XnBaseNode.d x64-PLD/XnBaseNode.o" -c -O2 -fwrapv -pipe -Wformat -Werror=format-security -gdwarf-4 -fno-debug-types-section -fvar-tracking-assignments -g2 -Wp,-D_FORTIFY_SOURCE=2 -fstack-protector-strong --param=ssp-buffer-size=4 -fPIC -march=x86-64 -gdwarf-4 -fno-debug-types-section -fvar-tracking-assignments -g2 -I../../../../Include -I../../../../Source -I../../../../Externals/TinyXml -DXN_EXPORTS -fPIC -fvisibility=hidden -o x64-PLD/XnBaseNode.o ../../../../Source/OpenNI/XnBaseNode.cpp make[1]: Leaving directory '/tmp/B.jXlV1P/BUILD/OpenNI-OpenNI-1e9524f/Platform/Linux/Build/OpenNI' make[1]: Entering directory '/tmp/B.jXlV1P/BUILD/OpenNI-OpenNI-1e9524f/Platform/Linux/Build/OpenNI' x86_64-pld-linux-g++ -MD -MP -MT "./x64-PLD/XnEnumerationErrors.d x64-PLD/XnEnumerationErrors.o" -c -O2 -fwrapv -pipe -Wformat -Werror=format-security -gdwarf-4 -fno-debug-types-section -fvar-tracking-assignments -g2 -Wp,-D_FORTIFY_SOURCE=2 -fstack-protector-strong --param=ssp-buffer-size=4 -fPIC -march=x86-64 -gdwarf-4 -fno-debug-types-section -fvar-tracking-assignments -g2 -I../../../../Include -I../../../../Source -I../../../../Externals/TinyXml -DXN_EXPORTS -fPIC -fvisibility=hidden -o x64-PLD/XnEnumerationErrors.o ../../../../Source/OpenNI/XnEnumerationErrors.cpp make[1]: Leaving directory '/tmp/B.jXlV1P/BUILD/OpenNI-OpenNI-1e9524f/Platform/Linux/Build/OpenNI' make[1]: Entering directory '/tmp/B.jXlV1P/BUILD/OpenNI-OpenNI-1e9524f/Platform/Linux/Build/OpenNI' x86_64-pld-linux-g++ -MD -MP -MT "./x64-PLD/XnDumpFileWriter.d x64-PLD/XnDumpFileWriter.o" -c -O2 -fwrapv -pipe -Wformat -Werror=format-security -gdwarf-4 -fno-debug-types-section -fvar-tracking-assignments -g2 -Wp,-D_FORTIFY_SOURCE=2 -fstack-protector-strong --param=ssp-buffer-size=4 -fPIC -march=x86-64 -gdwarf-4 -fno-debug-types-section -fvar-tracking-assignments -g2 -I../../../../Include -I../../../../Source -I../../../../Externals/TinyXml -DXN_EXPORTS -fPIC -fvisibility=hidden -o x64-PLD/XnDumpFileWriter.o ../../../../Source/OpenNI/XnDumpFileWriter.cpp make[1]: Leaving directory '/tmp/B.jXlV1P/BUILD/OpenNI-OpenNI-1e9524f/Platform/Linux/Build/OpenNI' make[1]: Entering directory '/tmp/B.jXlV1P/BUILD/OpenNI-OpenNI-1e9524f/Platform/Linux/Build/OpenNI' x86_64-pld-linux-g++ -MD -MP -MT "./x64-PLD/XnOSMemoryProfiling.d x64-PLD/XnOSMemoryProfiling.o" -c -O2 -fwrapv -pipe -Wformat -Werror=format-security -gdwarf-4 -fno-debug-types-section -fvar-tracking-assignments -g2 -Wp,-D_FORTIFY_SOURCE=2 -fstack-protector-strong --param=ssp-buffer-size=4 -fPIC -march=x86-64 -gdwarf-4 -fno-debug-types-section -fvar-tracking-assignments -g2 -I../../../../Include -I../../../../Source -I../../../../Externals/TinyXml -DXN_EXPORTS -fPIC -fvisibility=hidden -o x64-PLD/XnOSMemoryProfiling.o ../../../../Source/OpenNI/XnOSMemoryProfiling.cpp make[1]: Leaving directory '/tmp/B.jXlV1P/BUILD/OpenNI-OpenNI-1e9524f/Platform/Linux/Build/OpenNI' make[1]: Entering directory '/tmp/B.jXlV1P/BUILD/OpenNI-OpenNI-1e9524f/Platform/Linux/Build/OpenNI' x86_64-pld-linux-g++ -MD -MP -MT "./x64-PLD/XnLicensing.d x64-PLD/XnLicensing.o" -c -O2 -fwrapv -pipe -Wformat -Werror=format-security -gdwarf-4 -fno-debug-types-section -fvar-tracking-assignments -g2 -Wp,-D_FORTIFY_SOURCE=2 -fstack-protector-strong --param=ssp-buffer-size=4 -fPIC -march=x86-64 -gdwarf-4 -fno-debug-types-section -fvar-tracking-assignments -g2 -I../../../../Include -I../../../../Source -I../../../../Externals/TinyXml -DXN_EXPORTS -fPIC -fvisibility=hidden -o x64-PLD/XnLicensing.o ../../../../Source/OpenNI/XnLicensing.cpp make[1]: Leaving directory '/tmp/B.jXlV1P/BUILD/OpenNI-OpenNI-1e9524f/Platform/Linux/Build/OpenNI' make[1]: Entering directory '/tmp/B.jXlV1P/BUILD/OpenNI-OpenNI-1e9524f/Platform/Linux/Build/OpenNI' x86_64-pld-linux-g++ -MD -MP -MT "./x64-PLD/XnOS.d x64-PLD/XnOS.o" -c -O2 -fwrapv -pipe -Wformat -Werror=format-security -gdwarf-4 -fno-debug-types-section -fvar-tracking-assignments -g2 -Wp,-D_FORTIFY_SOURCE=2 -fstack-protector-strong --param=ssp-buffer-size=4 -fPIC -march=x86-64 -gdwarf-4 -fno-debug-types-section -fvar-tracking-assignments -g2 -I../../../../Include -I../../../../Source -I../../../../Externals/TinyXml -DXN_EXPORTS -fPIC -fvisibility=hidden -o x64-PLD/XnOS.o ../../../../Source/OpenNI/XnOS.cpp make[1]: Leaving directory '/tmp/B.jXlV1P/BUILD/OpenNI-OpenNI-1e9524f/Platform/Linux/Build/OpenNI' make[1]: Entering directory '/tmp/B.jXlV1P/BUILD/OpenNI-OpenNI-1e9524f/Platform/Linux/Build/OpenNI' x86_64-pld-linux-g++ -MD -MP -MT "./x64-PLD/XnXml.d x64-PLD/XnXml.o" -c -O2 -fwrapv -pipe -Wformat -Werror=format-security -gdwarf-4 -fno-debug-types-section -fvar-tracking-assignments -g2 -Wp,-D_FORTIFY_SOURCE=2 -fstack-protector-strong --param=ssp-buffer-size=4 -fPIC -march=x86-64 -gdwarf-4 -fno-debug-types-section -fvar-tracking-assignments -g2 -I../../../../Include -I../../../../Source -I../../../../Externals/TinyXml -DXN_EXPORTS -fPIC -fvisibility=hidden -o x64-PLD/XnXml.o ../../../../Source/OpenNI/XnXml.cpp make[1]: Leaving directory '/tmp/B.jXlV1P/BUILD/OpenNI-OpenNI-1e9524f/Platform/Linux/Build/OpenNI' make[1]: Entering directory '/tmp/B.jXlV1P/BUILD/OpenNI-OpenNI-1e9524f/Platform/Linux/Build/OpenNI' x86_64-pld-linux-g++ -MD -MP -MT "./x64-PLD/XnRecorderImpl.d x64-PLD/XnRecorderImpl.o" -c -O2 -fwrapv -pipe -Wformat -Werror=format-security -gdwarf-4 -fno-debug-types-section -fvar-tracking-assignments -g2 -Wp,-D_FORTIFY_SOURCE=2 -fstack-protector-strong --param=ssp-buffer-size=4 -fPIC -march=x86-64 -gdwarf-4 -fno-debug-types-section -fvar-tracking-assignments -g2 -I../../../../Include -I../../../../Source -I../../../../Externals/TinyXml -DXN_EXPORTS -fPIC -fvisibility=hidden -o x64-PLD/XnRecorderImpl.o ../../../../Source/OpenNI/XnRecorderImpl.cpp make[1]: Leaving directory '/tmp/B.jXlV1P/BUILD/OpenNI-OpenNI-1e9524f/Platform/Linux/Build/OpenNI' make[1]: Entering directory '/tmp/B.jXlV1P/BUILD/OpenNI-OpenNI-1e9524f/Platform/Linux/Build/OpenNI' x86_64-pld-linux-g++ -MD -MP -MT "./x64-PLD/openNI.d x64-PLD/openNI.o" -c -O2 -fwrapv -pipe -Wformat -Werror=format-security -gdwarf-4 -fno-debug-types-section -fvar-tracking-assignments -g2 -Wp,-D_FORTIFY_SOURCE=2 -fstack-protector-strong --param=ssp-buffer-size=4 -fPIC -march=x86-64 -gdwarf-4 -fno-debug-types-section -fvar-tracking-assignments -g2 -I../../../../Include -I../../../../Source -I../../../../Externals/TinyXml -DXN_EXPORTS -fPIC -fvisibility=hidden -o x64-PLD/openNI.o ../../../../Source/OpenNI/openNI.cpp make[1]: Leaving directory '/tmp/B.jXlV1P/BUILD/OpenNI-OpenNI-1e9524f/Platform/Linux/Build/OpenNI' make[1]: Entering directory '/tmp/B.jXlV1P/BUILD/OpenNI-OpenNI-1e9524f/Platform/Linux/Build/OpenNI' x86_64-pld-linux-g++ -MD -MP -MT "./x64-PLD/XnScheduler.d x64-PLD/XnScheduler.o" -c -O2 -fwrapv -pipe -Wformat -Werror=format-security -gdwarf-4 -fno-debug-types-section -fvar-tracking-assignments -g2 -Wp,-D_FORTIFY_SOURCE=2 -fstack-protector-strong --param=ssp-buffer-size=4 -fPIC -march=x86-64 -gdwarf-4 -fno-debug-types-section -fvar-tracking-assignments -g2 -I../../../../Include -I../../../../Source -I../../../../Externals/TinyXml -DXN_EXPORTS -fPIC -fvisibility=hidden -o x64-PLD/XnScheduler.o ../../../../Source/OpenNI/XnScheduler.cpp make[1]: Leaving directory '/tmp/B.jXlV1P/BUILD/OpenNI-OpenNI-1e9524f/Platform/Linux/Build/OpenNI' make[1]: Entering directory '/tmp/B.jXlV1P/BUILD/OpenNI-OpenNI-1e9524f/Platform/Linux/Build/OpenNI' x86_64-pld-linux-g++ -MD -MP -MT "./x64-PLD/XnUtils.d x64-PLD/XnUtils.o" -c -O2 -fwrapv -pipe -Wformat -Werror=format-security -gdwarf-4 -fno-debug-types-section -fvar-tracking-assignments -g2 -Wp,-D_FORTIFY_SOURCE=2 -fstack-protector-strong --param=ssp-buffer-size=4 -fPIC -march=x86-64 -gdwarf-4 -fno-debug-types-section -fvar-tracking-assignments -g2 -I../../../../Include -I../../../../Source -I../../../../Externals/TinyXml -DXN_EXPORTS -fPIC -fvisibility=hidden -o x64-PLD/XnUtils.o ../../../../Source/OpenNI/XnUtils.cpp make[1]: Leaving directory '/tmp/B.jXlV1P/BUILD/OpenNI-OpenNI-1e9524f/Platform/Linux/Build/OpenNI' make[1]: Entering directory '/tmp/B.jXlV1P/BUILD/OpenNI-OpenNI-1e9524f/Platform/Linux/Build/OpenNI' x86_64-pld-linux-g++ -MD -MP -MT "./x64-PLD/XnXmlScriptNodeExporter.d x64-PLD/XnXmlScriptNodeExporter.o" -c -O2 -fwrapv -pipe -Wformat -Werror=format-security -gdwarf-4 -fno-debug-types-section -fvar-tracking-assignments -g2 -Wp,-D_FORTIFY_SOURCE=2 -fstack-protector-strong --param=ssp-buffer-size=4 -fPIC -march=x86-64 -gdwarf-4 -fno-debug-types-section -fvar-tracking-assignments -g2 -I../../../../Include -I../../../../Source -I../../../../Externals/TinyXml -DXN_EXPORTS -fPIC -fvisibility=hidden -o x64-PLD/XnXmlScriptNodeExporter.o ../../../../Source/OpenNI/XnXmlScriptNodeExporter.cpp make[1]: Leaving directory '/tmp/B.jXlV1P/BUILD/OpenNI-OpenNI-1e9524f/Platform/Linux/Build/OpenNI' make[1]: Entering directory '/tmp/B.jXlV1P/BUILD/OpenNI-OpenNI-1e9524f/Platform/Linux/Build/OpenNI' x86_64-pld-linux-g++ -MD -MP -MT "./x64-PLD/XnLog.d x64-PLD/XnLog.o" -c -O2 -fwrapv -pipe -Wformat -Werror=format-security -gdwarf-4 -fno-debug-types-section -fvar-tracking-assignments -g2 -Wp,-D_FORTIFY_SOURCE=2 -fstack-protector-strong --param=ssp-buffer-size=4 -fPIC -march=x86-64 -gdwarf-4 -fno-debug-types-section -fvar-tracking-assignments -g2 -I../../../../Include -I../../../../Source -I../../../../Externals/TinyXml -DXN_EXPORTS -fPIC -fvisibility=hidden -o x64-PLD/XnLog.o ../../../../Source/OpenNI/XnLog.cpp make[1]: Leaving directory '/tmp/B.jXlV1P/BUILD/OpenNI-OpenNI-1e9524f/Platform/Linux/Build/OpenNI' make[1]: Entering directory '/tmp/B.jXlV1P/BUILD/OpenNI-OpenNI-1e9524f/Platform/Linux/Build/OpenNI' x86_64-pld-linux-g++ -MD -MP -MT "./x64-PLD/XnExportedNodes.d x64-PLD/XnExportedNodes.o" -c -O2 -fwrapv -pipe -Wformat -Werror=format-security -gdwarf-4 -fno-debug-types-section -fvar-tracking-assignments -g2 -Wp,-D_FORTIFY_SOURCE=2 -fstack-protector-strong --param=ssp-buffer-size=4 -fPIC -march=x86-64 -gdwarf-4 -fno-debug-types-section -fvar-tracking-assignments -g2 -I../../../../Include -I../../../../Source -I../../../../Externals/TinyXml -DXN_EXPORTS -fPIC -fvisibility=hidden -o x64-PLD/XnExportedNodes.o ../../../../Source/OpenNI/XnExportedNodes.cpp make[1]: Leaving directory '/tmp/B.jXlV1P/BUILD/OpenNI-OpenNI-1e9524f/Platform/Linux/Build/OpenNI' make[1]: Entering directory '/tmp/B.jXlV1P/BUILD/OpenNI-OpenNI-1e9524f/Platform/Linux/Build/OpenNI' x86_64-pld-linux-g++ -MD -MP -MT "./x64-PLD/XnMockNotifier.d x64-PLD/XnMockNotifier.o" -c -O2 -fwrapv -pipe -Wformat -Werror=format-security -gdwarf-4 -fno-debug-types-section -fvar-tracking-assignments -g2 -Wp,-D_FORTIFY_SOURCE=2 -fstack-protector-strong --param=ssp-buffer-size=4 -fPIC -march=x86-64 -gdwarf-4 -fno-debug-types-section -fvar-tracking-assignments -g2 -I../../../../Include -I../../../../Source -I../../../../Externals/TinyXml -DXN_EXPORTS -fPIC -fvisibility=hidden -o x64-PLD/XnMockNotifier.o ../../../../Source/OpenNI/XnMockNotifier.cpp make[1]: Leaving directory '/tmp/B.jXlV1P/BUILD/OpenNI-OpenNI-1e9524f/Platform/Linux/Build/OpenNI' make[1]: Entering directory '/tmp/B.jXlV1P/BUILD/OpenNI-OpenNI-1e9524f/Platform/Linux/Build/OpenNI' x86_64-pld-linux-g++ -MD -MP -MT "./x64-PLD/XnNodeManager.d x64-PLD/XnNodeManager.o" -c -O2 -fwrapv -pipe -Wformat -Werror=format-security -gdwarf-4 -fno-debug-types-section -fvar-tracking-assignments -g2 -Wp,-D_FORTIFY_SOURCE=2 -fstack-protector-strong --param=ssp-buffer-size=4 -fPIC -march=x86-64 -gdwarf-4 -fno-debug-types-section -fvar-tracking-assignments -g2 -I../../../../Include -I../../../../Source -I../../../../Externals/TinyXml -DXN_EXPORTS -fPIC -fvisibility=hidden -o x64-PLD/XnNodeManager.o ../../../../Source/OpenNI/XnNodeManager.cpp make[1]: Leaving directory '/tmp/B.jXlV1P/BUILD/OpenNI-OpenNI-1e9524f/Platform/Linux/Build/OpenNI' make[1]: Entering directory '/tmp/B.jXlV1P/BUILD/OpenNI-OpenNI-1e9524f/Platform/Linux/Build/OpenNI' x86_64-pld-linux-g++ -MD -MP -MT "./x64-PLD/XnStatusRegister.d x64-PLD/XnStatusRegister.o" -c -O2 -fwrapv -pipe -Wformat -Werror=format-security -gdwarf-4 -fno-debug-types-section -fvar-tracking-assignments -g2 -Wp,-D_FORTIFY_SOURCE=2 -fstack-protector-strong --param=ssp-buffer-size=4 -fPIC -march=x86-64 -gdwarf-4 -fno-debug-types-section -fvar-tracking-assignments -g2 -I../../../../Include -I../../../../Source -I../../../../Externals/TinyXml -DXN_EXPORTS -fPIC -fvisibility=hidden -o x64-PLD/XnStatusRegister.o ../../../../Source/OpenNI/XnStatusRegister.cpp make[1]: Leaving directory '/tmp/B.jXlV1P/BUILD/OpenNI-OpenNI-1e9524f/Platform/Linux/Build/OpenNI' make[1]: Entering directory '/tmp/B.jXlV1P/BUILD/OpenNI-OpenNI-1e9524f/Platform/Linux/Build/OpenNI' x86_64-pld-linux-g++ -MD -MP -MT "./x64-PLD/XnPlayerImpl.d x64-PLD/XnPlayerImpl.o" -c -O2 -fwrapv -pipe -Wformat -Werror=format-security -gdwarf-4 -fno-debug-types-section -fvar-tracking-assignments -g2 -Wp,-D_FORTIFY_SOURCE=2 -fstack-protector-strong --param=ssp-buffer-size=4 -fPIC -march=x86-64 -gdwarf-4 -fno-debug-types-section -fvar-tracking-assignments -g2 -I../../../../Include -I../../../../Source -I../../../../Externals/TinyXml -DXN_EXPORTS -fPIC -fvisibility=hidden -o x64-PLD/XnPlayerImpl.o ../../../../Source/OpenNI/XnPlayerImpl.cpp make[1]: Leaving directory '/tmp/B.jXlV1P/BUILD/OpenNI-OpenNI-1e9524f/Platform/Linux/Build/OpenNI' make[1]: Entering directory '/tmp/B.jXlV1P/BUILD/OpenNI-OpenNI-1e9524f/Platform/Linux/Build/OpenNI' x86_64-pld-linux-g++ -MD -MP -MT "./x64-PLD/XnLogAndroidWriter.d x64-PLD/XnLogAndroidWriter.o" -c -O2 -fwrapv -pipe -Wformat -Werror=format-security -gdwarf-4 -fno-debug-types-section -fvar-tracking-assignments -g2 -Wp,-D_FORTIFY_SOURCE=2 -fstack-protector-strong --param=ssp-buffer-size=4 -fPIC -march=x86-64 -gdwarf-4 -fno-debug-types-section -fvar-tracking-assignments -g2 -I../../../../Include -I../../../../Source -I../../../../Externals/TinyXml -DXN_EXPORTS -fPIC -fvisibility=hidden -o x64-PLD/XnLogAndroidWriter.o ../../../../Source/OpenNI/XnLogAndroidWriter.cpp make[1]: Leaving directory '/tmp/B.jXlV1P/BUILD/OpenNI-OpenNI-1e9524f/Platform/Linux/Build/OpenNI' make[1]: Entering directory '/tmp/B.jXlV1P/BUILD/OpenNI-OpenNI-1e9524f/Platform/Linux/Build/OpenNI' x86_64-pld-linux-g++ -MD -MP -MT "./x64-PLD/XnNodeWatcher.d x64-PLD/XnNodeWatcher.o" -c -O2 -fwrapv -pipe -Wformat -Werror=format-security -gdwarf-4 -fno-debug-types-section -fvar-tracking-assignments -g2 -Wp,-D_FORTIFY_SOURCE=2 -fstack-protector-strong --param=ssp-buffer-size=4 -fPIC -march=x86-64 -gdwarf-4 -fno-debug-types-section -fvar-tracking-assignments -g2 -I../../../../Include -I../../../../Source -I../../../../Externals/TinyXml -DXN_EXPORTS -fPIC -fvisibility=hidden -o x64-PLD/XnNodeWatcher.o ../../../../Source/OpenNI/XnNodeWatcher.cpp make[1]: Leaving directory '/tmp/B.jXlV1P/BUILD/OpenNI-OpenNI-1e9524f/Platform/Linux/Build/OpenNI' make[1]: Entering directory '/tmp/B.jXlV1P/BUILD/OpenNI-OpenNI-1e9524f/Platform/Linux/Build/OpenNI' x86_64-pld-linux-g++ -MD -MP -MT "./x64-PLD/XnXmlScriptNode.d x64-PLD/XnXmlScriptNode.o" -c -O2 -fwrapv -pipe -Wformat -Werror=format-security -gdwarf-4 -fno-debug-types-section -fvar-tracking-assignments -g2 -Wp,-D_FORTIFY_SOURCE=2 -fstack-protector-strong --param=ssp-buffer-size=4 -fPIC -march=x86-64 -gdwarf-4 -fno-debug-types-section -fvar-tracking-assignments -g2 -I../../../../Include -I../../../../Source -I../../../../Externals/TinyXml -DXN_EXPORTS -fPIC -fvisibility=hidden -o x64-PLD/XnXmlScriptNode.o ../../../../Source/OpenNI/XnXmlScriptNode.cpp make[1]: Leaving directory '/tmp/B.jXlV1P/BUILD/OpenNI-OpenNI-1e9524f/Platform/Linux/Build/OpenNI' make[1]: Entering directory '/tmp/B.jXlV1P/BUILD/OpenNI-OpenNI-1e9524f/Platform/Linux/Build/OpenNI' x86_64-pld-linux-g++ -MD -MP -MT "./x64-PLD/LinuxEvents.d x64-PLD/LinuxEvents.o" -c -O2 -fwrapv -pipe -Wformat -Werror=format-security -gdwarf-4 -fno-debug-types-section -fvar-tracking-assignments -g2 -Wp,-D_FORTIFY_SOURCE=2 -fstack-protector-strong --param=ssp-buffer-size=4 -fPIC -march=x86-64 -gdwarf-4 -fno-debug-types-section -fvar-tracking-assignments -g2 -I../../../../Include -I../../../../Source -I../../../../Externals/TinyXml -DXN_EXPORTS -fPIC -fvisibility=hidden -o x64-PLD/LinuxEvents.o ../../../../Source/OpenNI/Linux/LinuxEvents.cpp make[1]: Leaving directory '/tmp/B.jXlV1P/BUILD/OpenNI-OpenNI-1e9524f/Platform/Linux/Build/OpenNI' make[1]: Entering directory '/tmp/B.jXlV1P/BUILD/OpenNI-OpenNI-1e9524f/Platform/Linux/Build/OpenNI' x86_64-pld-linux-g++ -MD -MP -MT "./x64-PLD/XnModuleLoader.d x64-PLD/XnModuleLoader.o" -c -O2 -fwrapv -pipe -Wformat -Werror=format-security -gdwarf-4 -fno-debug-types-section -fvar-tracking-assignments -g2 -Wp,-D_FORTIFY_SOURCE=2 -fstack-protector-strong --param=ssp-buffer-size=4 -fPIC -march=x86-64 -gdwarf-4 -fno-debug-types-section -fvar-tracking-assignments -g2 -I../../../../Include -I../../../../Source -I../../../../Externals/TinyXml -DXN_EXPORTS -fPIC -fvisibility=hidden -o x64-PLD/XnModuleLoader.o ../../../../Source/OpenNI/XnModuleLoader.cpp make[1]: Leaving directory '/tmp/B.jXlV1P/BUILD/OpenNI-OpenNI-1e9524f/Platform/Linux/Build/OpenNI' make[1]: Entering directory '/tmp/B.jXlV1P/BUILD/OpenNI-OpenNI-1e9524f/Platform/Linux/Build/OpenNI' x86_64-pld-linux-g++ -MD -MP -MT "./x64-PLD/LinuxPosixNamedEvents.d x64-PLD/LinuxPosixNamedEvents.o" -c -O2 -fwrapv -pipe -Wformat -Werror=format-security -gdwarf-4 -fno-debug-types-section -fvar-tracking-assignments -g2 -Wp,-D_FORTIFY_SOURCE=2 -fstack-protector-strong --param=ssp-buffer-size=4 -fPIC -march=x86-64 -gdwarf-4 -fno-debug-types-section -fvar-tracking-assignments -g2 -I../../../../Include -I../../../../Source -I../../../../Externals/TinyXml -DXN_EXPORTS -fPIC -fvisibility=hidden -o x64-PLD/LinuxPosixNamedEvents.o ../../../../Source/OpenNI/Linux/LinuxPosixNamedEvents.cpp make[1]: Leaving directory '/tmp/B.jXlV1P/BUILD/OpenNI-OpenNI-1e9524f/Platform/Linux/Build/OpenNI' make[1]: Entering directory '/tmp/B.jXlV1P/BUILD/OpenNI-OpenNI-1e9524f/Platform/Linux/Build/OpenNI' x86_64-pld-linux-g++ -MD -MP -MT "./x64-PLD/XnDump.d x64-PLD/XnDump.o" -c -O2 -fwrapv -pipe -Wformat -Werror=format-security -gdwarf-4 -fno-debug-types-section -fvar-tracking-assignments -g2 -Wp,-D_FORTIFY_SOURCE=2 -fstack-protector-strong --param=ssp-buffer-size=4 -fPIC -march=x86-64 -gdwarf-4 -fno-debug-types-section -fvar-tracking-assignments -g2 -I../../../../Include -I../../../../Source -I../../../../Externals/TinyXml -DXN_EXPORTS -fPIC -fvisibility=hidden -o x64-PLD/XnDump.o ../../../../Source/OpenNI/XnDump.cpp make[1]: Leaving directory '/tmp/B.jXlV1P/BUILD/OpenNI-OpenNI-1e9524f/Platform/Linux/Build/OpenNI' make[1]: Entering directory '/tmp/B.jXlV1P/BUILD/OpenNI-OpenNI-1e9524f/Platform/Linux/Build/OpenNI' x86_64-pld-linux-g++ -MD -MP -MT "./x64-PLD/LinuxCriticalSections.d x64-PLD/LinuxCriticalSections.o" -c -O2 -fwrapv -pipe -Wformat -Werror=format-security -gdwarf-4 -fno-debug-types-section -fvar-tracking-assignments -g2 -Wp,-D_FORTIFY_SOURCE=2 -fstack-protector-strong --param=ssp-buffer-size=4 -fPIC -march=x86-64 -gdwarf-4 -fno-debug-types-section -fvar-tracking-assignments -g2 -I../../../../Include -I../../../../Source -I../../../../Externals/TinyXml -DXN_EXPORTS -fPIC -fvisibility=hidden -o x64-PLD/LinuxCriticalSections.o ../../../../Source/OpenNI/Linux/LinuxCriticalSections.cpp make[1]: Leaving directory '/tmp/B.jXlV1P/BUILD/OpenNI-OpenNI-1e9524f/Platform/Linux/Build/OpenNI' make[1]: Entering directory '/tmp/B.jXlV1P/BUILD/OpenNI-OpenNI-1e9524f/Platform/Linux/Build/OpenNI' x86_64-pld-linux-g++ -MD -MP -MT "./x64-PLD/LinuxStrings.d x64-PLD/LinuxStrings.o" -c -O2 -fwrapv -pipe -Wformat -Werror=format-security -gdwarf-4 -fno-debug-types-section -fvar-tracking-assignments -g2 -Wp,-D_FORTIFY_SOURCE=2 -fstack-protector-strong --param=ssp-buffer-size=4 -fPIC -march=x86-64 -gdwarf-4 -fno-debug-types-section -fvar-tracking-assignments -g2 -I../../../../Include -I../../../../Source -I../../../../Externals/TinyXml -DXN_EXPORTS -fPIC -fvisibility=hidden -o x64-PLD/LinuxStrings.o ../../../../Source/OpenNI/Linux/LinuxStrings.cpp make[1]: Leaving directory '/tmp/B.jXlV1P/BUILD/OpenNI-OpenNI-1e9524f/Platform/Linux/Build/OpenNI' make[1]: Entering directory '/tmp/B.jXlV1P/BUILD/OpenNI-OpenNI-1e9524f/Platform/Linux/Build/OpenNI' x86_64-pld-linux-g++ -MD -MP -MT "./x64-PLD/LinuxMutex.d x64-PLD/LinuxMutex.o" -c -O2 -fwrapv -pipe -Wformat -Werror=format-security -gdwarf-4 -fno-debug-types-section -fvar-tracking-assignments -g2 -Wp,-D_FORTIFY_SOURCE=2 -fstack-protector-strong --param=ssp-buffer-size=4 -fPIC -march=x86-64 -gdwarf-4 -fno-debug-types-section -fvar-tracking-assignments -g2 -I../../../../Include -I../../../../Source -I../../../../Externals/TinyXml -DXN_EXPORTS -fPIC -fvisibility=hidden -o x64-PLD/LinuxMutex.o ../../../../Source/OpenNI/Linux/LinuxMutex.cpp make[1]: Leaving directory '/tmp/B.jXlV1P/BUILD/OpenNI-OpenNI-1e9524f/Platform/Linux/Build/OpenNI' make[1]: Entering directory '/tmp/B.jXlV1P/BUILD/OpenNI-OpenNI-1e9524f/Platform/Linux/Build/OpenNI' x86_64-pld-linux-g++ -MD -MP -MT "./x64-PLD/LinuxUSBDevice.d x64-PLD/LinuxUSBDevice.o" -c -O2 -fwrapv -pipe -Wformat -Werror=format-security -gdwarf-4 -fno-debug-types-section -fvar-tracking-assignments -g2 -Wp,-D_FORTIFY_SOURCE=2 -fstack-protector-strong --param=ssp-buffer-size=4 -fPIC -march=x86-64 -gdwarf-4 -fno-debug-types-section -fvar-tracking-assignments -g2 -I../../../../Include -I../../../../Source -I../../../../Externals/TinyXml -DXN_EXPORTS -fPIC -fvisibility=hidden -o x64-PLD/LinuxUSBDevice.o ../../../../Source/OpenNI/Linux/LinuxUSBDevice.cpp make[1]: Leaving directory '/tmp/B.jXlV1P/BUILD/OpenNI-OpenNI-1e9524f/Platform/Linux/Build/OpenNI' make[1]: Entering directory '/tmp/B.jXlV1P/BUILD/OpenNI-OpenNI-1e9524f/Platform/Linux/Build/OpenNI' x86_64-pld-linux-g++ -MD -MP -MT "./x64-PLD/LinuxPosixEvents.d x64-PLD/LinuxPosixEvents.o" -c -O2 -fwrapv -pipe -Wformat -Werror=format-security -gdwarf-4 -fno-debug-types-section -fvar-tracking-assignments -g2 -Wp,-D_FORTIFY_SOURCE=2 -fstack-protector-strong --param=ssp-buffer-size=4 -fPIC -march=x86-64 -gdwarf-4 -fno-debug-types-section -fvar-tracking-assignments -g2 -I../../../../Include -I../../../../Source -I../../../../Externals/TinyXml -DXN_EXPORTS -fPIC -fvisibility=hidden -o x64-PLD/LinuxPosixEvents.o ../../../../Source/OpenNI/Linux/LinuxPosixEvents.cpp make[1]: Leaving directory '/tmp/B.jXlV1P/BUILD/OpenNI-OpenNI-1e9524f/Platform/Linux/Build/OpenNI' make[1]: Entering directory '/tmp/B.jXlV1P/BUILD/OpenNI-OpenNI-1e9524f/Platform/Linux/Build/OpenNI' x86_64-pld-linux-g++ -MD -MP -MT "./x64-PLD/LinuxMemory.d x64-PLD/LinuxMemory.o" -c -O2 -fwrapv -pipe -Wformat -Werror=format-security -gdwarf-4 -fno-debug-types-section -fvar-tracking-assignments -g2 -Wp,-D_FORTIFY_SOURCE=2 -fstack-protector-strong --param=ssp-buffer-size=4 -fPIC -march=x86-64 -gdwarf-4 -fno-debug-types-section -fvar-tracking-assignments -g2 -I../../../../Include -I../../../../Source -I../../../../Externals/TinyXml -DXN_EXPORTS -fPIC -fvisibility=hidden -o x64-PLD/LinuxMemory.o ../../../../Source/OpenNI/Linux/LinuxMemory.cpp make[1]: Leaving directory '/tmp/B.jXlV1P/BUILD/OpenNI-OpenNI-1e9524f/Platform/Linux/Build/OpenNI' make[1]: Entering directory '/tmp/B.jXlV1P/BUILD/OpenNI-OpenNI-1e9524f/Platform/Linux/Build/OpenNI' x86_64-pld-linux-g++ -MD -MP -MT "./x64-PLD/LinuxProcesses.d x64-PLD/LinuxProcesses.o" -c -O2 -fwrapv -pipe -Wformat -Werror=format-security -gdwarf-4 -fno-debug-types-section -fvar-tracking-assignments -g2 -Wp,-D_FORTIFY_SOURCE=2 -fstack-protector-strong --param=ssp-buffer-size=4 -fPIC -march=x86-64 -gdwarf-4 -fno-debug-types-section -fvar-tracking-assignments -g2 -I../../../../Include -I../../../../Source -I../../../../Externals/TinyXml -DXN_EXPORTS -fPIC -fvisibility=hidden -o x64-PLD/LinuxProcesses.o ../../../../Source/OpenNI/Linux/LinuxProcesses.cpp make[1]: Leaving directory '/tmp/B.jXlV1P/BUILD/OpenNI-OpenNI-1e9524f/Platform/Linux/Build/OpenNI' make[1]: Entering directory '/tmp/B.jXlV1P/BUILD/OpenNI-OpenNI-1e9524f/Platform/Linux/Build/OpenNI' x86_64-pld-linux-g++ -MD -MP -MT "./x64-PLD/LinuxSharedLibs.d x64-PLD/LinuxSharedLibs.o" -c -O2 -fwrapv -pipe -Wformat -Werror=format-security -gdwarf-4 -fno-debug-types-section -fvar-tracking-assignments -g2 -Wp,-D_FORTIFY_SOURCE=2 -fstack-protector-strong --param=ssp-buffer-size=4 -fPIC -march=x86-64 -gdwarf-4 -fno-debug-types-section -fvar-tracking-assignments -g2 -I../../../../Include -I../../../../Source -I../../../../Externals/TinyXml -DXN_EXPORTS -fPIC -fvisibility=hidden -o x64-PLD/LinuxSharedLibs.o ../../../../Source/OpenNI/Linux/LinuxSharedLibs.cpp make[1]: Leaving directory '/tmp/B.jXlV1P/BUILD/OpenNI-OpenNI-1e9524f/Platform/Linux/Build/OpenNI' make[1]: Entering directory '/tmp/B.jXlV1P/BUILD/OpenNI-OpenNI-1e9524f/Platform/Linux/Build/OpenNI' x86_64-pld-linux-g++ -MD -MP -MT "./x64-PLD/LinuxThreads.d x64-PLD/LinuxThreads.o" -c -O2 -fwrapv -pipe -Wformat -Werror=format-security -gdwarf-4 -fno-debug-types-section -fvar-tracking-assignments -g2 -Wp,-D_FORTIFY_SOURCE=2 -fstack-protector-strong --param=ssp-buffer-size=4 -fPIC -march=x86-64 -gdwarf-4 -fno-debug-types-section -fvar-tracking-assignments -g2 -I../../../../Include -I../../../../Source -I../../../../Externals/TinyXml -DXN_EXPORTS -fPIC -fvisibility=hidden -o x64-PLD/LinuxThreads.o ../../../../Source/OpenNI/Linux/LinuxThreads.cpp make[1]: Leaving directory '/tmp/B.jXlV1P/BUILD/OpenNI-OpenNI-1e9524f/Platform/Linux/Build/OpenNI' make[1]: Entering directory '/tmp/B.jXlV1P/BUILD/OpenNI-OpenNI-1e9524f/Platform/Linux/Build/OpenNI' x86_64-pld-linux-g++ -MD -MP -MT "./x64-PLD/LinuxSharedMemory.d x64-PLD/LinuxSharedMemory.o" -c -O2 -fwrapv -pipe -Wformat -Werror=format-security -gdwarf-4 -fno-debug-types-section -fvar-tracking-assignments -g2 -Wp,-D_FORTIFY_SOURCE=2 -fstack-protector-strong --param=ssp-buffer-size=4 -fPIC -march=x86-64 -gdwarf-4 -fno-debug-types-section -fvar-tracking-assignments -g2 -I../../../../Include -I../../../../Source -I../../../../Externals/TinyXml -DXN_EXPORTS -fPIC -fvisibility=hidden -o x64-PLD/LinuxSharedMemory.o ../../../../Source/OpenNI/Linux/LinuxSharedMemory.cpp make[1]: Leaving directory '/tmp/B.jXlV1P/BUILD/OpenNI-OpenNI-1e9524f/Platform/Linux/Build/OpenNI' make[1]: Entering directory '/tmp/B.jXlV1P/BUILD/OpenNI-OpenNI-1e9524f/Platform/Linux/Build/OpenNI' x86_64-pld-linux-g++ -MD -MP -MT "./x64-PLD/LinuxDebug.d x64-PLD/LinuxDebug.o" -c -O2 -fwrapv -pipe -Wformat -Werror=format-security -gdwarf-4 -fno-debug-types-section -fvar-tracking-assignments -g2 -Wp,-D_FORTIFY_SOURCE=2 -fstack-protector-strong --param=ssp-buffer-size=4 -fPIC -march=x86-64 -gdwarf-4 -fno-debug-types-section -fvar-tracking-assignments -g2 -I../../../../Include -I../../../../Source -I../../../../Externals/TinyXml -DXN_EXPORTS -fPIC -fvisibility=hidden -o x64-PLD/LinuxDebug.o ../../../../Source/OpenNI/Linux/LinuxDebug.cpp make[1]: Leaving directory '/tmp/B.jXlV1P/BUILD/OpenNI-OpenNI-1e9524f/Platform/Linux/Build/OpenNI' make[1]: Entering directory '/tmp/B.jXlV1P/BUILD/OpenNI-OpenNI-1e9524f/Platform/Linux/Build/OpenNI' x86_64-pld-linux-g++ -MD -MP -MT "./x64-PLD/LinuxKeyboard.d x64-PLD/LinuxKeyboard.o" -c -O2 -fwrapv -pipe -Wformat -Werror=format-security -gdwarf-4 -fno-debug-types-section -fvar-tracking-assignments -g2 -Wp,-D_FORTIFY_SOURCE=2 -fstack-protector-strong --param=ssp-buffer-size=4 -fPIC -march=x86-64 -gdwarf-4 -fno-debug-types-section -fvar-tracking-assignments -g2 -I../../../../Include -I../../../../Source -I../../../../Externals/TinyXml -DXN_EXPORTS -fPIC -fvisibility=hidden -o x64-PLD/LinuxKeyboard.o ../../../../Source/OpenNI/Linux/LinuxKeyboard.cpp make[1]: Leaving directory '/tmp/B.jXlV1P/BUILD/OpenNI-OpenNI-1e9524f/Platform/Linux/Build/OpenNI' make[1]: Entering directory '/tmp/B.jXlV1P/BUILD/OpenNI-OpenNI-1e9524f/Platform/Linux/Build/OpenNI' x86_64-pld-linux-g++ -MD -MP -MT "./x64-PLD/LinuxINI.d x64-PLD/LinuxINI.o" -c -O2 -fwrapv -pipe -Wformat -Werror=format-security -gdwarf-4 -fno-debug-types-section -fvar-tracking-assignments -g2 -Wp,-D_FORTIFY_SOURCE=2 -fstack-protector-strong --param=ssp-buffer-size=4 -fPIC -march=x86-64 -gdwarf-4 -fno-debug-types-section -fvar-tracking-assignments -g2 -I../../../../Include -I../../../../Source -I../../../../Externals/TinyXml -DXN_EXPORTS -fPIC -fvisibility=hidden -o x64-PLD/LinuxINI.o ../../../../Source/OpenNI/Linux/LinuxINI.cpp make[1]: Leaving directory '/tmp/B.jXlV1P/BUILD/OpenNI-OpenNI-1e9524f/Platform/Linux/Build/OpenNI' make[1]: Entering directory '/tmp/B.jXlV1P/BUILD/OpenNI-OpenNI-1e9524f/Platform/Linux/Build/OpenNI' x86_64-pld-linux-g++ -MD -MP -MT "./x64-PLD/LinuxNetwork.d x64-PLD/LinuxNetwork.o" -c -O2 -fwrapv -pipe -Wformat -Werror=format-security -gdwarf-4 -fno-debug-types-section -fvar-tracking-assignments -g2 -Wp,-D_FORTIFY_SOURCE=2 -fstack-protector-strong --param=ssp-buffer-size=4 -fPIC -march=x86-64 -gdwarf-4 -fno-debug-types-section -fvar-tracking-assignments -g2 -I../../../../Include -I../../../../Source -I../../../../Externals/TinyXml -DXN_EXPORTS -fPIC -fvisibility=hidden -o x64-PLD/LinuxNetwork.o ../../../../Source/OpenNI/Linux/LinuxNetwork.cpp make[1]: Leaving directory '/tmp/B.jXlV1P/BUILD/OpenNI-OpenNI-1e9524f/Platform/Linux/Build/OpenNI' make[1]: Entering directory '/tmp/B.jXlV1P/BUILD/OpenNI-OpenNI-1e9524f/Platform/Linux/Build/OpenNI' x86_64-pld-linux-g++ -MD -MP -MT "./x64-PLD/LinuxSysVNamedEvents.d x64-PLD/LinuxSysVNamedEvents.o" -c -O2 -fwrapv -pipe -Wformat -Werror=format-security -gdwarf-4 -fno-debug-types-section -fvar-tracking-assignments -g2 -Wp,-D_FORTIFY_SOURCE=2 -fstack-protector-strong --param=ssp-buffer-size=4 -fPIC -march=x86-64 -gdwarf-4 -fno-debug-types-section -fvar-tracking-assignments -g2 -I../../../../Include -I../../../../Source -I../../../../Externals/TinyXml -DXN_EXPORTS -fPIC -fvisibility=hidden -o x64-PLD/LinuxSysVNamedEvents.o ../../../../Source/OpenNI/Linux/LinuxSysVNamedEvents.cpp make[1]: Leaving directory '/tmp/B.jXlV1P/BUILD/OpenNI-OpenNI-1e9524f/Platform/Linux/Build/OpenNI' make[1]: Entering directory '/tmp/B.jXlV1P/BUILD/OpenNI-OpenNI-1e9524f/Platform/Linux/Build/OpenNI' x86_64-pld-linux-g++ -MD -MP -MT "./x64-PLD/LinuxTime.d x64-PLD/LinuxTime.o" -c -O2 -fwrapv -pipe -Wformat -Werror=format-security -gdwarf-4 -fno-debug-types-section -fvar-tracking-assignments -g2 -Wp,-D_FORTIFY_SOURCE=2 -fstack-protector-strong --param=ssp-buffer-size=4 -fPIC -march=x86-64 -gdwarf-4 -fno-debug-types-section -fvar-tracking-assignments -g2 -I../../../../Include -I../../../../Source -I../../../../Externals/TinyXml -DXN_EXPORTS -fPIC -fvisibility=hidden -o x64-PLD/LinuxTime.o ../../../../Source/OpenNI/Linux/LinuxTime.cpp make[1]: Leaving directory '/tmp/B.jXlV1P/BUILD/OpenNI-OpenNI-1e9524f/Platform/Linux/Build/OpenNI' make[1]: Entering directory '/tmp/B.jXlV1P/BUILD/OpenNI-OpenNI-1e9524f/Platform/Linux/Build/OpenNI' x86_64-pld-linux-g++ -MD -MP -MT "./x64-PLD/LinuxFiles.d x64-PLD/LinuxFiles.o" -c -O2 -fwrapv -pipe -Wformat -Werror=format-security -gdwarf-4 -fno-debug-types-section -fvar-tracking-assignments -g2 -Wp,-D_FORTIFY_SOURCE=2 -fstack-protector-strong --param=ssp-buffer-size=4 -fPIC -march=x86-64 -gdwarf-4 -fno-debug-types-section -fvar-tracking-assignments -g2 -I../../../../Include -I../../../../Source -I../../../../Externals/TinyXml -DXN_EXPORTS -fPIC -fvisibility=hidden -o x64-PLD/LinuxFiles.o ../../../../Source/OpenNI/Linux/LinuxFiles.cpp make[1]: Leaving directory '/tmp/B.jXlV1P/BUILD/OpenNI-OpenNI-1e9524f/Platform/Linux/Build/OpenNI' make[1]: Entering directory '/tmp/B.jXlV1P/BUILD/OpenNI-OpenNI-1e9524f/Platform/Linux/Build/OpenNI' x86_64-pld-linux-g++ -MD -MP -MT "./x64-PLD/tinyxmlerror.d x64-PLD/tinyxmlerror.o" -c -O2 -fwrapv -pipe -Wformat -Werror=format-security -gdwarf-4 -fno-debug-types-section -fvar-tracking-assignments -g2 -Wp,-D_FORTIFY_SOURCE=2 -fstack-protector-strong --param=ssp-buffer-size=4 -fPIC -march=x86-64 -gdwarf-4 -fno-debug-types-section -fvar-tracking-assignments -g2 -I../../../../Include -I../../../../Source -I../../../../Externals/TinyXml -DXN_EXPORTS -fPIC -fvisibility=hidden -o x64-PLD/tinyxmlerror.o ../../../../Externals/TinyXml/tinyxmlerror.cpp make[1]: Leaving directory '/tmp/B.jXlV1P/BUILD/OpenNI-OpenNI-1e9524f/Platform/Linux/Build/OpenNI' make[1]: Entering directory '/tmp/B.jXlV1P/BUILD/OpenNI-OpenNI-1e9524f/Platform/Linux/Build/OpenNI' x86_64-pld-linux-g++ -MD -MP -MT "./x64-PLD/tinystr.d x64-PLD/tinystr.o" -c -O2 -fwrapv -pipe -Wformat -Werror=format-security -gdwarf-4 -fno-debug-types-section -fvar-tracking-assignments -g2 -Wp,-D_FORTIFY_SOURCE=2 -fstack-protector-strong --param=ssp-buffer-size=4 -fPIC -march=x86-64 -gdwarf-4 -fno-debug-types-section -fvar-tracking-assignments -g2 -I../../../../Include -I../../../../Source -I../../../../Externals/TinyXml -DXN_EXPORTS -fPIC -fvisibility=hidden -o x64-PLD/tinystr.o ../../../../Externals/TinyXml/tinystr.cpp make[1]: Leaving directory '/tmp/B.jXlV1P/BUILD/OpenNI-OpenNI-1e9524f/Platform/Linux/Build/OpenNI' make[1]: Entering directory '/tmp/B.jXlV1P/BUILD/OpenNI-OpenNI-1e9524f/Platform/Linux/Build/OpenNI' x86_64-pld-linux-g++ -MD -MP -MT "./x64-PLD/XnUSBLinux.d x64-PLD/XnUSBLinux.o" -c -O2 -fwrapv -pipe -Wformat -Werror=format-security -gdwarf-4 -fno-debug-types-section -fvar-tracking-assignments -g2 -Wp,-D_FORTIFY_SOURCE=2 -fstack-protector-strong --param=ssp-buffer-size=4 -fPIC -march=x86-64 -gdwarf-4 -fno-debug-types-section -fvar-tracking-assignments -g2 -I../../../../Include -I../../../../Source -I../../../../Externals/TinyXml -DXN_EXPORTS -fPIC -fvisibility=hidden -o x64-PLD/XnUSBLinux.o ../../../../Source/OpenNI/Linux/XnUSBLinux.cpp make[1]: Leaving directory '/tmp/B.jXlV1P/BUILD/OpenNI-OpenNI-1e9524f/Platform/Linux/Build/OpenNI' make[1]: Entering directory '/tmp/B.jXlV1P/BUILD/OpenNI-OpenNI-1e9524f/Platform/Linux/Build/OpenNI' x86_64-pld-linux-g++ -MD -MP -MT "./x64-PLD/tinyxmlparser.d x64-PLD/tinyxmlparser.o" -c -O2 -fwrapv -pipe -Wformat -Werror=format-security -gdwarf-4 -fno-debug-types-section -fvar-tracking-assignments -g2 -Wp,-D_FORTIFY_SOURCE=2 -fstack-protector-strong --param=ssp-buffer-size=4 -fPIC -march=x86-64 -gdwarf-4 -fno-debug-types-section -fvar-tracking-assignments -g2 -I../../../../Include -I../../../../Source -I../../../../Externals/TinyXml -DXN_EXPORTS -fPIC -fvisibility=hidden -o x64-PLD/tinyxmlparser.o ../../../../Externals/TinyXml/tinyxmlparser.cpp make[1]: Leaving directory '/tmp/B.jXlV1P/BUILD/OpenNI-OpenNI-1e9524f/Platform/Linux/Build/OpenNI' make[1]: Entering directory '/tmp/B.jXlV1P/BUILD/OpenNI-OpenNI-1e9524f/Platform/Linux/Build/OpenNI' x86_64-pld-linux-g++ -MD -MP -MT "./x64-PLD/tinyxml.d x64-PLD/tinyxml.o" -c -O2 -fwrapv -pipe -Wformat -Werror=format-security -gdwarf-4 -fno-debug-types-section -fvar-tracking-assignments -g2 -Wp,-D_FORTIFY_SOURCE=2 -fstack-protector-strong --param=ssp-buffer-size=4 -fPIC -march=x86-64 -gdwarf-4 -fno-debug-types-section -fvar-tracking-assignments -g2 -I../../../../Include -I../../../../Source -I../../../../Externals/TinyXml -DXN_EXPORTS -fPIC -fvisibility=hidden -o x64-PLD/tinyxml.o ../../../../Externals/TinyXml/tinyxml.cpp make[1]: Leaving directory '/tmp/B.jXlV1P/BUILD/OpenNI-OpenNI-1e9524f/Platform/Linux/Build/OpenNI' make[1]: Entering directory '/tmp/B.jXlV1P/BUILD/OpenNI-OpenNI-1e9524f/Platform/Linux/Build/OpenNI' x86_64-pld-linux-g++ -MD -MP -MT "./x64-PLD/XnOpenNI.d x64-PLD/XnOpenNI.o" -c -O2 -fwrapv -pipe -Wformat -Werror=format-security -gdwarf-4 -fno-debug-types-section -fvar-tracking-assignments -g2 -Wp,-D_FORTIFY_SOURCE=2 -fstack-protector-strong --param=ssp-buffer-size=4 -fPIC -march=x86-64 -gdwarf-4 -fno-debug-types-section -fvar-tracking-assignments -g2 -I../../../../Include -I../../../../Source -I../../../../Externals/TinyXml -DXN_EXPORTS -fPIC -fvisibility=hidden -o x64-PLD/XnOpenNI.o ../../../../Source/OpenNI/XnOpenNI.cpp make[1]: Leaving directory '/tmp/B.jXlV1P/BUILD/OpenNI-OpenNI-1e9524f/Platform/Linux/Build/OpenNI' make[1]: Entering directory '/tmp/B.jXlV1P/BUILD/OpenNI-OpenNI-1e9524f/Platform/Linux/Build/OpenNI' x86_64-pld-linux-g++ -o ../../Bin/x64-PLD/libOpenNI.so ./x64-PLD/XnFPSCalculator.o ./x64-PLD/XnQueries.o ./x64-PLD/XnProfiling.o ./x64-PLD/XnTypeManager.o ./x64-PLD/XnLogFileWriter.o ./x64-PLD/XnUSB.o ./x64-PLD/XnLogConsoleWriter.o ./x64-PLD/XnEnumerationErrors.o ./x64-PLD/XnLicensing.o ./x64-PLD/XnBaseNode.o ./x64-PLD/XnDumpFileWriter.o ./x64-PLD/XnLog.o ./x64-PLD/XnOSMemoryProfiling.o ./x64-PLD/XnRecorderImpl.o ./x64-PLD/XnExportedNodes.o ./x64-PLD/XnOS.o ./x64-PLD/XnModuleLoader.o ./x64-PLD/XnXml.o ./x64-PLD/XnUtils.o ./x64-PLD/openNI.o ./x64-PLD/XnScheduler.o ./x64-PLD/XnPlayerImpl.o ./x64-PLD/XnXmlScriptNodeExporter.o ./x64-PLD/XnNodeWatcher.o ./x64-PLD/XnMockNotifier.o ./x64-PLD/XnNodeManager.o ./x64-PLD/XnStatusRegister.o ./x64-PLD/XnXmlScriptNode.o ./x64-PLD/XnOpenNI.o ./x64-PLD/XnLogAndroidWriter.o ./x64-PLD/XnDump.o ./x64-PLD/LinuxEvents.o ./x64-PLD/LinuxPosixNamedEvents.o ./x64-PLD/LinuxStrings.o ./x64-PLD/LinuxCriticalSections.o ./x64-PLD/LinuxMutex.o ./x64-PLD/LinuxPosixEvents.o ./x64-PLD/LinuxUSBDevice.o ./x64-PLD/LinuxMemory.o ./x64-PLD/LinuxSharedLibs.o ./x64-PLD/LinuxThreads.o ./x64-PLD/LinuxProcesses.o ./x64-PLD/LinuxSharedMemory.o ./x64-PLD/LinuxDebug.o ./x64-PLD/LinuxINI.o ./x64-PLD/LinuxNetwork.o ./x64-PLD/LinuxKeyboard.o ./x64-PLD/XnUSBLinux.o ./x64-PLD/LinuxSysVNamedEvents.o ./x64-PLD/LinuxFiles.o ./x64-PLD/LinuxTime.o ./x64-PLD/tinystr.o ./x64-PLD/tinyxmlerror.o ./x64-PLD/tinyxml.o ./x64-PLD/tinyxmlparser.o -L../../Bin/x64-PLD -lusb-1.0 -ldl -lpthread -lrt -Wl,--no-undefined -shared make[1]: Leaving directory '/tmp/B.jXlV1P/BUILD/OpenNI-OpenNI-1e9524f/Platform/Linux/Build/OpenNI' /usr/bin/make -C Modules/nimCodecs /usr/bin/make -C Modules/nimMockNodes /usr/bin/make -C Modules/nimRecorder /usr/bin/make -C Utils/niReg /usr/bin/make -C Utils/niLicense make[1]: Entering directory '/tmp/B.jXlV1P/BUILD/OpenNI-OpenNI-1e9524f/Platform/Linux/Build/Modules/nimRecorder' mkdir -p x64-PLD make[1]: Leaving directory '/tmp/B.jXlV1P/BUILD/OpenNI-OpenNI-1e9524f/Platform/Linux/Build/Modules/nimRecorder' make[1]: Entering directory '/tmp/B.jXlV1P/BUILD/OpenNI-OpenNI-1e9524f/Platform/Linux/Build/Utils/niLicense' mkdir -p x64-PLD make[1]: Leaving directory '/tmp/B.jXlV1P/BUILD/OpenNI-OpenNI-1e9524f/Platform/Linux/Build/Utils/niLicense' make[1]: Entering directory '/tmp/B.jXlV1P/BUILD/OpenNI-OpenNI-1e9524f/Platform/Linux/Build/Modules/nimCodecs' mkdir -p x64-PLD make[1]: Leaving directory '/tmp/B.jXlV1P/BUILD/OpenNI-OpenNI-1e9524f/Platform/Linux/Build/Modules/nimCodecs' make[1]: Entering directory '/tmp/B.jXlV1P/BUILD/OpenNI-OpenNI-1e9524f/Platform/Linux/Build/Modules/nimMockNodes' mkdir -p x64-PLD make[1]: Leaving directory '/tmp/B.jXlV1P/BUILD/OpenNI-OpenNI-1e9524f/Platform/Linux/Build/Modules/nimMockNodes' make[1]: Entering directory '/tmp/B.jXlV1P/BUILD/OpenNI-OpenNI-1e9524f/Platform/Linux/Build/Utils/niReg' mkdir -p x64-PLD make[1]: Leaving directory '/tmp/B.jXlV1P/BUILD/OpenNI-OpenNI-1e9524f/Platform/Linux/Build/Utils/niReg' make[1]: Entering directory '/tmp/B.jXlV1P/BUILD/OpenNI-OpenNI-1e9524f/Platform/Linux/Build/Utils/niLicense' x86_64-pld-linux-g++ -MD -MP -MT "./x64-PLD/niLicense.d x64-PLD/niLicense.o" -c -O2 -fwrapv -pipe -Wformat -Werror=format-security -gdwarf-4 -fno-debug-types-section -fvar-tracking-assignments -g2 -Wp,-D_FORTIFY_SOURCE=2 -fstack-protector-strong --param=ssp-buffer-size=4 -fPIC -march=x86-64 -gdwarf-4 -fno-debug-types-section -fvar-tracking-assignments -g2 -I../../../../../Include -I../../../../../Source -o x64-PLD/niLicense.o ../../../../../Source/Utils/niLicense/niLicense.cpp make[1]: Leaving directory '/tmp/B.jXlV1P/BUILD/OpenNI-OpenNI-1e9524f/Platform/Linux/Build/Utils/niLicense' make[1]: Entering directory '/tmp/B.jXlV1P/BUILD/OpenNI-OpenNI-1e9524f/Platform/Linux/Build/Utils/niReg' x86_64-pld-linux-g++ -MD -MP -MT "./x64-PLD/niReg.d x64-PLD/niReg.o" -c -O2 -fwrapv -pipe -Wformat -Werror=format-security -gdwarf-4 -fno-debug-types-section -fvar-tracking-assignments -g2 -Wp,-D_FORTIFY_SOURCE=2 -fstack-protector-strong --param=ssp-buffer-size=4 -fPIC -march=x86-64 -gdwarf-4 -fno-debug-types-section -fvar-tracking-assignments -g2 -I../../../../../Include -I../../../../../Source -o x64-PLD/niReg.o ../../../../../Source/Utils/niReg/niReg.cpp make[1]: Leaving directory '/tmp/B.jXlV1P/BUILD/OpenNI-OpenNI-1e9524f/Platform/Linux/Build/Utils/niReg' make[1]: Entering directory '/tmp/B.jXlV1P/BUILD/OpenNI-OpenNI-1e9524f/Platform/Linux/Build/Utils/niReg' x86_64-pld-linux-g++ -o ../../../Bin/x64-PLD/niReg ./x64-PLD/niReg.o -L../../../Bin/x64-PLD -lOpenNI make[1]: Leaving directory '/tmp/B.jXlV1P/BUILD/OpenNI-OpenNI-1e9524f/Platform/Linux/Build/Utils/niReg' /usr/bin/make -C Wrappers/OpenNI.jni make[1]: Entering directory '/tmp/B.jXlV1P/BUILD/OpenNI-OpenNI-1e9524f/Platform/Linux/Build/Wrappers/OpenNI.jni' mkdir -p x64-PLD make[1]: Leaving directory '/tmp/B.jXlV1P/BUILD/OpenNI-OpenNI-1e9524f/Platform/Linux/Build/Wrappers/OpenNI.jni' make[1]: Entering directory '/tmp/B.jXlV1P/BUILD/OpenNI-OpenNI-1e9524f/Platform/Linux/Build/Modules/nimCodecs' x86_64-pld-linux-g++ -MD -MP -MT "./x64-PLD/XnUncompressedCodec.d x64-PLD/XnUncompressedCodec.o" -c -O2 -fwrapv -pipe -Wformat -Werror=format-security -gdwarf-4 -fno-debug-types-section -fvar-tracking-assignments -g2 -Wp,-D_FORTIFY_SOURCE=2 -fstack-protector-strong --param=ssp-buffer-size=4 -fPIC -march=x86-64 -gdwarf-4 -fno-debug-types-section -fvar-tracking-assignments -g2 -I../../../../../Include -I../../../../../Source -fPIC -fvisibility=hidden -o x64-PLD/XnUncompressedCodec.o ../../../../../Source/Modules/nimCodecs/XnUncompressedCodec.cpp make[1]: Leaving directory '/tmp/B.jXlV1P/BUILD/OpenNI-OpenNI-1e9524f/Platform/Linux/Build/Modules/nimCodecs' make[1]: Entering directory '/tmp/B.jXlV1P/BUILD/OpenNI-OpenNI-1e9524f/Platform/Linux/Build/Utils/niLicense' x86_64-pld-linux-g++ -o ../../../Bin/x64-PLD/niLicense ./x64-PLD/niLicense.o -L../../../Bin/x64-PLD -lOpenNI make[1]: Leaving directory '/tmp/B.jXlV1P/BUILD/OpenNI-OpenNI-1e9524f/Platform/Linux/Build/Utils/niLicense' /usr/bin/make -C Samples/NiSimpleRead make[1]: Entering directory '/tmp/B.jXlV1P/BUILD/OpenNI-OpenNI-1e9524f/Platform/Linux/Build/Samples/NiSimpleRead' mkdir -p x64-PLD make[1]: Leaving directory '/tmp/B.jXlV1P/BUILD/OpenNI-OpenNI-1e9524f/Platform/Linux/Build/Samples/NiSimpleRead' make[1]: Entering directory '/tmp/B.jXlV1P/BUILD/OpenNI-OpenNI-1e9524f/Platform/Linux/Build/Modules/nimMockNodes' x86_64-pld-linux-g++ -MD -MP -MT "./x64-PLD/ExportedMockNodes.d x64-PLD/ExportedMockNodes.o" -c -O2 -fwrapv -pipe -Wformat -Werror=format-security -gdwarf-4 -fno-debug-types-section -fvar-tracking-assignments -g2 -Wp,-D_FORTIFY_SOURCE=2 -fstack-protector-strong --param=ssp-buffer-size=4 -fPIC -march=x86-64 -gdwarf-4 -fno-debug-types-section -fvar-tracking-assignments -g2 -I../../../../../Include -I../../../../../Source -fPIC -fvisibility=hidden -o x64-PLD/ExportedMockNodes.o ../../../../../Source/Modules/nimMockNodes/ExportedMockNodes.cpp make[1]: Leaving directory '/tmp/B.jXlV1P/BUILD/OpenNI-OpenNI-1e9524f/Platform/Linux/Build/Modules/nimMockNodes' make[1]: Entering directory '/tmp/B.jXlV1P/BUILD/OpenNI-OpenNI-1e9524f/Platform/Linux/Build/Modules/nimCodecs' x86_64-pld-linux-g++ -MD -MP -MT "./x64-PLD/Xn16zEmbTablesCodec.d x64-PLD/Xn16zEmbTablesCodec.o" -c -O2 -fwrapv -pipe -Wformat -Werror=format-security -gdwarf-4 -fno-debug-types-section -fvar-tracking-assignments -g2 -Wp,-D_FORTIFY_SOURCE=2 -fstack-protector-strong --param=ssp-buffer-size=4 -fPIC -march=x86-64 -gdwarf-4 -fno-debug-types-section -fvar-tracking-assignments -g2 -I../../../../../Include -I../../../../../Source -fPIC -fvisibility=hidden -o x64-PLD/Xn16zEmbTablesCodec.o ../../../../../Source/Modules/nimCodecs/Xn16zEmbTablesCodec.cpp make[1]: Leaving directory '/tmp/B.jXlV1P/BUILD/OpenNI-OpenNI-1e9524f/Platform/Linux/Build/Modules/nimCodecs' make[1]: Entering directory '/tmp/B.jXlV1P/BUILD/OpenNI-OpenNI-1e9524f/Platform/Linux/Build/Samples/NiSimpleRead' x86_64-pld-linux-g++ -MD -MP -MT "./x64-PLD/NiSimpleRead.d x64-PLD/NiSimpleRead.o" -c -O2 -fwrapv -pipe -Wformat -Werror=format-security -gdwarf-4 -fno-debug-types-section -fvar-tracking-assignments -g2 -Wp,-D_FORTIFY_SOURCE=2 -fstack-protector-strong --param=ssp-buffer-size=4 -fPIC -march=x86-64 -gdwarf-4 -fno-debug-types-section -fvar-tracking-assignments -g2 -I../../../../../Include -o x64-PLD/NiSimpleRead.o ../../../../../Samples/NiSimpleRead/NiSimpleRead.cpp make[1]: Leaving directory '/tmp/B.jXlV1P/BUILD/OpenNI-OpenNI-1e9524f/Platform/Linux/Build/Samples/NiSimpleRead' make[1]: Entering directory '/tmp/B.jXlV1P/BUILD/OpenNI-OpenNI-1e9524f/Platform/Linux/Build/Samples/NiSimpleRead' x86_64-pld-linux-g++ -o ../../../Bin/x64-PLD/Sample-NiSimpleRead ./x64-PLD/NiSimpleRead.o -L../../../Bin/x64-PLD -lOpenNI make[1]: Leaving directory '/tmp/B.jXlV1P/BUILD/OpenNI-OpenNI-1e9524f/Platform/Linux/Build/Samples/NiSimpleRead' /usr/bin/make -C Samples/NiBackRecorder make[1]: Entering directory '/tmp/B.jXlV1P/BUILD/OpenNI-OpenNI-1e9524f/Platform/Linux/Build/Samples/NiBackRecorder' mkdir -p x64-PLD make[1]: Leaving directory '/tmp/B.jXlV1P/BUILD/OpenNI-OpenNI-1e9524f/Platform/Linux/Build/Samples/NiBackRecorder' make[1]: Entering directory '/tmp/B.jXlV1P/BUILD/OpenNI-OpenNI-1e9524f/Platform/Linux/Build/Modules/nimMockNodes' x86_64-pld-linux-g++ -MD -MP -MT "./x64-PLD/MockAudioGenerator.d x64-PLD/MockAudioGenerator.o" -c -O2 -fwrapv -pipe -Wformat -Werror=format-security -gdwarf-4 -fno-debug-types-section -fvar-tracking-assignments -g2 -Wp,-D_FORTIFY_SOURCE=2 -fstack-protector-strong --param=ssp-buffer-size=4 -fPIC -march=x86-64 -gdwarf-4 -fno-debug-types-section -fvar-tracking-assignments -g2 -I../../../../../Include -I../../../../../Source -fPIC -fvisibility=hidden -o x64-PLD/MockAudioGenerator.o ../../../../../Source/Modules/nimMockNodes/MockAudioGenerator.cpp make[1]: Leaving directory '/tmp/B.jXlV1P/BUILD/OpenNI-OpenNI-1e9524f/Platform/Linux/Build/Modules/nimMockNodes' make[1]: Entering directory '/tmp/B.jXlV1P/BUILD/OpenNI-OpenNI-1e9524f/Platform/Linux/Build/Samples/NiBackRecorder' x86_64-pld-linux-g++ -MD -MP -MT "./x64-PLD/main.d x64-PLD/main.o" -c -O2 -fwrapv -pipe -Wformat -Werror=format-security -gdwarf-4 -fno-debug-types-section -fvar-tracking-assignments -g2 -Wp,-D_FORTIFY_SOURCE=2 -fstack-protector-strong --param=ssp-buffer-size=4 -fPIC -march=x86-64 -gdwarf-4 -fno-debug-types-section -fvar-tracking-assignments -g2 -I../../../../../Include -o x64-PLD/main.o ../../../../../Samples/NiBackRecorder/main.cpp ../../../../../Samples/NiBackRecorder/main.cpp: In member function 'XnStatus CyclicBuffer::Dump()': ../../../../../Samples/NiBackRecorder/main.cpp:334:11: warning: '%04d' directive writing between 4 and 11 bytes into a region of size between 0 and 255 [-Wformat-overflow=] XnStatus Dump() ^~~~ In file included from /usr/include/stdio.h:862:0, from ../../../../../Include/Linux-x86/XnPlatformLinux-x86.h:33, from ../../../../../Include/XnPlatform.h:65, from ../../../../../Include/XnStatus.h:24, from ../../../../../Include/XnTypes.h:27, from ../../../../../Include/XnOpenNI.h:27, from ../../../../../Samples/NiBackRecorder/main.cpp:24: /usr/include/bits/stdio2.h:34:43: note: '__builtin___sprintf_chk' output between 21 and 328 bytes into a destination of size 256 __bos (__s), __fmt, __va_arg_pack ()); ^ make[1]: Leaving directory '/tmp/B.jXlV1P/BUILD/OpenNI-OpenNI-1e9524f/Platform/Linux/Build/Samples/NiBackRecorder' make[1]: Entering directory '/tmp/B.jXlV1P/BUILD/OpenNI-OpenNI-1e9524f/Platform/Linux/Build/Samples/NiBackRecorder' x86_64-pld-linux-g++ -o ../../../Bin/x64-PLD/Sample-NiBackRecorder ./x64-PLD/main.o -L../../../Bin/x64-PLD -lOpenNI make[1]: Leaving directory '/tmp/B.jXlV1P/BUILD/OpenNI-OpenNI-1e9524f/Platform/Linux/Build/Samples/NiBackRecorder' /usr/bin/make -C Samples/NiConvertXToONI make[1]: Entering directory '/tmp/B.jXlV1P/BUILD/OpenNI-OpenNI-1e9524f/Platform/Linux/Build/Samples/NiConvertXToONI' mkdir -p x64-PLD make[1]: Leaving directory '/tmp/B.jXlV1P/BUILD/OpenNI-OpenNI-1e9524f/Platform/Linux/Build/Samples/NiConvertXToONI' make[1]: Entering directory '/tmp/B.jXlV1P/BUILD/OpenNI-OpenNI-1e9524f/Platform/Linux/Build/Modules/nimRecorder' x86_64-pld-linux-g++ -MD -MP -MT "./x64-PLD/RecorderNode.d x64-PLD/RecorderNode.o" -c -O2 -fwrapv -pipe -Wformat -Werror=format-security -gdwarf-4 -fno-debug-types-section -fvar-tracking-assignments -g2 -Wp,-D_FORTIFY_SOURCE=2 -fstack-protector-strong --param=ssp-buffer-size=4 -fPIC -march=x86-64 -gdwarf-4 -fno-debug-types-section -fvar-tracking-assignments -g2 -I../../../../../Include -I../../../../../Source -I../../../../../Source/Modules/Common -fPIC -fvisibility=hidden -o x64-PLD/RecorderNode.o ../../../../../Source/Modules/nimRecorder/RecorderNode.cpp make[1]: Leaving directory '/tmp/B.jXlV1P/BUILD/OpenNI-OpenNI-1e9524f/Platform/Linux/Build/Modules/nimRecorder' make[1]: Entering directory '/tmp/B.jXlV1P/BUILD/OpenNI-OpenNI-1e9524f/Platform/Linux/Build/Wrappers/OpenNI.jni' x86_64-pld-linux-g++ -MD -MP -MT "./x64-PLD/org_openni_NativeMethods.d x64-PLD/org_openni_NativeMethods.o" -c -O2 -fwrapv -pipe -Wformat -Werror=format-security -gdwarf-4 -fno-debug-types-section -fvar-tracking-assignments -g2 -Wp,-D_FORTIFY_SOURCE=2 -fstack-protector-strong --param=ssp-buffer-size=4 -fPIC -march=x86-64 -gdwarf-4 -fno-debug-types-section -fvar-tracking-assignments -g2 -I../../../../../Include -I../../../../../Wrappers/OpenNI.jni -fPIC -fvisibility=hidden -o x64-PLD/org_openni_NativeMethods.o ../../../../../Wrappers/OpenNI.jni/org_openni_NativeMethods.cpp ../../../../../Wrappers/OpenNI.jni/org_openni_NativeMethods.cpp: In function 'jint Java_org_openni_NativeMethods_xnNodeQuerySetMinVersion(JNIEnv*, jclass, jlong, jbyte, jbyte, jshort, jint)': ../../../../../Wrappers/OpenNI.jni/org_openni_NativeMethods.cpp:977:57: warning: narrowing conversion of 'major' from 'jbyte {aka signed char}' to 'XnUInt8 {aka unsigned char}' inside { } [-Wnarrowing] XnVersion version = { major, minor, maintenance, build }; ^ ../../../../../Wrappers/OpenNI.jni/org_openni_NativeMethods.cpp:977:57: warning: narrowing conversion of 'minor' from 'jbyte {aka signed char}' to 'XnUInt8 {aka unsigned char}' inside { } [-Wnarrowing] ../../../../../Wrappers/OpenNI.jni/org_openni_NativeMethods.cpp:977:57: warning: narrowing conversion of 'maintenance' from 'jshort {aka short int}' to 'XnUInt16 {aka short unsigned int}' inside { } [-Wnarrowing] ../../../../../Wrappers/OpenNI.jni/org_openni_NativeMethods.cpp:977:57: warning: narrowing conversion of 'build' from 'jint {aka int}' to 'XnUInt32 {aka unsigned int}' inside { } [-Wnarrowing] ../../../../../Wrappers/OpenNI.jni/org_openni_NativeMethods.cpp: In function 'jint Java_org_openni_NativeMethods_xnNodeQuerySetMaxVersion(JNIEnv*, jclass, jlong, jbyte, jbyte, jshort, jint)': ../../../../../Wrappers/OpenNI.jni/org_openni_NativeMethods.cpp:983:57: warning: narrowing conversion of 'major' from 'jbyte {aka signed char}' to 'XnUInt8 {aka unsigned char}' inside { } [-Wnarrowing] XnVersion version = { major, minor, maintenance, build }; ^ ../../../../../Wrappers/OpenNI.jni/org_openni_NativeMethods.cpp:983:57: warning: narrowing conversion of 'minor' from 'jbyte {aka signed char}' to 'XnUInt8 {aka unsigned char}' inside { } [-Wnarrowing] ../../../../../Wrappers/OpenNI.jni/org_openni_NativeMethods.cpp:983:57: warning: narrowing conversion of 'maintenance' from 'jshort {aka short int}' to 'XnUInt16 {aka short unsigned int}' inside { } [-Wnarrowing] ../../../../../Wrappers/OpenNI.jni/org_openni_NativeMethods.cpp:983:57: warning: narrowing conversion of 'build' from 'jint {aka int}' to 'XnUInt32 {aka unsigned int}' inside { } [-Wnarrowing] ../../../../../Wrappers/OpenNI.jni/org_openni_NativeMethods.cpp: In function 'jint Java_org_openni_NativeMethods_xnNodeQueryAddSupportedMapOutputMode(JNIEnv*, jclass, jlong, jint, jint, jint)': ../../../../../Wrappers/OpenNI.jni/org_openni_NativeMethods.cpp:994:43: warning: narrowing conversion of 'xRes' from 'jint {aka int}' to 'XnUInt32 {aka unsigned int}' inside { } [-Wnarrowing] XnMapOutputMode mode = { xRes, yRes, FPS }; ^ ../../../../../Wrappers/OpenNI.jni/org_openni_NativeMethods.cpp:994:43: warning: narrowing conversion of 'yRes' from 'jint {aka int}' to 'XnUInt32 {aka unsigned int}' inside { } [-Wnarrowing] ../../../../../Wrappers/OpenNI.jni/org_openni_NativeMethods.cpp:994:43: warning: narrowing conversion of 'FPS' from 'jint {aka int}' to 'XnUInt32 {aka unsigned int}' inside { } [-Wnarrowing] ../../../../../Wrappers/OpenNI.jni/org_openni_NativeMethods.cpp: In function 'jint Java_org_openni_NativeMethods_xnSetMapOutputMode(JNIEnv*, jclass, jlong, jint, jint, jint)': ../../../../../Wrappers/OpenNI.jni/org_openni_NativeMethods.cpp:1537:43: warning: narrowing conversion of 'xRes' from 'jint {aka int}' to 'XnUInt32 {aka unsigned int}' inside { } [-Wnarrowing] XnMapOutputMode mode = { xRes, yRes, fps }; ^ ../../../../../Wrappers/OpenNI.jni/org_openni_NativeMethods.cpp:1537:43: warning: narrowing conversion of 'yRes' from 'jint {aka int}' to 'XnUInt32 {aka unsigned int}' inside { } [-Wnarrowing] ../../../../../Wrappers/OpenNI.jni/org_openni_NativeMethods.cpp:1537:43: warning: narrowing conversion of 'fps' from 'jint {aka int}' to 'XnUInt32 {aka unsigned int}' inside { } [-Wnarrowing] ../../../../../Wrappers/OpenNI.jni/org_openni_NativeMethods.cpp: In function 'jint Java_org_openni_NativeMethods_xnSetWaveOutputMode(JNIEnv*, jclass, jlong, jint, jshort, jbyte)': ../../../../../Wrappers/OpenNI.jni/org_openni_NativeMethods.cpp:2705:67: warning: narrowing conversion of 'nSampleRate' from 'jint {aka int}' to 'XnUInt32 {aka unsigned int}' inside { } [-Wnarrowing] XnWaveOutputMode mode = { nSampleRate, nBitsPerSample, nChannels }; ^ ../../../../../Wrappers/OpenNI.jni/org_openni_NativeMethods.cpp:2705:67: warning: narrowing conversion of 'nBitsPerSample' from 'jshort {aka short int}' to 'XnUInt16 {aka short unsigned int}' inside { } [-Wnarrowing] ../../../../../Wrappers/OpenNI.jni/org_openni_NativeMethods.cpp:2705:67: warning: narrowing conversion of 'nChannels' from 'jbyte {aka signed char}' to 'XnUInt8 {aka unsigned char}' inside { } [-Wnarrowing] make[1]: Leaving directory '/tmp/B.jXlV1P/BUILD/OpenNI-OpenNI-1e9524f/Platform/Linux/Build/Wrappers/OpenNI.jni' make[1]: Entering directory '/tmp/B.jXlV1P/BUILD/OpenNI-OpenNI-1e9524f/Platform/Linux/Build/Modules/nimCodecs' x86_64-pld-linux-g++ -MD -MP -MT "./x64-PLD/XnCodecs.d x64-PLD/XnCodecs.o" -c -O2 -fwrapv -pipe -Wformat -Werror=format-security -gdwarf-4 -fno-debug-types-section -fvar-tracking-assignments -g2 -Wp,-D_FORTIFY_SOURCE=2 -fstack-protector-strong --param=ssp-buffer-size=4 -fPIC -march=x86-64 -gdwarf-4 -fno-debug-types-section -fvar-tracking-assignments -g2 -I../../../../../Include -I../../../../../Source -fPIC -fvisibility=hidden -o x64-PLD/XnCodecs.o ../../../../../Source/Modules/nimCodecs/XnCodecs.cpp make[1]: Leaving directory '/tmp/B.jXlV1P/BUILD/OpenNI-OpenNI-1e9524f/Platform/Linux/Build/Modules/nimCodecs' make[1]: Entering directory '/tmp/B.jXlV1P/BUILD/OpenNI-OpenNI-1e9524f/Platform/Linux/Build/Wrappers/OpenNI.jni' x86_64-pld-linux-g++ -MD -MP -MT "./x64-PLD/OpenNI.jni.d x64-PLD/OpenNI.jni.o" -c -O2 -fwrapv -pipe -Wformat -Werror=format-security -gdwarf-4 -fno-debug-types-section -fvar-tracking-assignments -g2 -Wp,-D_FORTIFY_SOURCE=2 -fstack-protector-strong --param=ssp-buffer-size=4 -fPIC -march=x86-64 -gdwarf-4 -fno-debug-types-section -fvar-tracking-assignments -g2 -I../../../../../Include -I../../../../../Wrappers/OpenNI.jni -fPIC -fvisibility=hidden -o x64-PLD/OpenNI.jni.o ../../../../../Wrappers/OpenNI.jni/OpenNI.jni.cpp make[1]: Leaving directory '/tmp/B.jXlV1P/BUILD/OpenNI-OpenNI-1e9524f/Platform/Linux/Build/Wrappers/OpenNI.jni' make[1]: Entering directory '/tmp/B.jXlV1P/BUILD/OpenNI-OpenNI-1e9524f/Platform/Linux/Build/Modules/nimMockNodes' x86_64-pld-linux-g++ -MD -MP -MT "./x64-PLD/MockMapGenerator.d x64-PLD/MockMapGenerator.o" -c -O2 -fwrapv -pipe -Wformat -Werror=format-security -gdwarf-4 -fno-debug-types-section -fvar-tracking-assignments -g2 -Wp,-D_FORTIFY_SOURCE=2 -fstack-protector-strong --param=ssp-buffer-size=4 -fPIC -march=x86-64 -gdwarf-4 -fno-debug-types-section -fvar-tracking-assignments -g2 -I../../../../../Include -I../../../../../Source -fPIC -fvisibility=hidden -o x64-PLD/MockMapGenerator.o ../../../../../Source/Modules/nimMockNodes/MockMapGenerator.cpp make[1]: Leaving directory '/tmp/B.jXlV1P/BUILD/OpenNI-OpenNI-1e9524f/Platform/Linux/Build/Modules/nimMockNodes' make[1]: Entering directory '/tmp/B.jXlV1P/BUILD/OpenNI-OpenNI-1e9524f/Platform/Linux/Build/Samples/NiConvertXToONI' x86_64-pld-linux-g++ -MD -MP -MT "./x64-PLD/NiConvertXToONI.d x64-PLD/NiConvertXToONI.o" -c -O2 -fwrapv -pipe -Wformat -Werror=format-security -gdwarf-4 -fno-debug-types-section -fvar-tracking-assignments -g2 -Wp,-D_FORTIFY_SOURCE=2 -fstack-protector-strong --param=ssp-buffer-size=4 -fPIC -march=x86-64 -gdwarf-4 -fno-debug-types-section -fvar-tracking-assignments -g2 -I../../../../../Include -o x64-PLD/NiConvertXToONI.o ../../../../../Samples/NiConvertXToONI/NiConvertXToONI.cpp make[1]: Leaving directory '/tmp/B.jXlV1P/BUILD/OpenNI-OpenNI-1e9524f/Platform/Linux/Build/Samples/NiConvertXToONI' make[1]: Entering directory '/tmp/B.jXlV1P/BUILD/OpenNI-OpenNI-1e9524f/Platform/Linux/Build/Wrappers/OpenNI.jni' x86_64-pld-linux-g++ -o ../../../Bin/x64-PLD/libOpenNI.jni.so ./x64-PLD/org_openni_NativeMethods.o ./x64-PLD/OpenNI.jni.o -L../../../Bin/x64-PLD -lOpenNI -Wl,--no-undefined -shared make[1]: Leaving directory '/tmp/B.jXlV1P/BUILD/OpenNI-OpenNI-1e9524f/Platform/Linux/Build/Wrappers/OpenNI.jni' /usr/bin/make -C Samples/NiRecordSynthetic make[1]: Entering directory '/tmp/B.jXlV1P/BUILD/OpenNI-OpenNI-1e9524f/Platform/Linux/Build/Samples/NiRecordSynthetic' mkdir -p x64-PLD make[1]: Leaving directory '/tmp/B.jXlV1P/BUILD/OpenNI-OpenNI-1e9524f/Platform/Linux/Build/Samples/NiRecordSynthetic' make[1]: Entering directory '/tmp/B.jXlV1P/BUILD/OpenNI-OpenNI-1e9524f/Platform/Linux/Build/Modules/nimCodecs' x86_64-pld-linux-g++ -MD -MP -MT "./x64-PLD/XnJpegCodec.d x64-PLD/XnJpegCodec.o" -c -O2 -fwrapv -pipe -Wformat -Werror=format-security -gdwarf-4 -fno-debug-types-section -fvar-tracking-assignments -g2 -Wp,-D_FORTIFY_SOURCE=2 -fstack-protector-strong --param=ssp-buffer-size=4 -fPIC -march=x86-64 -gdwarf-4 -fno-debug-types-section -fvar-tracking-assignments -g2 -I../../../../../Include -I../../../../../Source -fPIC -fvisibility=hidden -o x64-PLD/XnJpegCodec.o ../../../../../Source/Modules/nimCodecs/XnJpegCodec.cpp make[1]: Leaving directory '/tmp/B.jXlV1P/BUILD/OpenNI-OpenNI-1e9524f/Platform/Linux/Build/Modules/nimCodecs' make[1]: Entering directory '/tmp/B.jXlV1P/BUILD/OpenNI-OpenNI-1e9524f/Platform/Linux/Build/Samples/NiConvertXToONI' x86_64-pld-linux-g++ -o ../../../Bin/x64-PLD/Sample-NiConvertXToONI ./x64-PLD/NiConvertXToONI.o -L../../../Bin/x64-PLD -lOpenNI make[1]: Leaving directory '/tmp/B.jXlV1P/BUILD/OpenNI-OpenNI-1e9524f/Platform/Linux/Build/Samples/NiConvertXToONI' make[1]: Entering directory '/tmp/B.jXlV1P/BUILD/OpenNI-OpenNI-1e9524f/Platform/Linux/Build/Modules/nimMockNodes' x86_64-pld-linux-g++ -MD -MP -MT "./x64-PLD/MockImageGenerator.d x64-PLD/MockImageGenerator.o" -c -O2 -fwrapv -pipe -Wformat -Werror=format-security -gdwarf-4 -fno-debug-types-section -fvar-tracking-assignments -g2 -Wp,-D_FORTIFY_SOURCE=2 -fstack-protector-strong --param=ssp-buffer-size=4 -fPIC -march=x86-64 -gdwarf-4 -fno-debug-types-section -fvar-tracking-assignments -g2 -I../../../../../Include -I../../../../../Source -fPIC -fvisibility=hidden -o x64-PLD/MockImageGenerator.o ../../../../../Source/Modules/nimMockNodes/MockImageGenerator.cpp make[1]: Leaving directory '/tmp/B.jXlV1P/BUILD/OpenNI-OpenNI-1e9524f/Platform/Linux/Build/Modules/nimMockNodes' make[1]: Entering directory '/tmp/B.jXlV1P/BUILD/OpenNI-OpenNI-1e9524f/Platform/Linux/Build/Modules/nimCodecs' x86_64-pld-linux-g++ -MD -MP -MT "./x64-PLD/XnStreamCompression.d x64-PLD/XnStreamCompression.o" -c -O2 -fwrapv -pipe -Wformat -Werror=format-security -gdwarf-4 -fno-debug-types-section -fvar-tracking-assignments -g2 -Wp,-D_FORTIFY_SOURCE=2 -fstack-protector-strong --param=ssp-buffer-size=4 -fPIC -march=x86-64 -gdwarf-4 -fno-debug-types-section -fvar-tracking-assignments -g2 -I../../../../../Include -I../../../../../Source -fPIC -fvisibility=hidden -o x64-PLD/XnStreamCompression.o ../../../../../Source/Modules/nimCodecs/XnStreamCompression.cpp make[1]: Leaving directory '/tmp/B.jXlV1P/BUILD/OpenNI-OpenNI-1e9524f/Platform/Linux/Build/Modules/nimCodecs' make[1]: Entering directory '/tmp/B.jXlV1P/BUILD/OpenNI-OpenNI-1e9524f/Platform/Linux/Build/Modules/nimMockNodes' x86_64-pld-linux-g++ -MD -MP -MT "./x64-PLD/MockDevice.d x64-PLD/MockDevice.o" -c -O2 -fwrapv -pipe -Wformat -Werror=format-security -gdwarf-4 -fno-debug-types-section -fvar-tracking-assignments -g2 -Wp,-D_FORTIFY_SOURCE=2 -fstack-protector-strong --param=ssp-buffer-size=4 -fPIC -march=x86-64 -gdwarf-4 -fno-debug-types-section -fvar-tracking-assignments -g2 -I../../../../../Include -I../../../../../Source -fPIC -fvisibility=hidden -o x64-PLD/MockDevice.o ../../../../../Source/Modules/nimMockNodes/MockDevice.cpp make[1]: Leaving directory '/tmp/B.jXlV1P/BUILD/OpenNI-OpenNI-1e9524f/Platform/Linux/Build/Modules/nimMockNodes' make[1]: Entering directory '/tmp/B.jXlV1P/BUILD/OpenNI-OpenNI-1e9524f/Platform/Linux/Build/Samples/NiRecordSynthetic' x86_64-pld-linux-g++ -MD -MP -MT "./x64-PLD/NiRecordSynthetic.d x64-PLD/NiRecordSynthetic.o" -c -O2 -fwrapv -pipe -Wformat -Werror=format-security -gdwarf-4 -fno-debug-types-section -fvar-tracking-assignments -g2 -Wp,-D_FORTIFY_SOURCE=2 -fstack-protector-strong --param=ssp-buffer-size=4 -fPIC -march=x86-64 -gdwarf-4 -fno-debug-types-section -fvar-tracking-assignments -g2 -I../../../../../Include -o x64-PLD/NiRecordSynthetic.o ../../../../../Samples/NiRecordSynthetic/NiRecordSynthetic.cpp make[1]: Leaving directory '/tmp/B.jXlV1P/BUILD/OpenNI-OpenNI-1e9524f/Platform/Linux/Build/Samples/NiRecordSynthetic' make[1]: Entering directory '/tmp/B.jXlV1P/BUILD/OpenNI-OpenNI-1e9524f/Platform/Linux/Build/Samples/NiRecordSynthetic' x86_64-pld-linux-g++ -o ../../../Bin/x64-PLD/Sample-NiRecordSynthetic ./x64-PLD/NiRecordSynthetic.o -L../../../Bin/x64-PLD -lOpenNI make[1]: Leaving directory '/tmp/B.jXlV1P/BUILD/OpenNI-OpenNI-1e9524f/Platform/Linux/Build/Samples/NiRecordSynthetic' /usr/bin/make -C Samples/NiSampleModule make[1]: Entering directory '/tmp/B.jXlV1P/BUILD/OpenNI-OpenNI-1e9524f/Platform/Linux/Build/Modules/nimCodecs' x86_64-pld-linux-g++ -MD -MP -MT "./x64-PLD/XnCodec.d x64-PLD/XnCodec.o" -c -O2 -fwrapv -pipe -Wformat -Werror=format-security -gdwarf-4 -fno-debug-types-section -fvar-tracking-assignments -g2 -Wp,-D_FORTIFY_SOURCE=2 -fstack-protector-strong --param=ssp-buffer-size=4 -fPIC -march=x86-64 -gdwarf-4 -fno-debug-types-section -fvar-tracking-assignments -g2 -I../../../../../Include -I../../../../../Source -fPIC -fvisibility=hidden -o x64-PLD/XnCodec.o ../../../../../Source/Modules/nimCodecs/XnCodec.cpp make[1]: Leaving directory '/tmp/B.jXlV1P/BUILD/OpenNI-OpenNI-1e9524f/Platform/Linux/Build/Modules/nimCodecs' make[1]: Entering directory '/tmp/B.jXlV1P/BUILD/OpenNI-OpenNI-1e9524f/Platform/Linux/Build/Samples/NiSampleModule' mkdir -p x64-PLD make[1]: Leaving directory '/tmp/B.jXlV1P/BUILD/OpenNI-OpenNI-1e9524f/Platform/Linux/Build/Samples/NiSampleModule' make[1]: Entering directory '/tmp/B.jXlV1P/BUILD/OpenNI-OpenNI-1e9524f/Platform/Linux/Build/Modules/nimMockNodes' x86_64-pld-linux-g++ -MD -MP -MT "./x64-PLD/MockIRGenerator.d x64-PLD/MockIRGenerator.o" -c -O2 -fwrapv -pipe -Wformat -Werror=format-security -gdwarf-4 -fno-debug-types-section -fvar-tracking-assignments -g2 -Wp,-D_FORTIFY_SOURCE=2 -fstack-protector-strong --param=ssp-buffer-size=4 -fPIC -march=x86-64 -gdwarf-4 -fno-debug-types-section -fvar-tracking-assignments -g2 -I../../../../../Include -I../../../../../Source -fPIC -fvisibility=hidden -o x64-PLD/MockIRGenerator.o ../../../../../Source/Modules/nimMockNodes/MockIRGenerator.cpp make[1]: Leaving directory '/tmp/B.jXlV1P/BUILD/OpenNI-OpenNI-1e9524f/Platform/Linux/Build/Modules/nimMockNodes' make[1]: Entering directory '/tmp/B.jXlV1P/BUILD/OpenNI-OpenNI-1e9524f/Platform/Linux/Build/Modules/nimRecorder' x86_64-pld-linux-g++ -MD -MP -MT "./x64-PLD/nimRecorder.d x64-PLD/nimRecorder.o" -c -O2 -fwrapv -pipe -Wformat -Werror=format-security -gdwarf-4 -fno-debug-types-section -fvar-tracking-assignments -g2 -Wp,-D_FORTIFY_SOURCE=2 -fstack-protector-strong --param=ssp-buffer-size=4 -fPIC -march=x86-64 -gdwarf-4 -fno-debug-types-section -fvar-tracking-assignments -g2 -I../../../../../Include -I../../../../../Source -I../../../../../Source/Modules/Common -fPIC -fvisibility=hidden -o x64-PLD/nimRecorder.o ../../../../../Source/Modules/nimRecorder/nimRecorder.cpp make[1]: Leaving directory '/tmp/B.jXlV1P/BUILD/OpenNI-OpenNI-1e9524f/Platform/Linux/Build/Modules/nimRecorder' make[1]: Entering directory '/tmp/B.jXlV1P/BUILD/OpenNI-OpenNI-1e9524f/Platform/Linux/Build/Modules/nimCodecs' x86_64-pld-linux-g++ -MD -MP -MT "./x64-PLD/Xn16zCodec.d x64-PLD/Xn16zCodec.o" -c -O2 -fwrapv -pipe -Wformat -Werror=format-security -gdwarf-4 -fno-debug-types-section -fvar-tracking-assignments -g2 -Wp,-D_FORTIFY_SOURCE=2 -fstack-protector-strong --param=ssp-buffer-size=4 -fPIC -march=x86-64 -gdwarf-4 -fno-debug-types-section -fvar-tracking-assignments -g2 -I../../../../../Include -I../../../../../Source -fPIC -fvisibility=hidden -o x64-PLD/Xn16zCodec.o ../../../../../Source/Modules/nimCodecs/Xn16zCodec.cpp make[1]: Leaving directory '/tmp/B.jXlV1P/BUILD/OpenNI-OpenNI-1e9524f/Platform/Linux/Build/Modules/nimCodecs' make[1]: Entering directory '/tmp/B.jXlV1P/BUILD/OpenNI-OpenNI-1e9524f/Platform/Linux/Build/Modules/nimRecorder' x86_64-pld-linux-g++ -MD -MP -MT "./x64-PLD/ExportedPlayer.d x64-PLD/ExportedPlayer.o" -c -O2 -fwrapv -pipe -Wformat -Werror=format-security -gdwarf-4 -fno-debug-types-section -fvar-tracking-assignments -g2 -Wp,-D_FORTIFY_SOURCE=2 -fstack-protector-strong --param=ssp-buffer-size=4 -fPIC -march=x86-64 -gdwarf-4 -fno-debug-types-section -fvar-tracking-assignments -g2 -I../../../../../Include -I../../../../../Source -I../../../../../Source/Modules/Common -fPIC -fvisibility=hidden -o x64-PLD/ExportedPlayer.o ../../../../../Source/Modules/nimRecorder/ExportedPlayer.cpp make[1]: Leaving directory '/tmp/B.jXlV1P/BUILD/OpenNI-OpenNI-1e9524f/Platform/Linux/Build/Modules/nimRecorder' make[1]: Entering directory '/tmp/B.jXlV1P/BUILD/OpenNI-OpenNI-1e9524f/Platform/Linux/Build/Modules/nimMockNodes' x86_64-pld-linux-g++ -MD -MP -MT "./x64-PLD/MockDepthGenerator.d x64-PLD/MockDepthGenerator.o" -c -O2 -fwrapv -pipe -Wformat -Werror=format-security -gdwarf-4 -fno-debug-types-section -fvar-tracking-assignments -g2 -Wp,-D_FORTIFY_SOURCE=2 -fstack-protector-strong --param=ssp-buffer-size=4 -fPIC -march=x86-64 -gdwarf-4 -fno-debug-types-section -fvar-tracking-assignments -g2 -I../../../../../Include -I../../../../../Source -fPIC -fvisibility=hidden -o x64-PLD/MockDepthGenerator.o ../../../../../Source/Modules/nimMockNodes/MockDepthGenerator.cpp make[1]: Leaving directory '/tmp/B.jXlV1P/BUILD/OpenNI-OpenNI-1e9524f/Platform/Linux/Build/Modules/nimMockNodes' make[1]: Entering directory '/tmp/B.jXlV1P/BUILD/OpenNI-OpenNI-1e9524f/Platform/Linux/Build/Modules/nimCodecs' x86_64-pld-linux-g++ -MD -MP -MT "./x64-PLD/Xn8zCodec.d x64-PLD/Xn8zCodec.o" -c -O2 -fwrapv -pipe -Wformat -Werror=format-security -gdwarf-4 -fno-debug-types-section -fvar-tracking-assignments -g2 -Wp,-D_FORTIFY_SOURCE=2 -fstack-protector-strong --param=ssp-buffer-size=4 -fPIC -march=x86-64 -gdwarf-4 -fno-debug-types-section -fvar-tracking-assignments -g2 -I../../../../../Include -I../../../../../Source -fPIC -fvisibility=hidden -o x64-PLD/Xn8zCodec.o ../../../../../Source/Modules/nimCodecs/Xn8zCodec.cpp make[1]: Leaving directory '/tmp/B.jXlV1P/BUILD/OpenNI-OpenNI-1e9524f/Platform/Linux/Build/Modules/nimCodecs' make[1]: Entering directory '/tmp/B.jXlV1P/BUILD/OpenNI-OpenNI-1e9524f/Platform/Linux/Build/Modules/nimCodecs' x86_64-pld-linux-g++ -MD -MP -MT "./x64-PLD/ExportedCodec.d x64-PLD/ExportedCodec.o" -c -O2 -fwrapv -pipe -Wformat -Werror=format-security -gdwarf-4 -fno-debug-types-section -fvar-tracking-assignments -g2 -Wp,-D_FORTIFY_SOURCE=2 -fstack-protector-strong --param=ssp-buffer-size=4 -fPIC -march=x86-64 -gdwarf-4 -fno-debug-types-section -fvar-tracking-assignments -g2 -I../../../../../Include -I../../../../../Source -fPIC -fvisibility=hidden -o x64-PLD/ExportedCodec.o ../../../../../Source/Modules/nimCodecs/ExportedCodec.cpp make[1]: Leaving directory '/tmp/B.jXlV1P/BUILD/OpenNI-OpenNI-1e9524f/Platform/Linux/Build/Modules/nimCodecs' make[1]: Entering directory '/tmp/B.jXlV1P/BUILD/OpenNI-OpenNI-1e9524f/Platform/Linux/Build/Modules/nimRecorder' x86_64-pld-linux-g++ -MD -MP -MT "./x64-PLD/ExportedRecorder.d x64-PLD/ExportedRecorder.o" -c -O2 -fwrapv -pipe -Wformat -Werror=format-security -gdwarf-4 -fno-debug-types-section -fvar-tracking-assignments -g2 -Wp,-D_FORTIFY_SOURCE=2 -fstack-protector-strong --param=ssp-buffer-size=4 -fPIC -march=x86-64 -gdwarf-4 -fno-debug-types-section -fvar-tracking-assignments -g2 -I../../../../../Include -I../../../../../Source -I../../../../../Source/Modules/Common -fPIC -fvisibility=hidden -o x64-PLD/ExportedRecorder.o ../../../../../Source/Modules/nimRecorder/ExportedRecorder.cpp make[1]: Leaving directory '/tmp/B.jXlV1P/BUILD/OpenNI-OpenNI-1e9524f/Platform/Linux/Build/Modules/nimRecorder' make[1]: Entering directory '/tmp/B.jXlV1P/BUILD/OpenNI-OpenNI-1e9524f/Platform/Linux/Build/Modules/nimCodecs' x86_64-pld-linux-g++ -o ../../../Bin/x64-PLD/libnimCodecs.so ./x64-PLD/XnUncompressedCodec.o ./x64-PLD/Xn16zEmbTablesCodec.o ./x64-PLD/XnCodecs.o ./x64-PLD/XnJpegCodec.o ./x64-PLD/XnStreamCompression.o ./x64-PLD/XnCodec.o ./x64-PLD/Xn16zCodec.o ./x64-PLD/Xn8zCodec.o ./x64-PLD/ExportedCodec.o -L../../../Bin/x64-PLD -lOpenNI -ljpeg -Wl,--no-undefined -shared make[1]: Leaving directory '/tmp/B.jXlV1P/BUILD/OpenNI-OpenNI-1e9524f/Platform/Linux/Build/Modules/nimCodecs' /usr/bin/make -C Samples/NiSimpleCreate make[1]: Entering directory '/tmp/B.jXlV1P/BUILD/OpenNI-OpenNI-1e9524f/Platform/Linux/Build/Samples/NiSimpleCreate' mkdir -p x64-PLD make[1]: Leaving directory '/tmp/B.jXlV1P/BUILD/OpenNI-OpenNI-1e9524f/Platform/Linux/Build/Samples/NiSimpleCreate' make[1]: Entering directory '/tmp/B.jXlV1P/BUILD/OpenNI-OpenNI-1e9524f/Platform/Linux/Build/Samples/NiSampleModule' x86_64-pld-linux-g++ -MD -MP -MT "./x64-PLD/SampleDepth.d x64-PLD/SampleDepth.o" -c -O2 -fwrapv -pipe -Wformat -Werror=format-security -gdwarf-4 -fno-debug-types-section -fvar-tracking-assignments -g2 -Wp,-D_FORTIFY_SOURCE=2 -fstack-protector-strong --param=ssp-buffer-size=4 -fPIC -march=x86-64 -gdwarf-4 -fno-debug-types-section -fvar-tracking-assignments -g2 -I../../../../../Include -fPIC -fvisibility=hidden -o x64-PLD/SampleDepth.o ../../../../../Samples/NiSampleModule/SampleDepth.cpp make[1]: Leaving directory '/tmp/B.jXlV1P/BUILD/OpenNI-OpenNI-1e9524f/Platform/Linux/Build/Samples/NiSampleModule' make[1]: Entering directory '/tmp/B.jXlV1P/BUILD/OpenNI-OpenNI-1e9524f/Platform/Linux/Build/Modules/nimMockNodes' x86_64-pld-linux-g++ -MD -MP -MT "./x64-PLD/nimMockNodes.d x64-PLD/nimMockNodes.o" -c -O2 -fwrapv -pipe -Wformat -Werror=format-security -gdwarf-4 -fno-debug-types-section -fvar-tracking-assignments -g2 -Wp,-D_FORTIFY_SOURCE=2 -fstack-protector-strong --param=ssp-buffer-size=4 -fPIC -march=x86-64 -gdwarf-4 -fno-debug-types-section -fvar-tracking-assignments -g2 -I../../../../../Include -I../../../../../Source -fPIC -fvisibility=hidden -o x64-PLD/nimMockNodes.o ../../../../../Source/Modules/nimMockNodes/nimMockNodes.cpp make[1]: Leaving directory '/tmp/B.jXlV1P/BUILD/OpenNI-OpenNI-1e9524f/Platform/Linux/Build/Modules/nimMockNodes' make[1]: Entering directory '/tmp/B.jXlV1P/BUILD/OpenNI-OpenNI-1e9524f/Platform/Linux/Build/Samples/NiSimpleCreate' x86_64-pld-linux-g++ -MD -MP -MT "./x64-PLD/NiSimpleCreate.d x64-PLD/NiSimpleCreate.o" -c -O2 -fwrapv -pipe -Wformat -Werror=format-security -gdwarf-4 -fno-debug-types-section -fvar-tracking-assignments -g2 -Wp,-D_FORTIFY_SOURCE=2 -fstack-protector-strong --param=ssp-buffer-size=4 -fPIC -march=x86-64 -gdwarf-4 -fno-debug-types-section -fvar-tracking-assignments -g2 -I../../../../../Include -o x64-PLD/NiSimpleCreate.o ../../../../../Samples/NiSimpleCreate/NiSimpleCreate.cpp make[1]: Leaving directory '/tmp/B.jXlV1P/BUILD/OpenNI-OpenNI-1e9524f/Platform/Linux/Build/Samples/NiSimpleCreate' make[1]: Entering directory '/tmp/B.jXlV1P/BUILD/OpenNI-OpenNI-1e9524f/Platform/Linux/Build/Samples/NiSampleModule' x86_64-pld-linux-g++ -MD -MP -MT "./x64-PLD/ExportedSampleDepth.d x64-PLD/ExportedSampleDepth.o" -c -O2 -fwrapv -pipe -Wformat -Werror=format-security -gdwarf-4 -fno-debug-types-section -fvar-tracking-assignments -g2 -Wp,-D_FORTIFY_SOURCE=2 -fstack-protector-strong --param=ssp-buffer-size=4 -fPIC -march=x86-64 -gdwarf-4 -fno-debug-types-section -fvar-tracking-assignments -g2 -I../../../../../Include -fPIC -fvisibility=hidden -o x64-PLD/ExportedSampleDepth.o ../../../../../Samples/NiSampleModule/ExportedSampleDepth.cpp make[1]: Leaving directory '/tmp/B.jXlV1P/BUILD/OpenNI-OpenNI-1e9524f/Platform/Linux/Build/Samples/NiSampleModule' make[1]: Entering directory '/tmp/B.jXlV1P/BUILD/OpenNI-OpenNI-1e9524f/Platform/Linux/Build/Samples/NiSimpleCreate' x86_64-pld-linux-g++ -o ../../../Bin/x64-PLD/Sample-NiSimpleCreate ./x64-PLD/NiSimpleCreate.o -L../../../Bin/x64-PLD -lOpenNI make[1]: Leaving directory '/tmp/B.jXlV1P/BUILD/OpenNI-OpenNI-1e9524f/Platform/Linux/Build/Samples/NiSimpleCreate' make[1]: Entering directory '/tmp/B.jXlV1P/BUILD/OpenNI-OpenNI-1e9524f/Platform/Linux/Build/Modules/nimRecorder' x86_64-pld-linux-g++ -MD -MP -MT "./x64-PLD/DataRecords.d x64-PLD/DataRecords.o" -c -O2 -fwrapv -pipe -Wformat -Werror=format-security -gdwarf-4 -fno-debug-types-section -fvar-tracking-assignments -g2 -Wp,-D_FORTIFY_SOURCE=2 -fstack-protector-strong --param=ssp-buffer-size=4 -fPIC -march=x86-64 -gdwarf-4 -fno-debug-types-section -fvar-tracking-assignments -g2 -I../../../../../Include -I../../../../../Source -I../../../../../Source/Modules/Common -fPIC -fvisibility=hidden -o x64-PLD/DataRecords.o ../../../../../Source/Modules/Common/DataRecords.cpp make[1]: Leaving directory '/tmp/B.jXlV1P/BUILD/OpenNI-OpenNI-1e9524f/Platform/Linux/Build/Modules/nimRecorder' /usr/bin/make -C Samples/NiCRead make[1]: Entering directory '/tmp/B.jXlV1P/BUILD/OpenNI-OpenNI-1e9524f/Platform/Linux/Build/Samples/NiCRead' mkdir -p x64-PLD make[1]: Leaving directory '/tmp/B.jXlV1P/BUILD/OpenNI-OpenNI-1e9524f/Platform/Linux/Build/Samples/NiCRead' make[1]: Entering directory '/tmp/B.jXlV1P/BUILD/OpenNI-OpenNI-1e9524f/Platform/Linux/Build/Samples/NiCRead' x86_64-pld-linux-g++ -MD -MP -MT "./x64-PLD/NiCRead.d x64-PLD/NiCRead.o" -c -O2 -fwrapv -pipe -Wformat -Werror=format-security -gdwarf-4 -fno-debug-types-section -fvar-tracking-assignments -g2 -Wp,-D_FORTIFY_SOURCE=2 -fstack-protector-strong --param=ssp-buffer-size=4 -fPIC -march=x86-64 -gdwarf-4 -fno-debug-types-section -fvar-tracking-assignments -g2 -I../../../../../Include -o x64-PLD/NiCRead.o ../../../../../Samples/NiCRead/NiCRead.c make[1]: Leaving directory '/tmp/B.jXlV1P/BUILD/OpenNI-OpenNI-1e9524f/Platform/Linux/Build/Samples/NiCRead' make[1]: Entering directory '/tmp/B.jXlV1P/BUILD/OpenNI-OpenNI-1e9524f/Platform/Linux/Build/Modules/nimMockNodes' x86_64-pld-linux-g++ -MD -MP -MT "./x64-PLD/MockProductionNode.d x64-PLD/MockProductionNode.o" -c -O2 -fwrapv -pipe -Wformat -Werror=format-security -gdwarf-4 -fno-debug-types-section -fvar-tracking-assignments -g2 -Wp,-D_FORTIFY_SOURCE=2 -fstack-protector-strong --param=ssp-buffer-size=4 -fPIC -march=x86-64 -gdwarf-4 -fno-debug-types-section -fvar-tracking-assignments -g2 -I../../../../../Include -I../../../../../Source -fPIC -fvisibility=hidden -o x64-PLD/MockProductionNode.o ../../../../../Source/Modules/nimMockNodes/MockProductionNode.cpp make[1]: Leaving directory '/tmp/B.jXlV1P/BUILD/OpenNI-OpenNI-1e9524f/Platform/Linux/Build/Modules/nimMockNodes' /usr/bin/make -C Samples/NiAudioSample make[1]: Entering directory '/tmp/B.jXlV1P/BUILD/OpenNI-OpenNI-1e9524f/Platform/Linux/Build/Samples/NiCRead' x86_64-pld-linux-g++ -o ../../../Bin/x64-PLD/Sample-NiCRead ./x64-PLD/NiCRead.o -L../../../Bin/x64-PLD -lOpenNI make[1]: Leaving directory '/tmp/B.jXlV1P/BUILD/OpenNI-OpenNI-1e9524f/Platform/Linux/Build/Samples/NiCRead' /usr/bin/make -C Samples/NiSimpleSkeleton make[1]: Entering directory '/tmp/B.jXlV1P/BUILD/OpenNI-OpenNI-1e9524f/Platform/Linux/Build/Samples/NiAudioSample' mkdir -p x64-PLD make[1]: Leaving directory '/tmp/B.jXlV1P/BUILD/OpenNI-OpenNI-1e9524f/Platform/Linux/Build/Samples/NiAudioSample' make[1]: Entering directory '/tmp/B.jXlV1P/BUILD/OpenNI-OpenNI-1e9524f/Platform/Linux/Build/Samples/NiSimpleSkeleton' mkdir -p x64-PLD make[1]: Leaving directory '/tmp/B.jXlV1P/BUILD/OpenNI-OpenNI-1e9524f/Platform/Linux/Build/Samples/NiSimpleSkeleton' make[1]: Entering directory '/tmp/B.jXlV1P/BUILD/OpenNI-OpenNI-1e9524f/Platform/Linux/Build/Modules/nimRecorder' x86_64-pld-linux-g++ -MD -MP -MT "./x64-PLD/PlayerNode.d x64-PLD/PlayerNode.o" -c -O2 -fwrapv -pipe -Wformat -Werror=format-security -gdwarf-4 -fno-debug-types-section -fvar-tracking-assignments -g2 -Wp,-D_FORTIFY_SOURCE=2 -fstack-protector-strong --param=ssp-buffer-size=4 -fPIC -march=x86-64 -gdwarf-4 -fno-debug-types-section -fvar-tracking-assignments -g2 -I../../../../../Include -I../../../../../Source -I../../../../../Source/Modules/Common -fPIC -fvisibility=hidden -o x64-PLD/PlayerNode.o ../../../../../Source/Modules/nimRecorder/PlayerNode.cpp make[1]: Leaving directory '/tmp/B.jXlV1P/BUILD/OpenNI-OpenNI-1e9524f/Platform/Linux/Build/Modules/nimRecorder' make[1]: Entering directory '/tmp/B.jXlV1P/BUILD/OpenNI-OpenNI-1e9524f/Platform/Linux/Build/Modules/nimMockNodes' x86_64-pld-linux-g++ -MD -MP -MT "./x64-PLD/MockGenerator.d x64-PLD/MockGenerator.o" -c -O2 -fwrapv -pipe -Wformat -Werror=format-security -gdwarf-4 -fno-debug-types-section -fvar-tracking-assignments -g2 -Wp,-D_FORTIFY_SOURCE=2 -fstack-protector-strong --param=ssp-buffer-size=4 -fPIC -march=x86-64 -gdwarf-4 -fno-debug-types-section -fvar-tracking-assignments -g2 -I../../../../../Include -I../../../../../Source -fPIC -fvisibility=hidden -o x64-PLD/MockGenerator.o ../../../../../Source/Modules/nimMockNodes/MockGenerator.cpp make[1]: Leaving directory '/tmp/B.jXlV1P/BUILD/OpenNI-OpenNI-1e9524f/Platform/Linux/Build/Modules/nimMockNodes' make[1]: Entering directory '/tmp/B.jXlV1P/BUILD/OpenNI-OpenNI-1e9524f/Platform/Linux/Build/Modules/nimRecorder' x86_64-pld-linux-g++ -o ../../../Bin/x64-PLD/libnimRecorder.so ./x64-PLD/RecorderNode.o ./x64-PLD/nimRecorder.o ./x64-PLD/ExportedPlayer.o ./x64-PLD/ExportedRecorder.o ./x64-PLD/PlayerNode.o ./x64-PLD/DataRecords.o -L../../../Bin/x64-PLD -lOpenNI -Wl,--no-undefined -shared make[1]: Leaving directory '/tmp/B.jXlV1P/BUILD/OpenNI-OpenNI-1e9524f/Platform/Linux/Build/Modules/nimRecorder' /usr/bin/make -C Samples/NiSkeletonBenchmark make[1]: Entering directory '/tmp/B.jXlV1P/BUILD/OpenNI-OpenNI-1e9524f/Platform/Linux/Build/Samples/NiSkeletonBenchmark' mkdir -p x64-PLD make[1]: Leaving directory '/tmp/B.jXlV1P/BUILD/OpenNI-OpenNI-1e9524f/Platform/Linux/Build/Samples/NiSkeletonBenchmark' make[1]: Entering directory '/tmp/B.jXlV1P/BUILD/OpenNI-OpenNI-1e9524f/Platform/Linux/Build/Modules/nimMockNodes' x86_64-pld-linux-g++ -o ../../../Bin/x64-PLD/libnimMockNodes.so ./x64-PLD/ExportedMockNodes.o ./x64-PLD/MockAudioGenerator.o ./x64-PLD/MockMapGenerator.o ./x64-PLD/MockImageGenerator.o ./x64-PLD/MockDevice.o ./x64-PLD/nimMockNodes.o ./x64-PLD/MockIRGenerator.o ./x64-PLD/MockDepthGenerator.o ./x64-PLD/MockGenerator.o ./x64-PLD/MockProductionNode.o -L../../../Bin/x64-PLD -lOpenNI -Wl,--no-undefined -shared make[1]: Leaving directory '/tmp/B.jXlV1P/BUILD/OpenNI-OpenNI-1e9524f/Platform/Linux/Build/Modules/nimMockNodes' /usr/bin/make -C Samples/NiViewer make[1]: Entering directory '/tmp/B.jXlV1P/BUILD/OpenNI-OpenNI-1e9524f/Platform/Linux/Build/Samples/NiViewer' mkdir -p x64-PLD make[1]: Leaving directory '/tmp/B.jXlV1P/BUILD/OpenNI-OpenNI-1e9524f/Platform/Linux/Build/Samples/NiViewer' make[1]: Entering directory '/tmp/B.jXlV1P/BUILD/OpenNI-OpenNI-1e9524f/Platform/Linux/Build/Samples/NiViewer' x86_64-pld-linux-g++ -MD -MP -MT "./x64-PLD/Keyboard.d x64-PLD/Keyboard.o" -c -O2 -fwrapv -pipe -Wformat -Werror=format-security -gdwarf-4 -fno-debug-types-section -fvar-tracking-assignments -g2 -Wp,-D_FORTIFY_SOURCE=2 -fstack-protector-strong --param=ssp-buffer-size=4 -fPIC -march=x86-64 -gdwarf-4 -fno-debug-types-section -fvar-tracking-assignments -g2 -I../../../../../Include -I../../../../../Samples/NiViewer -o x64-PLD/Keyboard.o ../../../../../Samples/NiViewer/Keyboard.cpp make[1]: Leaving directory '/tmp/B.jXlV1P/BUILD/OpenNI-OpenNI-1e9524f/Platform/Linux/Build/Samples/NiViewer' make[1]: Entering directory '/tmp/B.jXlV1P/BUILD/OpenNI-OpenNI-1e9524f/Platform/Linux/Build/Samples/NiAudioSample' x86_64-pld-linux-g++ -MD -MP -MT "./x64-PLD/NiAudioSample.d x64-PLD/NiAudioSample.o" -c -O2 -fwrapv -pipe -Wformat -Werror=format-security -gdwarf-4 -fno-debug-types-section -fvar-tracking-assignments -g2 -Wp,-D_FORTIFY_SOURCE=2 -fstack-protector-strong --param=ssp-buffer-size=4 -fPIC -march=x86-64 -gdwarf-4 -fno-debug-types-section -fvar-tracking-assignments -g2 -I../../../../../Include -o x64-PLD/NiAudioSample.o ../../../../../Samples/NiAudioSample/NiAudioSample.cpp make[1]: Leaving directory '/tmp/B.jXlV1P/BUILD/OpenNI-OpenNI-1e9524f/Platform/Linux/Build/Samples/NiAudioSample' make[1]: Entering directory '/tmp/B.jXlV1P/BUILD/OpenNI-OpenNI-1e9524f/Platform/Linux/Build/Samples/NiSampleModule' x86_64-pld-linux-g++ -MD -MP -MT "./x64-PLD/Registration.d x64-PLD/Registration.o" -c -O2 -fwrapv -pipe -Wformat -Werror=format-security -gdwarf-4 -fno-debug-types-section -fvar-tracking-assignments -g2 -Wp,-D_FORTIFY_SOURCE=2 -fstack-protector-strong --param=ssp-buffer-size=4 -fPIC -march=x86-64 -gdwarf-4 -fno-debug-types-section -fvar-tracking-assignments -g2 -I../../../../../Include -fPIC -fvisibility=hidden -o x64-PLD/Registration.o ../../../../../Samples/NiSampleModule/Registration.cpp make[1]: Leaving directory '/tmp/B.jXlV1P/BUILD/OpenNI-OpenNI-1e9524f/Platform/Linux/Build/Samples/NiSampleModule' make[1]: Entering directory '/tmp/B.jXlV1P/BUILD/OpenNI-OpenNI-1e9524f/Platform/Linux/Build/Samples/NiSimpleSkeleton' x86_64-pld-linux-g++ -MD -MP -MT "./x64-PLD/NiSimpleSkeleton.d x64-PLD/NiSimpleSkeleton.o" -c -O2 -fwrapv -pipe -Wformat -Werror=format-security -gdwarf-4 -fno-debug-types-section -fvar-tracking-assignments -g2 -Wp,-D_FORTIFY_SOURCE=2 -fstack-protector-strong --param=ssp-buffer-size=4 -fPIC -march=x86-64 -gdwarf-4 -fno-debug-types-section -fvar-tracking-assignments -g2 -I../../../../../Include -o x64-PLD/NiSimpleSkeleton.o ../../../../../Samples/NiSimpleSkeleton/NiSimpleSkeleton.cpp make[1]: Leaving directory '/tmp/B.jXlV1P/BUILD/OpenNI-OpenNI-1e9524f/Platform/Linux/Build/Samples/NiSimpleSkeleton' make[1]: Entering directory '/tmp/B.jXlV1P/BUILD/OpenNI-OpenNI-1e9524f/Platform/Linux/Build/Samples/NiViewer' x86_64-pld-linux-g++ -MD -MP -MT "./x64-PLD/MouseInput.d x64-PLD/MouseInput.o" -c -O2 -fwrapv -pipe -Wformat -Werror=format-security -gdwarf-4 -fno-debug-types-section -fvar-tracking-assignments -g2 -Wp,-D_FORTIFY_SOURCE=2 -fstack-protector-strong --param=ssp-buffer-size=4 -fPIC -march=x86-64 -gdwarf-4 -fno-debug-types-section -fvar-tracking-assignments -g2 -I../../../../../Include -I../../../../../Samples/NiViewer -o x64-PLD/MouseInput.o ../../../../../Samples/NiViewer/MouseInput.cpp make[1]: Leaving directory '/tmp/B.jXlV1P/BUILD/OpenNI-OpenNI-1e9524f/Platform/Linux/Build/Samples/NiViewer' make[1]: Entering directory '/tmp/B.jXlV1P/BUILD/OpenNI-OpenNI-1e9524f/Platform/Linux/Build/Samples/NiAudioSample' x86_64-pld-linux-g++ -o ../../../Bin/x64-PLD/Sample-NiAudioSample ./x64-PLD/NiAudioSample.o -L../../../Bin/x64-PLD -lOpenNI make[1]: Leaving directory '/tmp/B.jXlV1P/BUILD/OpenNI-OpenNI-1e9524f/Platform/Linux/Build/Samples/NiAudioSample' /usr/bin/make -C Samples/NiSimpleViewer make[1]: Entering directory '/tmp/B.jXlV1P/BUILD/OpenNI-OpenNI-1e9524f/Platform/Linux/Build/Samples/NiSimpleViewer' mkdir -p x64-PLD make[1]: Leaving directory '/tmp/B.jXlV1P/BUILD/OpenNI-OpenNI-1e9524f/Platform/Linux/Build/Samples/NiSimpleViewer' make[1]: Entering directory '/tmp/B.jXlV1P/BUILD/OpenNI-OpenNI-1e9524f/Platform/Linux/Build/Samples/NiSampleModule' x86_64-pld-linux-g++ -o ../../../Bin/x64-PLD/libSample-NiSampleModule.so ./x64-PLD/SampleDepth.o ./x64-PLD/ExportedSampleDepth.o ./x64-PLD/Registration.o -L../../../Bin/x64-PLD -lOpenNI -Wl,--no-undefined -shared make[1]: Leaving directory '/tmp/B.jXlV1P/BUILD/OpenNI-OpenNI-1e9524f/Platform/Linux/Build/Samples/NiSampleModule' /usr/bin/make -C Samples/NiUserTracker make[1]: Entering directory '/tmp/B.jXlV1P/BUILD/OpenNI-OpenNI-1e9524f/Platform/Linux/Build/Samples/NiSimpleSkeleton' x86_64-pld-linux-g++ -o ../../../Bin/x64-PLD/Sample-NiSimpleSkeleton ./x64-PLD/NiSimpleSkeleton.o -L../../../Bin/x64-PLD -lOpenNI make[1]: Leaving directory '/tmp/B.jXlV1P/BUILD/OpenNI-OpenNI-1e9524f/Platform/Linux/Build/Samples/NiSimpleSkeleton' /usr/bin/make -C Samples/NiUserSelection make[1]: Entering directory '/tmp/B.jXlV1P/BUILD/OpenNI-OpenNI-1e9524f/Platform/Linux/Build/Samples/NiUserTracker' mkdir -p x64-PLD make[1]: Leaving directory '/tmp/B.jXlV1P/BUILD/OpenNI-OpenNI-1e9524f/Platform/Linux/Build/Samples/NiUserTracker' make[1]: Entering directory '/tmp/B.jXlV1P/BUILD/OpenNI-OpenNI-1e9524f/Platform/Linux/Build/Samples/NiUserTracker' x86_64-pld-linux-g++ -MD -MP -MT "./x64-PLD/opengles.d x64-PLD/opengles.o" -c -O2 -fwrapv -pipe -Wformat -Werror=format-security -gdwarf-4 -fno-debug-types-section -fvar-tracking-assignments -g2 -Wp,-D_FORTIFY_SOURCE=2 -fstack-protector-strong --param=ssp-buffer-size=4 -fPIC -march=x86-64 -gdwarf-4 -fno-debug-types-section -fvar-tracking-assignments -g2 -I../../../../../Include -o x64-PLD/opengles.o ../../../../../Samples/NiUserTracker/opengles.cpp make[1]: Leaving directory '/tmp/B.jXlV1P/BUILD/OpenNI-OpenNI-1e9524f/Platform/Linux/Build/Samples/NiUserTracker' make[1]: Entering directory '/tmp/B.jXlV1P/BUILD/OpenNI-OpenNI-1e9524f/Platform/Linux/Build/Samples/NiUserSelection' mkdir -p x64-PLD make[1]: Leaving directory '/tmp/B.jXlV1P/BUILD/OpenNI-OpenNI-1e9524f/Platform/Linux/Build/Samples/NiUserSelection' make[1]: Entering directory '/tmp/B.jXlV1P/BUILD/OpenNI-OpenNI-1e9524f/Platform/Linux/Build/Samples/NiViewer' x86_64-pld-linux-g++ -MD -MP -MT "./x64-PLD/Statistics.d x64-PLD/Statistics.o" -c -O2 -fwrapv -pipe -Wformat -Werror=format-security -gdwarf-4 -fno-debug-types-section -fvar-tracking-assignments -g2 -Wp,-D_FORTIFY_SOURCE=2 -fstack-protector-strong --param=ssp-buffer-size=4 -fPIC -march=x86-64 -gdwarf-4 -fno-debug-types-section -fvar-tracking-assignments -g2 -I../../../../../Include -I../../../../../Samples/NiViewer -o x64-PLD/Statistics.o ../../../../../Samples/NiViewer/Statistics.cpp make[1]: Leaving directory '/tmp/B.jXlV1P/BUILD/OpenNI-OpenNI-1e9524f/Platform/Linux/Build/Samples/NiViewer' make[1]: Entering directory '/tmp/B.jXlV1P/BUILD/OpenNI-OpenNI-1e9524f/Platform/Linux/Build/Samples/NiSkeletonBenchmark' x86_64-pld-linux-g++ -MD -MP -MT "./x64-PLD/NiSkeletonBenchmark.d x64-PLD/NiSkeletonBenchmark.o" -c -O2 -fwrapv -pipe -Wformat -Werror=format-security -gdwarf-4 -fno-debug-types-section -fvar-tracking-assignments -g2 -Wp,-D_FORTIFY_SOURCE=2 -fstack-protector-strong --param=ssp-buffer-size=4 -fPIC -march=x86-64 -gdwarf-4 -fno-debug-types-section -fvar-tracking-assignments -g2 -I../../../../../Include -o x64-PLD/NiSkeletonBenchmark.o ../../../../../Samples/NiSkeletonBenchmark/NiSkeletonBenchmark.cpp make[1]: Leaving directory '/tmp/B.jXlV1P/BUILD/OpenNI-OpenNI-1e9524f/Platform/Linux/Build/Samples/NiSkeletonBenchmark' make[1]: Entering directory '/tmp/B.jXlV1P/BUILD/OpenNI-OpenNI-1e9524f/Platform/Linux/Build/Samples/NiSkeletonBenchmark' x86_64-pld-linux-g++ -o ../../../Bin/x64-PLD/NiSkeletonBenchmark ./x64-PLD/NiSkeletonBenchmark.o -L../../../Bin/x64-PLD -lOpenNI make[1]: Leaving directory '/tmp/B.jXlV1P/BUILD/OpenNI-OpenNI-1e9524f/Platform/Linux/Build/Samples/NiSkeletonBenchmark' /usr/bin/make -C Samples/NiHandTracker make[1]: Entering directory '/tmp/B.jXlV1P/BUILD/OpenNI-OpenNI-1e9524f/Platform/Linux/Build/Samples/NiHandTracker' mkdir -p x64-PLD make[1]: Leaving directory '/tmp/B.jXlV1P/BUILD/OpenNI-OpenNI-1e9524f/Platform/Linux/Build/Samples/NiHandTracker' make[1]: Entering directory '/tmp/B.jXlV1P/BUILD/OpenNI-OpenNI-1e9524f/Platform/Linux/Build/Samples/NiSimpleViewer' x86_64-pld-linux-g++ -MD -MP -MT "./x64-PLD/NiSimpleViewer.d x64-PLD/NiSimpleViewer.o" -c -O2 -fwrapv -pipe -Wformat -Werror=format-security -gdwarf-4 -fno-debug-types-section -fvar-tracking-assignments -g2 -Wp,-D_FORTIFY_SOURCE=2 -fstack-protector-strong --param=ssp-buffer-size=4 -fPIC -march=x86-64 -gdwarf-4 -fno-debug-types-section -fvar-tracking-assignments -g2 -I../../../../../Include -o x64-PLD/NiSimpleViewer.o ../../../../../Samples/NiSimpleViewer/NiSimpleViewer.cpp make[1]: Leaving directory '/tmp/B.jXlV1P/BUILD/OpenNI-OpenNI-1e9524f/Platform/Linux/Build/Samples/NiSimpleViewer' make[1]: Entering directory '/tmp/B.jXlV1P/BUILD/OpenNI-OpenNI-1e9524f/Platform/Linux/Build/Samples/NiUserSelection' x86_64-pld-linux-g++ -MD -MP -MT "./x64-PLD/UserSelector.d x64-PLD/UserSelector.o" -c -O2 -fwrapv -pipe -Wformat -Werror=format-security -gdwarf-4 -fno-debug-types-section -fvar-tracking-assignments -g2 -Wp,-D_FORTIFY_SOURCE=2 -fstack-protector-strong --param=ssp-buffer-size=4 -fPIC -march=x86-64 -gdwarf-4 -fno-debug-types-section -fvar-tracking-assignments -g2 -I../../../../../Include -o x64-PLD/UserSelector.o ../../../../../Samples/NiUserSelection/UserSelector.cpp make[1]: Leaving directory '/tmp/B.jXlV1P/BUILD/OpenNI-OpenNI-1e9524f/Platform/Linux/Build/Samples/NiUserSelection' make[1]: Entering directory '/tmp/B.jXlV1P/BUILD/OpenNI-OpenNI-1e9524f/Platform/Linux/Build/Samples/NiSimpleViewer' x86_64-pld-linux-g++ -o ../../../Bin/x64-PLD/Sample-NiSimpleViewer ./x64-PLD/NiSimpleViewer.o -L../../../Bin/x64-PLD -lglut -lGL -lOpenNI make[1]: Leaving directory '/tmp/B.jXlV1P/BUILD/OpenNI-OpenNI-1e9524f/Platform/Linux/Build/Samples/NiSimpleViewer' /usr/bin/make -C Wrappers/OpenNI.java make[1]: Entering directory '/tmp/B.jXlV1P/BUILD/OpenNI-OpenNI-1e9524f/Platform/Linux/Build/Wrappers/OpenNI.java' mkdir -p x64-PLD make[1]: Leaving directory '/tmp/B.jXlV1P/BUILD/OpenNI-OpenNI-1e9524f/Platform/Linux/Build/Wrappers/OpenNI.java' make[1]: Entering directory '/tmp/B.jXlV1P/BUILD/OpenNI-OpenNI-1e9524f/Platform/Linux/Build/Samples/NiUserTracker' x86_64-pld-linux-g++ -MD -MP -MT "./x64-PLD/SceneDrawer.d x64-PLD/SceneDrawer.o" -c -O2 -fwrapv -pipe -Wformat -Werror=format-security -gdwarf-4 -fno-debug-types-section -fvar-tracking-assignments -g2 -Wp,-D_FORTIFY_SOURCE=2 -fstack-protector-strong --param=ssp-buffer-size=4 -fPIC -march=x86-64 -gdwarf-4 -fno-debug-types-section -fvar-tracking-assignments -g2 -I../../../../../Include -o x64-PLD/SceneDrawer.o ../../../../../Samples/NiUserTracker/SceneDrawer.cpp make[1]: Leaving directory '/tmp/B.jXlV1P/BUILD/OpenNI-OpenNI-1e9524f/Platform/Linux/Build/Samples/NiUserTracker' make[1]: Entering directory '/tmp/B.jXlV1P/BUILD/OpenNI-OpenNI-1e9524f/Platform/Linux/Build/Samples/NiUserSelection' x86_64-pld-linux-g++ -MD -MP -MT "./x64-PLD/DefaultTrackingInitializer.d x64-PLD/DefaultTrackingInitializer.o" -c -O2 -fwrapv -pipe -Wformat -Werror=format-security -gdwarf-4 -fno-debug-types-section -fvar-tracking-assignments -g2 -Wp,-D_FORTIFY_SOURCE=2 -fstack-protector-strong --param=ssp-buffer-size=4 -fPIC -march=x86-64 -gdwarf-4 -fno-debug-types-section -fvar-tracking-assignments -g2 -I../../../../../Include -o x64-PLD/DefaultTrackingInitializer.o ../../../../../Samples/NiUserSelection/DefaultTrackingInitializer.cpp make[1]: Leaving directory '/tmp/B.jXlV1P/BUILD/OpenNI-OpenNI-1e9524f/Platform/Linux/Build/Samples/NiUserSelection' make[1]: Entering directory '/tmp/B.jXlV1P/BUILD/OpenNI-OpenNI-1e9524f/Platform/Linux/Build/Samples/NiViewer' x86_64-pld-linux-g++ -MD -MP -MT "./x64-PLD/Draw.d x64-PLD/Draw.o" -c -O2 -fwrapv -pipe -Wformat -Werror=format-security -gdwarf-4 -fno-debug-types-section -fvar-tracking-assignments -g2 -Wp,-D_FORTIFY_SOURCE=2 -fstack-protector-strong --param=ssp-buffer-size=4 -fPIC -march=x86-64 -gdwarf-4 -fno-debug-types-section -fvar-tracking-assignments -g2 -I../../../../../Include -I../../../../../Samples/NiViewer -o x64-PLD/Draw.o ../../../../../Samples/NiViewer/Draw.cpp make[1]: Leaving directory '/tmp/B.jXlV1P/BUILD/OpenNI-OpenNI-1e9524f/Platform/Linux/Build/Samples/NiViewer' make[1]: Entering directory '/tmp/B.jXlV1P/BUILD/OpenNI-OpenNI-1e9524f/Platform/Linux/Build/Samples/NiHandTracker' x86_64-pld-linux-g++ -MD -MP -MT "./x64-PLD/NiSimpleViewer.d x64-PLD/NiSimpleViewer.o" -c -O2 -fwrapv -pipe -Wformat -Werror=format-security -gdwarf-4 -fno-debug-types-section -fvar-tracking-assignments -g2 -Wp,-D_FORTIFY_SOURCE=2 -fstack-protector-strong --param=ssp-buffer-size=4 -fPIC -march=x86-64 -gdwarf-4 -fno-debug-types-section -fvar-tracking-assignments -g2 -I../../../../../Include -I../../../../../Samples/NiHandTracker -o x64-PLD/NiSimpleViewer.o ../../../../../Samples/NiHandTracker/NiSimpleViewer.cpp make[1]: Leaving directory '/tmp/B.jXlV1P/BUILD/OpenNI-OpenNI-1e9524f/Platform/Linux/Build/Samples/NiHandTracker' make[1]: Entering directory '/tmp/B.jXlV1P/BUILD/OpenNI-OpenNI-1e9524f/Platform/Linux/Build/Samples/NiViewer' x86_64-pld-linux-g++ -MD -MP -MT "./x64-PLD/Audio.d x64-PLD/Audio.o" -c -O2 -fwrapv -pipe -Wformat -Werror=format-security -gdwarf-4 -fno-debug-types-section -fvar-tracking-assignments -g2 -Wp,-D_FORTIFY_SOURCE=2 -fstack-protector-strong --param=ssp-buffer-size=4 -fPIC -march=x86-64 -gdwarf-4 -fno-debug-types-section -fvar-tracking-assignments -g2 -I../../../../../Include -I../../../../../Samples/NiViewer -o x64-PLD/Audio.o ../../../../../Samples/NiViewer/Audio.cpp make[1]: Leaving directory '/tmp/B.jXlV1P/BUILD/OpenNI-OpenNI-1e9524f/Platform/Linux/Build/Samples/NiViewer' make[1]: Entering directory '/tmp/B.jXlV1P/BUILD/OpenNI-OpenNI-1e9524f/Platform/Linux/Build/Samples/NiUserSelection' x86_64-pld-linux-g++ -MD -MP -MT "./x64-PLD/PoseUserSelector.d x64-PLD/PoseUserSelector.o" -c -O2 -fwrapv -pipe -Wformat -Werror=format-security -gdwarf-4 -fno-debug-types-section -fvar-tracking-assignments -g2 -Wp,-D_FORTIFY_SOURCE=2 -fstack-protector-strong --param=ssp-buffer-size=4 -fPIC -march=x86-64 -gdwarf-4 -fno-debug-types-section -fvar-tracking-assignments -g2 -I../../../../../Include -o x64-PLD/PoseUserSelector.o ../../../../../Samples/NiUserSelection/PoseUserSelector.cpp make[1]: Leaving directory '/tmp/B.jXlV1P/BUILD/OpenNI-OpenNI-1e9524f/Platform/Linux/Build/Samples/NiUserSelection' make[1]: Entering directory '/tmp/B.jXlV1P/BUILD/OpenNI-OpenNI-1e9524f/Platform/Linux/Build/Samples/NiUserSelection' x86_64-pld-linux-g++ -MD -MP -MT "./x64-PLD/opengles.d x64-PLD/opengles.o" -c -O2 -fwrapv -pipe -Wformat -Werror=format-security -gdwarf-4 -fno-debug-types-section -fvar-tracking-assignments -g2 -Wp,-D_FORTIFY_SOURCE=2 -fstack-protector-strong --param=ssp-buffer-size=4 -fPIC -march=x86-64 -gdwarf-4 -fno-debug-types-section -fvar-tracking-assignments -g2 -I../../../../../Include -o x64-PLD/opengles.o ../../../../../Samples/NiUserSelection/opengles.cpp make[1]: Leaving directory '/tmp/B.jXlV1P/BUILD/OpenNI-OpenNI-1e9524f/Platform/Linux/Build/Samples/NiUserSelection' make[1]: Entering directory '/tmp/B.jXlV1P/BUILD/OpenNI-OpenNI-1e9524f/Platform/Linux/Build/Samples/NiHandTracker' x86_64-pld-linux-g++ -MD -MP -MT "./x64-PLD/NiHandViewer.d x64-PLD/NiHandViewer.o" -c -O2 -fwrapv -pipe -Wformat -Werror=format-security -gdwarf-4 -fno-debug-types-section -fvar-tracking-assignments -g2 -Wp,-D_FORTIFY_SOURCE=2 -fstack-protector-strong --param=ssp-buffer-size=4 -fPIC -march=x86-64 -gdwarf-4 -fno-debug-types-section -fvar-tracking-assignments -g2 -I../../../../../Include -I../../../../../Samples/NiHandTracker -o x64-PLD/NiHandViewer.o ../../../../../Samples/NiHandTracker/NiHandViewer.cpp make[1]: Leaving directory '/tmp/B.jXlV1P/BUILD/OpenNI-OpenNI-1e9524f/Platform/Linux/Build/Samples/NiHandTracker' make[1]: Entering directory '/tmp/B.jXlV1P/BUILD/OpenNI-OpenNI-1e9524f/Platform/Linux/Build/Samples/NiUserTracker' x86_64-pld-linux-g++ -MD -MP -MT "./x64-PLD/main.d x64-PLD/main.o" -c -O2 -fwrapv -pipe -Wformat -Werror=format-security -gdwarf-4 -fno-debug-types-section -fvar-tracking-assignments -g2 -Wp,-D_FORTIFY_SOURCE=2 -fstack-protector-strong --param=ssp-buffer-size=4 -fPIC -march=x86-64 -gdwarf-4 -fno-debug-types-section -fvar-tracking-assignments -g2 -I../../../../../Include -o x64-PLD/main.o ../../../../../Samples/NiUserTracker/main.cpp make[1]: Leaving directory '/tmp/B.jXlV1P/BUILD/OpenNI-OpenNI-1e9524f/Platform/Linux/Build/Samples/NiUserTracker' make[1]: Entering directory '/tmp/B.jXlV1P/BUILD/OpenNI-OpenNI-1e9524f/Platform/Linux/Build/Samples/NiViewer' x86_64-pld-linux-g++ -MD -MP -MT "./x64-PLD/Capture.d x64-PLD/Capture.o" -c -O2 -fwrapv -pipe -Wformat -Werror=format-security -gdwarf-4 -fno-debug-types-section -fvar-tracking-assignments -g2 -Wp,-D_FORTIFY_SOURCE=2 -fstack-protector-strong --param=ssp-buffer-size=4 -fPIC -march=x86-64 -gdwarf-4 -fno-debug-types-section -fvar-tracking-assignments -g2 -I../../../../../Include -I../../../../../Samples/NiViewer -o x64-PLD/Capture.o ../../../../../Samples/NiViewer/Capture.cpp make[1]: Leaving directory '/tmp/B.jXlV1P/BUILD/OpenNI-OpenNI-1e9524f/Platform/Linux/Build/Samples/NiViewer' make[1]: Entering directory '/tmp/B.jXlV1P/BUILD/OpenNI-OpenNI-1e9524f/Platform/Linux/Build/Samples/NiUserTracker' x86_64-pld-linux-g++ -o ../../../Bin/x64-PLD/Sample-NiUserTracker ./x64-PLD/opengles.o ./x64-PLD/SceneDrawer.o ./x64-PLD/main.o -L../../../Bin/x64-PLD -lglut -lGL -lOpenNI make[1]: Leaving directory '/tmp/B.jXlV1P/BUILD/OpenNI-OpenNI-1e9524f/Platform/Linux/Build/Samples/NiUserTracker' make[1]: Entering directory '/tmp/B.jXlV1P/BUILD/OpenNI-OpenNI-1e9524f/Platform/Linux/Build/Samples/NiUserSelection' x86_64-pld-linux-g++ -MD -MP -MT "./x64-PLD/ExitPoseDetector.d x64-PLD/ExitPoseDetector.o" -c -O2 -fwrapv -pipe -Wformat -Werror=format-security -gdwarf-4 -fno-debug-types-section -fvar-tracking-assignments -g2 -Wp,-D_FORTIFY_SOURCE=2 -fstack-protector-strong --param=ssp-buffer-size=4 -fPIC -march=x86-64 -gdwarf-4 -fno-debug-types-section -fvar-tracking-assignments -g2 -I../../../../../Include -o x64-PLD/ExitPoseDetector.o ../../../../../Samples/NiUserSelection/ExitPoseDetector.cpp make[1]: Leaving directory '/tmp/B.jXlV1P/BUILD/OpenNI-OpenNI-1e9524f/Platform/Linux/Build/Samples/NiUserSelection' make[1]: Entering directory '/tmp/B.jXlV1P/BUILD/OpenNI-OpenNI-1e9524f/Platform/Linux/Build/Samples/NiViewer' x86_64-pld-linux-g++ -MD -MP -MT "./x64-PLD/Menu.d x64-PLD/Menu.o" -c -O2 -fwrapv -pipe -Wformat -Werror=format-security -gdwarf-4 -fno-debug-types-section -fvar-tracking-assignments -g2 -Wp,-D_FORTIFY_SOURCE=2 -fstack-protector-strong --param=ssp-buffer-size=4 -fPIC -march=x86-64 -gdwarf-4 -fno-debug-types-section -fvar-tracking-assignments -g2 -I../../../../../Include -I../../../../../Samples/NiViewer -o x64-PLD/Menu.o ../../../../../Samples/NiViewer/Menu.cpp make[1]: Leaving directory '/tmp/B.jXlV1P/BUILD/OpenNI-OpenNI-1e9524f/Platform/Linux/Build/Samples/NiViewer' make[1]: Entering directory '/tmp/B.jXlV1P/BUILD/OpenNI-OpenNI-1e9524f/Platform/Linux/Build/Samples/NiUserSelection' x86_64-pld-linux-g++ -MD -MP -MT "./x64-PLD/SampleManager.d x64-PLD/SampleManager.o" -c -O2 -fwrapv -pipe -Wformat -Werror=format-security -gdwarf-4 -fno-debug-types-section -fvar-tracking-assignments -g2 -Wp,-D_FORTIFY_SOURCE=2 -fstack-protector-strong --param=ssp-buffer-size=4 -fPIC -march=x86-64 -gdwarf-4 -fno-debug-types-section -fvar-tracking-assignments -g2 -I../../../../../Include -o x64-PLD/SampleManager.o ../../../../../Samples/NiUserSelection/SampleManager.cpp make[1]: Leaving directory '/tmp/B.jXlV1P/BUILD/OpenNI-OpenNI-1e9524f/Platform/Linux/Build/Samples/NiUserSelection' make[1]: Entering directory '/tmp/B.jXlV1P/BUILD/OpenNI-OpenNI-1e9524f/Platform/Linux/Build/Samples/NiHandTracker' x86_64-pld-linux-g++ -MD -MP -MT "./x64-PLD/NiHandTracker.d x64-PLD/NiHandTracker.o" -c -O2 -fwrapv -pipe -Wformat -Werror=format-security -gdwarf-4 -fno-debug-types-section -fvar-tracking-assignments -g2 -Wp,-D_FORTIFY_SOURCE=2 -fstack-protector-strong --param=ssp-buffer-size=4 -fPIC -march=x86-64 -gdwarf-4 -fno-debug-types-section -fvar-tracking-assignments -g2 -I../../../../../Include -I../../../../../Samples/NiHandTracker -o x64-PLD/NiHandTracker.o ../../../../../Samples/NiHandTracker/NiHandTracker.cpp make[1]: Leaving directory '/tmp/B.jXlV1P/BUILD/OpenNI-OpenNI-1e9524f/Platform/Linux/Build/Samples/NiHandTracker' make[1]: Entering directory '/tmp/B.jXlV1P/BUILD/OpenNI-OpenNI-1e9524f/Platform/Linux/Build/Samples/NiUserSelection' x86_64-pld-linux-g++ -MD -MP -MT "./x64-PLD/TrackingInitializer.d x64-PLD/TrackingInitializer.o" -c -O2 -fwrapv -pipe -Wformat -Werror=format-security -gdwarf-4 -fno-debug-types-section -fvar-tracking-assignments -g2 -Wp,-D_FORTIFY_SOURCE=2 -fstack-protector-strong --param=ssp-buffer-size=4 -fPIC -march=x86-64 -gdwarf-4 -fno-debug-types-section -fvar-tracking-assignments -g2 -I../../../../../Include -o x64-PLD/TrackingInitializer.o ../../../../../Samples/NiUserSelection/TrackingInitializer.cpp make[1]: Leaving directory '/tmp/B.jXlV1P/BUILD/OpenNI-OpenNI-1e9524f/Platform/Linux/Build/Samples/NiUserSelection' make[1]: Entering directory '/tmp/B.jXlV1P/BUILD/OpenNI-OpenNI-1e9524f/Platform/Linux/Build/Samples/NiHandTracker' x86_64-pld-linux-g++ -MD -MP -MT "./x64-PLD/main.d x64-PLD/main.o" -c -O2 -fwrapv -pipe -Wformat -Werror=format-security -gdwarf-4 -fno-debug-types-section -fvar-tracking-assignments -g2 -Wp,-D_FORTIFY_SOURCE=2 -fstack-protector-strong --param=ssp-buffer-size=4 -fPIC -march=x86-64 -gdwarf-4 -fno-debug-types-section -fvar-tracking-assignments -g2 -I../../../../../Include -I../../../../../Samples/NiHandTracker -o x64-PLD/main.o ../../../../../Samples/NiHandTracker/main.cpp make[1]: Leaving directory '/tmp/B.jXlV1P/BUILD/OpenNI-OpenNI-1e9524f/Platform/Linux/Build/Samples/NiHandTracker' make[1]: Entering directory '/tmp/B.jXlV1P/BUILD/OpenNI-OpenNI-1e9524f/Platform/Linux/Build/Samples/NiViewer' x86_64-pld-linux-g++ -MD -MP -MT "./x64-PLD/Device.d x64-PLD/Device.o" -c -O2 -fwrapv -pipe -Wformat -Werror=format-security -gdwarf-4 -fno-debug-types-section -fvar-tracking-assignments -g2 -Wp,-D_FORTIFY_SOURCE=2 -fstack-protector-strong --param=ssp-buffer-size=4 -fPIC -march=x86-64 -gdwarf-4 -fno-debug-types-section -fvar-tracking-assignments -g2 -I../../../../../Include -I../../../../../Samples/NiViewer -o x64-PLD/Device.o ../../../../../Samples/NiViewer/Device.cpp ../../../../../Samples/NiViewer/Device.cpp: In function 'XnStatus openDeviceFromXmlWithChoice(const char*, xn::EnumerationErrors&)': ../../../../../Samples/NiViewer/Device.cpp:251:7: warning: ignoring return value of 'int scanf(const char*, ...)', declared with attribute warn_unused_result [-Wunused-result] scanf("%d", &chosen); ~~~~~^~~~~~~~~~~~~~~ make[1]: Leaving directory '/tmp/B.jXlV1P/BUILD/OpenNI-OpenNI-1e9524f/Platform/Linux/Build/Samples/NiViewer' make[1]: Entering directory '/tmp/B.jXlV1P/BUILD/OpenNI-OpenNI-1e9524f/Platform/Linux/Build/Samples/NiViewer' x86_64-pld-linux-g++ -MD -MP -MT "./x64-PLD/NiViewer.d x64-PLD/NiViewer.o" -c -O2 -fwrapv -pipe -Wformat -Werror=format-security -gdwarf-4 -fno-debug-types-section -fvar-tracking-assignments -g2 -Wp,-D_FORTIFY_SOURCE=2 -fstack-protector-strong --param=ssp-buffer-size=4 -fPIC -march=x86-64 -gdwarf-4 -fno-debug-types-section -fvar-tracking-assignments -g2 -I../../../../../Include -I../../../../../Samples/NiViewer -o x64-PLD/NiViewer.o ../../../../../Samples/NiViewer/NiViewer.cpp In file included from ../../../../../Samples/NiViewer/glh/glh_obs.h:62:0, from ../../../../../Samples/NiViewer/NiViewer.cpp:62: /usr/include/c++/7.2.0/system_error:115:5: error: expected unqualified-id before 'int' equivalent(int __i, const error_condition& __cond) const noexcept; ^ /usr/include/c++/7.2.0/system_error:115:5: error: expected ')' before 'int' /usr/include/c++/7.2.0/system_error:115:5: error: expected ')' before 'int' /usr/include/c++/7.2.0/system_error:115:5: error: expected ')' before 'int' /usr/include/c++/7.2.0/system_error:118:5: error: expected unqualified-id before 'const' equivalent(const error_code& __code, int __i) const noexcept; ^ /usr/include/c++/7.2.0/system_error:118:5: error: expected ')' before 'const' /usr/include/c++/7.2.0/system_error:118:5: error: expected ')' before 'const' /usr/include/c++/7.2.0/system_error:118:5: error: expected ')' before 'const' /usr/include/c++/7.2.0/system_error: In function 'bool std::operator==(const std::error_code&, const std::error_condition&)': ../../../../../Samples/NiViewer/glh/glh_linear.h:80:33: error: expected unqualified-id before '(' token #define equivalent(a,b) (((a < b + GLH_EPSILON) && (a > b - GLH_EPSILON)) ? true : false) ^ ../../../../../Samples/NiViewer/glh/glh_linear.h:80:42: error: no match for 'operator+' (operand types are 'const std::error_condition' and 'float') #define equivalent(a,b) (((a < b + GLH_EPSILON) && (a > b - GLH_EPSILON)) ? true : false) ../../../../../Samples/NiViewer/glh/glh_linear.h:80:42: note: candidate: operator+(int, float) <built-in> ../../../../../Samples/NiViewer/glh/glh_linear.h:80:42: note: no known conversion for argument 1 from 'const std::error_condition' to 'int' In file included from /usr/include/c++/7.2.0/bits/stl_algobase.h:67:0, from /usr/include/c++/7.2.0/algorithm:61, from ../../../../../Samples/NiViewer/glh/glh_glut2.h:51, from ../../../../../Samples/NiViewer/NiViewer.cpp:63: /usr/include/c++/7.2.0/bits/stl_iterator.h:397:5: note: candidate: template<class _Iterator> std::reverse_iterator<_Iterator> std::operator+(typename std::reverse_iterator<_Iterator>::difference_type, const std::reverse_iterator<_Iterator>&) operator+(typename reverse_iterator<_Iterator>::difference_type __n, ^~~~~~~~ /usr/include/c++/7.2.0/bits/stl_iterator.h:397:5: note: template argument deduction/substitution failed: In file included from ../../../../../Samples/NiViewer/glh/glh_obs.h:62:0, from ../../../../../Samples/NiViewer/NiViewer.cpp:62: ../../../../../Samples/NiViewer/glh/glh_linear.h:77:47: note: mismatched types 'const std::reverse_iterator<_Iterator>' and 'float' #define GLH_EPSILON GLH_REAL(10e-6) ^ In file included from /usr/include/c++/7.2.0/bits/stl_algobase.h:67:0, from /usr/include/c++/7.2.0/algorithm:61, from ../../../../../Samples/NiViewer/glh/glh_glut2.h:51, from ../../../../../Samples/NiViewer/NiViewer.cpp:63: /usr/include/c++/7.2.0/bits/stl_iterator.h:1198:5: note: candidate: template<class _Iterator> std::move_iterator<_IteratorL> std::operator+(typename std::move_iterator<_IteratorL>::difference_type, const std::move_iterator<_IteratorL>&) operator+(typename move_iterator<_Iterator>::difference_type __n, ^~~~~~~~ /usr/include/c++/7.2.0/bits/stl_iterator.h:1198:5: note: template argument deduction/substitution failed: In file included from ../../../../../Samples/NiViewer/glh/glh_obs.h:62:0, from ../../../../../Samples/NiViewer/NiViewer.cpp:62: ../../../../../Samples/NiViewer/glh/glh_linear.h:77:47: note: mismatched types 'const std::move_iterator<_IteratorL>' and 'float' #define GLH_EPSILON GLH_REAL(10e-6) ^ In file included from /usr/include/c++/7.2.0/string:52:0, from /usr/include/c++/7.2.0/bits/locale_classes.h:40, from /usr/include/c++/7.2.0/bits/ios_base.h:41, from /usr/include/c++/7.2.0/ios:42, from /usr/include/c++/7.2.0/ostream:38, from /usr/include/c++/7.2.0/iostream:39, from ../../../../../Samples/NiViewer/glh/glh_convenience.h:52, from ../../../../../Samples/NiViewer/glh/glh_glut2.h:61, from ../../../../../Samples/NiViewer/NiViewer.cpp:63: /usr/include/c++/7.2.0/bits/basic_string.h:5686:5: note: candidate: template<class _CharT, class _Traits, class _Alloc> std::__cxx11::basic_string<_CharT, _Traits, _Alloc> std::operator+(const std::__cxx11::basic_string<_CharT, _Traits, _Alloc>&, const std::__cxx11::basic_string<_CharT, _Traits, _Alloc>&) operator+(const basic_string<_CharT, _Traits, _Alloc>& __lhs, ^~~~~~~~ /usr/include/c++/7.2.0/bits/basic_string.h:5686:5: note: template argument deduction/substitution failed: In file included from ../../../../../Samples/NiViewer/glh/glh_obs.h:62:0, from ../../../../../Samples/NiViewer/NiViewer.cpp:62: ../../../../../Samples/NiViewer/glh/glh_linear.h:77:47: note: 'const std::error_condition' is not derived from 'const std::__cxx11::basic_string<_CharT, _Traits, _Alloc>' #define GLH_EPSILON GLH_REAL(10e-6) ^ In file included from /usr/include/c++/7.2.0/string:53:0, from /usr/include/c++/7.2.0/bits/locale_classes.h:40, from /usr/include/c++/7.2.0/bits/ios_base.h:41, from /usr/include/c++/7.2.0/ios:42, from /usr/include/c++/7.2.0/ostream:38, from /usr/include/c++/7.2.0/iostream:39, from ../../../../../Samples/NiViewer/glh/glh_convenience.h:52, from ../../../../../Samples/NiViewer/glh/glh_glut2.h:61, from ../../../../../Samples/NiViewer/NiViewer.cpp:63: /usr/include/c++/7.2.0/bits/basic_string.tcc:1157:5: note: candidate: template<class _CharT, class _Traits, class _Alloc> std::__cxx11::basic_string<_CharT, _Traits, _Alloc> std::operator+(const _CharT*, const std::__cxx11::basic_string<_CharT, _Traits, _Alloc>&) operator+(const _CharT* __lhs, ^~~~~~~~ /usr/include/c++/7.2.0/bits/basic_string.tcc:1157:5: note: template argument deduction/substitution failed: In file included from ../../../../../Samples/NiViewer/glh/glh_obs.h:62:0, from ../../../../../Samples/NiViewer/NiViewer.cpp:62: ../../../../../Samples/NiViewer/glh/glh_linear.h:77:47: note: mismatched types 'const _CharT*' and 'std::error_condition' #define GLH_EPSILON GLH_REAL(10e-6) ^ In file included from /usr/include/c++/7.2.0/string:53:0, from /usr/include/c++/7.2.0/bits/locale_classes.h:40, from /usr/include/c++/7.2.0/bits/ios_base.h:41, from /usr/include/c++/7.2.0/ios:42, from /usr/include/c++/7.2.0/ostream:38, from /usr/include/c++/7.2.0/iostream:39, from ../../../../../Samples/NiViewer/glh/glh_convenience.h:52, from ../../../../../Samples/NiViewer/glh/glh_glut2.h:61, from ../../../../../Samples/NiViewer/NiViewer.cpp:63: /usr/include/c++/7.2.0/bits/basic_string.tcc:1173:5: note: candidate: template<class _CharT, class _Traits, class _Alloc> std::__cxx11::basic_string<_CharT, _Traits, _Alloc> std::operator+(_CharT, const std::__cxx11::basic_string<_CharT, _Traits, _Alloc>&) operator+(_CharT __lhs, const basic_string<_CharT, _Traits, _Alloc>& __rhs) ^~~~~~~~ /usr/include/c++/7.2.0/bits/basic_string.tcc:1173:5: note: template argument deduction/substitution failed: In file included from ../../../../../Samples/NiViewer/glh/glh_obs.h:62:0, from ../../../../../Samples/NiViewer/NiViewer.cpp:62: ../../../../../Samples/NiViewer/glh/glh_linear.h:77:47: note: mismatched types 'const std::__cxx11::basic_string<_CharT, _Traits, _Alloc>' and 'float' #define GLH_EPSILON GLH_REAL(10e-6) ^ In file included from /usr/include/c++/7.2.0/string:52:0, from /usr/include/c++/7.2.0/bits/locale_classes.h:40, from /usr/include/c++/7.2.0/bits/ios_base.h:41, from /usr/include/c++/7.2.0/ios:42, from /usr/include/c++/7.2.0/ostream:38, from /usr/include/c++/7.2.0/iostream:39, from ../../../../../Samples/NiViewer/glh/glh_convenience.h:52, from ../../../../../Samples/NiViewer/glh/glh_glut2.h:61, from ../../../../../Samples/NiViewer/NiViewer.cpp:63: /usr/include/c++/7.2.0/bits/basic_string.h:5723:5: note: candidate: template<class _CharT, class _Traits, class _Alloc> std::__cxx11::basic_string<_CharT, _Traits, _Alloc> std::operator+(const std::__cxx11::basic_string<_CharT, _Traits, _Alloc>&, const _CharT*) operator+(const basic_string<_CharT, _Traits, _Alloc>& __lhs, ^~~~~~~~ /usr/include/c++/7.2.0/bits/basic_string.h:5723:5: note: template argument deduction/substitution failed: In file included from ../../../../../Samples/NiViewer/glh/glh_obs.h:62:0, from ../../../../../Samples/NiViewer/NiViewer.cpp:62: ../../../../../Samples/NiViewer/glh/glh_linear.h:77:47: note: 'const std::error_condition' is not derived from 'const std::__cxx11::basic_string<_CharT, _Traits, _Alloc>' #define GLH_EPSILON GLH_REAL(10e-6) ^ In file included from /usr/include/c++/7.2.0/string:52:0, from /usr/include/c++/7.2.0/bits/locale_classes.h:40, from /usr/include/c++/7.2.0/bits/ios_base.h:41, from /usr/include/c++/7.2.0/ios:42, from /usr/include/c++/7.2.0/ostream:38, from /usr/include/c++/7.2.0/iostream:39, from ../../../../../Samples/NiViewer/glh/glh_convenience.h:52, from ../../../../../Samples/NiViewer/glh/glh_glut2.h:61, from ../../../../../Samples/NiViewer/NiViewer.cpp:63: /usr/include/c++/7.2.0/bits/basic_string.h:5739:5: note: candidate: template<class _CharT, class _Traits, class _Alloc> std::__cxx11::basic_string<_CharT, _Traits, _Alloc> std::operator+(const std::__cxx11::basic_string<_CharT, _Traits, _Alloc>&, _CharT) operator+(const basic_string<_CharT, _Traits, _Alloc>& __lhs, _CharT __rhs) ^~~~~~~~ /usr/include/c++/7.2.0/bits/basic_string.h:5739:5: note: template argument deduction/substitution failed: In file included from ../../../../../Samples/NiViewer/glh/glh_obs.h:62:0, from ../../../../../Samples/NiViewer/NiViewer.cpp:62: ../../../../../Samples/NiViewer/glh/glh_linear.h:77:47: note: 'const std::error_condition' is not derived from 'const std::__cxx11::basic_string<_CharT, _Traits, _Alloc>' #define GLH_EPSILON GLH_REAL(10e-6) ^ In file included from /usr/include/c++/7.2.0/string:52:0, from /usr/include/c++/7.2.0/bits/locale_classes.h:40, from /usr/include/c++/7.2.0/bits/ios_base.h:41, from /usr/include/c++/7.2.0/ios:42, from /usr/include/c++/7.2.0/ostream:38, from /usr/include/c++/7.2.0/iostream:39, from ../../../../../Samples/NiViewer/glh/glh_convenience.h:52, from ../../../../../Samples/NiViewer/glh/glh_glut2.h:61, from ../../../../../Samples/NiViewer/NiViewer.cpp:63: /usr/include/c++/7.2.0/bits/basic_string.h:5751:5: note: candidate: template<class _CharT, class _Traits, class _Alloc> std::__cxx11::basic_string<_CharT, _Traits, _Alloc> std::operator+(std::__cxx11::basic_string<_CharT, _Traits, _Alloc>&&, const std::__cxx11::basic_string<_CharT, _Traits, _Alloc>&) operator+(basic_string<_CharT, _Traits, _Alloc>&& __lhs, ^~~~~~~~ /usr/include/c++/7.2.0/bits/basic_string.h:5751:5: note: template argument deduction/substitution failed: In file included from ../../../../../Samples/NiViewer/glh/glh_obs.h:62:0, from ../../../../../Samples/NiViewer/NiViewer.cpp:62: ../../../../../Samples/NiViewer/glh/glh_linear.h:77:47: note: types 'std::__cxx11::basic_string<_CharT, _Traits, _Alloc>' and 'const std::error_condition' have incompatible cv-qualifiers #define GLH_EPSILON GLH_REAL(10e-6) ^ In file included from /usr/include/c++/7.2.0/string:52:0, from /usr/include/c++/7.2.0/bits/locale_classes.h:40, from /usr/include/c++/7.2.0/bits/ios_base.h:41, from /usr/include/c++/7.2.0/ios:42, from /usr/include/c++/7.2.0/ostream:38, from /usr/include/c++/7.2.0/iostream:39, from ../../../../../Samples/NiViewer/glh/glh_convenience.h:52, from ../../../../../Samples/NiViewer/glh/glh_glut2.h:61, from ../../../../../Samples/NiViewer/NiViewer.cpp:63: /usr/include/c++/7.2.0/bits/basic_string.h:5757:5: note: candidate: template<class _CharT, class _Traits, class _Alloc> std::__cxx11::basic_string<_CharT, _Traits, _Alloc> std::operator+(const std::__cxx11::basic_string<_CharT, _Traits, _Alloc>&, std::__cxx11::basic_string<_CharT, _Traits, _Alloc>&&) operator+(const basic_string<_CharT, _Traits, _Alloc>& __lhs, ^~~~~~~~ /usr/include/c++/7.2.0/bits/basic_string.h:5757:5: note: template argument deduction/substitution failed: In file included from ../../../../../Samples/NiViewer/glh/glh_obs.h:62:0, from ../../../../../Samples/NiViewer/NiViewer.cpp:62: ../../../../../Samples/NiViewer/glh/glh_linear.h:77:47: note: 'const std::error_condition' is not derived from 'const std::__cxx11::basic_string<_CharT, _Traits, _Alloc>' #define GLH_EPSILON GLH_REAL(10e-6) ^ In file included from /usr/include/c++/7.2.0/string:52:0, from /usr/include/c++/7.2.0/bits/locale_classes.h:40, from /usr/include/c++/7.2.0/bits/ios_base.h:41, from /usr/include/c++/7.2.0/ios:42, from /usr/include/c++/7.2.0/ostream:38, from /usr/include/c++/7.2.0/iostream:39, from ../../../../../Samples/NiViewer/glh/glh_convenience.h:52, from ../../../../../Samples/NiViewer/glh/glh_glut2.h:61, from ../../../../../Samples/NiViewer/NiViewer.cpp:63: /usr/include/c++/7.2.0/bits/basic_string.h:5763:5: note: candidate: template<class _CharT, class _Traits, class _Alloc> std::__cxx11::basic_string<_CharT, _Traits, _Alloc> std::operator+(std::__cxx11::basic_string<_CharT, _Traits, _Alloc>&&, std::__cxx11::basic_string<_CharT, _Traits, _Alloc>&&) operator+(basic_string<_CharT, _Traits, _Alloc>&& __lhs, ^~~~~~~~ /usr/include/c++/7.2.0/bits/basic_string.h:5763:5: note: template argument deduction/substitution failed: In file included from ../../../../../Samples/NiViewer/glh/glh_obs.h:62:0, from ../../../../../Samples/NiViewer/NiViewer.cpp:62: ../../../../../Samples/NiViewer/glh/glh_linear.h:77:47: note: types 'std::__cxx11::basic_string<_CharT, _Traits, _Alloc>' and 'const std::error_condition' have incompatible cv-qualifiers #define GLH_EPSILON GLH_REAL(10e-6) ^ In file included from /usr/include/c++/7.2.0/string:52:0, from /usr/include/c++/7.2.0/bits/locale_classes.h:40, from /usr/include/c++/7.2.0/bits/ios_base.h:41, from /usr/include/c++/7.2.0/ios:42, from /usr/include/c++/7.2.0/ostream:38, from /usr/include/c++/7.2.0/iostream:39, from ../../../../../Samples/NiViewer/glh/glh_convenience.h:52, from ../../../../../Samples/NiViewer/glh/glh_glut2.h:61, from ../../../../../Samples/NiViewer/NiViewer.cpp:63: /usr/include/c++/7.2.0/bits/basic_string.h:5775:5: note: candidate: template<class _CharT, class _Traits, class _Alloc> std::__cxx11::basic_string<_CharT, _Traits, _Alloc> std::operator+(const _CharT*, std::__cxx11::basic_string<_CharT, _Traits, _Alloc>&&) operator+(const _CharT* __lhs, ^~~~~~~~ /usr/include/c++/7.2.0/bits/basic_string.h:5775:5: note: template argument deduction/substitution failed: In file included from ../../../../../Samples/NiViewer/glh/glh_obs.h:62:0, from ../../../../../Samples/NiViewer/NiViewer.cpp:62: ../../../../../Samples/NiViewer/glh/glh_linear.h:77:47: note: mismatched types 'const _CharT*' and 'std::error_condition' #define GLH_EPSILON GLH_REAL(10e-6) ^ In file included from /usr/include/c++/7.2.0/string:52:0, from /usr/include/c++/7.2.0/bits/locale_classes.h:40, from /usr/include/c++/7.2.0/bits/ios_base.h:41, from /usr/include/c++/7.2.0/ios:42, from /usr/include/c++/7.2.0/ostream:38, from /usr/include/c++/7.2.0/iostream:39, from ../../../../../Samples/NiViewer/glh/glh_convenience.h:52, from ../../../../../Samples/NiViewer/glh/glh_glut2.h:61, from ../../../../../Samples/NiViewer/NiViewer.cpp:63: /usr/include/c++/7.2.0/bits/basic_string.h:5781:5: note: candidate: template<class _CharT, class _Traits, class _Alloc> std::__cxx11::basic_string<_CharT, _Traits, _Alloc> std::operator+(_CharT, std::__cxx11::basic_string<_CharT, _Traits, _Alloc>&&) operator+(_CharT __lhs, ^~~~~~~~ /usr/include/c++/7.2.0/bits/basic_string.h:5781:5: note: template argument deduction/substitution failed: In file included from ../../../../../Samples/NiViewer/glh/glh_obs.h:62:0, from ../../../../../Samples/NiViewer/NiViewer.cpp:62: ../../../../../Samples/NiViewer/glh/glh_linear.h:77:47: note: mismatched types 'std::__cxx11::basic_string<_CharT, _Traits, _Alloc>' and 'float' #define GLH_EPSILON GLH_REAL(10e-6) ^ In file included from /usr/include/c++/7.2.0/string:52:0, from /usr/include/c++/7.2.0/bits/locale_classes.h:40, from /usr/include/c++/7.2.0/bits/ios_base.h:41, from /usr/include/c++/7.2.0/ios:42, from /usr/include/c++/7.2.0/ostream:38, from /usr/include/c++/7.2.0/iostream:39, from ../../../../../Samples/NiViewer/glh/glh_convenience.h:52, from ../../../../../Samples/NiViewer/glh/glh_glut2.h:61, from ../../../../../Samples/NiViewer/NiViewer.cpp:63: /usr/include/c++/7.2.0/bits/basic_string.h:5787:5: note: candidate: template<class _CharT, class _Traits, class _Alloc> std::__cxx11::basic_string<_CharT, _Traits, _Alloc> std::operator+(std::__cxx11::basic_string<_CharT, _Traits, _Alloc>&&, const _CharT*) operator+(basic_string<_CharT, _Traits, _Alloc>&& __lhs, ^~~~~~~~ /usr/include/c++/7.2.0/bits/basic_string.h:5787:5: note: template argument deduction/substitution failed: In file included from ../../../../../Samples/NiViewer/glh/glh_obs.h:62:0, from ../../../../../Samples/NiViewer/NiViewer.cpp:62: ../../../../../Samples/NiViewer/glh/glh_linear.h:77:47: note: types 'std::__cxx11::basic_string<_CharT, _Traits, _Alloc>' and 'const std::error_condition' have incompatible cv-qualifiers #define GLH_EPSILON GLH_REAL(10e-6) ^ In file included from /usr/include/c++/7.2.0/string:52:0, from /usr/include/c++/7.2.0/bits/locale_classes.h:40, from /usr/include/c++/7.2.0/bits/ios_base.h:41, from /usr/include/c++/7.2.0/ios:42, from /usr/include/c++/7.2.0/ostream:38, from /usr/include/c++/7.2.0/iostream:39, from ../../../../../Samples/NiViewer/glh/glh_convenience.h:52, from ../../../../../Samples/NiViewer/glh/glh_glut2.h:61, from ../../../../../Samples/NiViewer/NiViewer.cpp:63: /usr/include/c++/7.2.0/bits/basic_string.h:5793:5: note: candidate: template<class _CharT, class _Traits, class _Alloc> std::__cxx11::basic_string<_CharT, _Traits, _Alloc> std::operator+(std::__cxx11::basic_string<_CharT, _Traits, _Alloc>&&, _CharT) operator+(basic_string<_CharT, _Traits, _Alloc>&& __lhs, ^~~~~~~~ /usr/include/c++/7.2.0/bits/basic_string.h:5793:5: note: template argument deduction/substitution failed: In file included from ../../../../../Samples/NiViewer/glh/glh_obs.h:62:0, from ../../../../../Samples/NiViewer/NiViewer.cpp:62: ../../../../../Samples/NiViewer/glh/glh_linear.h:77:47: note: types 'std::__cxx11::basic_string<_CharT, _Traits, _Alloc>' and 'const std::error_condition' have incompatible cv-qualifiers #define GLH_EPSILON GLH_REAL(10e-6) ^ ../../../../../Samples/NiViewer/glh/glh_linear.h:80:67: error: no match for 'operator-' (operand types are 'const std::error_condition' and 'float') #define equivalent(a,b) (((a < b + GLH_EPSILON) && (a > b - GLH_EPSILON)) ? true : false) ../../../../../Samples/NiViewer/glh/glh_linear.h:80:67: note: candidate: operator-(int, float) <built-in> ../../../../../Samples/NiViewer/glh/glh_linear.h:80:67: note: no known conversion for argument 1 from 'const std::error_condition' to 'int' In file included from /usr/include/c++/7.2.0/bits/stl_algobase.h:67:0, from /usr/include/c++/7.2.0/algorithm:61, from ../../../../../Samples/NiViewer/glh/glh_glut2.h:51, from ../../../../../Samples/NiViewer/NiViewer.cpp:63: /usr/include/c++/7.2.0/bits/stl_iterator.h:389:5: note: candidate: template<class _IteratorL, class _IteratorR> decltype ((__y.base() - __x.base())) std::operator-(const std::reverse_iterator<_Iterator>&, const std::reverse_iterator<_IteratorR>&) operator-(const reverse_iterator<_IteratorL>& __x, ^~~~~~~~ /usr/include/c++/7.2.0/bits/stl_iterator.h:389:5: note: template argument deduction/substitution failed: In file included from ../../../../../Samples/NiViewer/glh/glh_obs.h:62:0, from ../../../../../Samples/NiViewer/NiViewer.cpp:62: ../../../../../Samples/NiViewer/glh/glh_linear.h:77:47: note: 'const std::error_condition' is not derived from 'const std::reverse_iterator<_Iterator>' #define GLH_EPSILON GLH_REAL(10e-6) ^ In file included from /usr/include/c++/7.2.0/bits/stl_algobase.h:67:0, from /usr/include/c++/7.2.0/algorithm:61, from ../../../../../Samples/NiViewer/glh/glh_glut2.h:51, from ../../../../../Samples/NiViewer/NiViewer.cpp:63: /usr/include/c++/7.2.0/bits/stl_iterator.h:1191:5: note: candidate: template<class _IteratorL, class _IteratorR> decltype ((__x.base() - __y.base())) std::operator-(const std::move_iterator<_IteratorL>&, const std::move_iterator<_IteratorR>&) operator-(const move_iterator<_IteratorL>& __x, ^~~~~~~~ /usr/include/c++/7.2.0/bits/stl_iterator.h:1191:5: note: template argument deduction/substitution failed: In file included from ../../../../../Samples/NiViewer/glh/glh_obs.h:62:0, from ../../../../../Samples/NiViewer/NiViewer.cpp:62: ../../../../../Samples/NiViewer/glh/glh_linear.h:77:47: note: 'const std::error_condition' is not derived from 'const std::move_iterator<_IteratorL>' #define GLH_EPSILON GLH_REAL(10e-6) ^ ../../../../../Samples/NiViewer/glh/glh_linear.h:80:33: error: expected unqualified-id before '(' token #define equivalent(a,b) (((a < b + GLH_EPSILON) && (a > b - GLH_EPSILON)) ? true : false) ^ ../../../../../Samples/NiViewer/glh/glh_linear.h:80:38: error: no match for 'operator<' (operand types are 'const std::error_code' and 'float') #define equivalent(a,b) (((a < b + GLH_EPSILON) && (a > b - GLH_EPSILON)) ? true : false) ../../../../../Samples/NiViewer/glh/glh_linear.h:80:38: note: candidate: operator<(int, float) <built-in> ../../../../../Samples/NiViewer/glh/glh_linear.h:80:38: note: no known conversion for argument 1 from 'const std::error_code' to 'int' In file included from /usr/include/c++/7.2.0/utility:70:0, from /usr/include/c++/7.2.0/algorithm:60, from ../../../../../Samples/NiViewer/glh/glh_glut2.h:51, from ../../../../../Samples/NiViewer/NiViewer.cpp:63: /usr/include/c++/7.2.0/bits/stl_pair.h:449:5: note: candidate: template<class _T1, class _T2> constexpr bool std::operator<(const std::pair<_T1, _T2>&, const std::pair<_T1, _T2>&) operator<(const pair<_T1, _T2>& __x, const pair<_T1, _T2>& __y) ^~~~~~~~ /usr/include/c++/7.2.0/bits/stl_pair.h:449:5: note: template argument deduction/substitution failed: In file included from ../../../../../Samples/NiViewer/glh/glh_obs.h:62:0, from ../../../../../Samples/NiViewer/NiViewer.cpp:62: ../../../../../Samples/NiViewer/glh/glh_linear.h:77:47: note: 'const std::error_code' is not derived from 'const std::pair<_T1, _T2>' #define GLH_EPSILON GLH_REAL(10e-6) ^ In file included from /usr/include/c++/7.2.0/bits/stl_algobase.h:67:0, from /usr/include/c++/7.2.0/algorithm:61, from ../../../../../Samples/NiViewer/glh/glh_glut2.h:51, from ../../../../../Samples/NiViewer/NiViewer.cpp:63: /usr/include/c++/7.2.0/bits/stl_iterator.h:305:5: note: candidate: template<class _Iterator> bool std::operator<(const std::reverse_iterator<_Iterator>&, const std::reverse_iterator<_Iterator>&) operator<(const reverse_iterator<_Iterator>& __x, ^~~~~~~~ /usr/include/c++/7.2.0/bits/stl_iterator.h:305:5: note: template argument deduction/substitution failed: In file included from ../../../../../Samples/NiViewer/glh/glh_obs.h:62:0, from ../../../../../Samples/NiViewer/NiViewer.cpp:62: ../../../../../Samples/NiViewer/glh/glh_linear.h:77:47: note: 'const std::error_code' is not derived from 'const std::reverse_iterator<_Iterator>' #define GLH_EPSILON GLH_REAL(10e-6) ^ In file included from /usr/include/c++/7.2.0/bits/stl_algobase.h:67:0, from /usr/include/c++/7.2.0/algorithm:61, from ../../../../../Samples/NiViewer/glh/glh_glut2.h:51, from ../../../../../Samples/NiViewer/NiViewer.cpp:63: /usr/include/c++/7.2.0/bits/stl_iterator.h:343:5: note: candidate: template<class _IteratorL, class _IteratorR> bool std::operator<(const std::reverse_iterator<_Iterator>&, const std::reverse_iterator<_IteratorR>&) operator<(const reverse_iterator<_IteratorL>& __x, ^~~~~~~~ /usr/include/c++/7.2.0/bits/stl_iterator.h:343:5: note: template argument deduction/substitution failed: In file included from ../../../../../Samples/NiViewer/glh/glh_obs.h:62:0, from ../../../../../Samples/NiViewer/NiViewer.cpp:62: ../../../../../Samples/NiViewer/glh/glh_linear.h:77:47: note: 'const std::error_code' is not derived from 'const std::reverse_iterator<_Iterator>' #define GLH_EPSILON GLH_REAL(10e-6) ^ In file included from /usr/include/c++/7.2.0/bits/stl_algobase.h:67:0, from /usr/include/c++/7.2.0/algorithm:61, from ../../../../../Samples/NiViewer/glh/glh_glut2.h:51, from ../../../../../Samples/NiViewer/NiViewer.cpp:63: /usr/include/c++/7.2.0/bits/stl_iterator.h:1142:5: note: candidate: template<class _IteratorL, class _IteratorR> bool std::operator<(const std::move_iterator<_IteratorL>&, const std::move_iterator<_IteratorR>&) operator<(const move_iterator<_IteratorL>& __x, ^~~~~~~~ /usr/include/c++/7.2.0/bits/stl_iterator.h:1142:5: note: template argument deduction/substitution failed: In file included from ../../../../../Samples/NiViewer/glh/glh_obs.h:62:0, from ../../../../../Samples/NiViewer/NiViewer.cpp:62: ../../../../../Samples/NiViewer/glh/glh_linear.h:77:47: note: 'const std::error_code' is not derived from 'const std::move_iterator<_IteratorL>' #define GLH_EPSILON GLH_REAL(10e-6) ^ In file included from /usr/include/c++/7.2.0/bits/stl_algobase.h:67:0, from /usr/include/c++/7.2.0/algorithm:61, from ../../../../../Samples/NiViewer/glh/glh_glut2.h:51, from ../../../../../Samples/NiViewer/NiViewer.cpp:63: /usr/include/c++/7.2.0/bits/stl_iterator.h:1148:5: note: candidate: template<class _Iterator> bool std::operator<(const std::move_iterator<_IteratorL>&, const std::move_iterator<_IteratorL>&) operator<(const move_iterator<_Iterator>& __x, ^~~~~~~~ /usr/include/c++/7.2.0/bits/stl_iterator.h:1148:5: note: template argument deduction/substitution failed: In file included from ../../../../../Samples/NiViewer/glh/glh_obs.h:62:0, from ../../../../../Samples/NiViewer/NiViewer.cpp:62: ../../../../../Samples/NiViewer/glh/glh_linear.h:77:47: note: 'const std::error_code' is not derived from 'const std::move_iterator<_IteratorL>' #define GLH_EPSILON GLH_REAL(10e-6) ^ In file included from /usr/include/c++/7.2.0/list:63:0, from ../../../../../Samples/NiViewer/glh/glh_glut2.h:52, from ../../../../../Samples/NiViewer/NiViewer.cpp:63: /usr/include/c++/7.2.0/bits/stl_list.h:1918:5: note: candidate: template<class _Tp, class _Alloc> bool std::operator<(const std::__cxx11::list<_Tp, _Alloc>&, const std::__cxx11::list<_Tp, _Alloc>&) operator<(const list<_Tp, _Alloc>& __x, const list<_Tp, _Alloc>& __y) ^~~~~~~~ /usr/include/c++/7.2.0/bits/stl_list.h:1918:5: note: template argument deduction/substitution failed: In file included from ../../../../../Samples/NiViewer/glh/glh_obs.h:62:0, from ../../../../../Samples/NiViewer/NiViewer.cpp:62: ../../../../../Samples/NiViewer/glh/glh_linear.h:77:47: note: 'const std::error_code' is not derived from 'const std::__cxx11::list<_Tp, _Alloc>' #define GLH_EPSILON GLH_REAL(10e-6) ^ In file included from /usr/include/c++/7.2.0/string:52:0, from /usr/include/c++/7.2.0/bits/locale_classes.h:40, from /usr/include/c++/7.2.0/bits/ios_base.h:41, from /usr/include/c++/7.2.0/ios:42, from /usr/include/c++/7.2.0/ostream:38, from /usr/include/c++/7.2.0/iostream:39, from ../../../../../Samples/NiViewer/glh/glh_convenience.h:52, from ../../../../../Samples/NiViewer/glh/glh_glut2.h:61, from ../../../../../Samples/NiViewer/NiViewer.cpp:63: /usr/include/c++/7.2.0/bits/basic_string.h:5892:5: note: candidate: template<class _CharT, class _Traits, class _Alloc> bool std::operator<(const std::__cxx11::basic_string<_CharT, _Traits, _Alloc>&, const std::__cxx11::basic_string<_CharT, _Traits, _Alloc>&) operator<(const basic_string<_CharT, _Traits, _Alloc>& __lhs, ^~~~~~~~ /usr/include/c++/7.2.0/bits/basic_string.h:5892:5: note: template argument deduction/substitution failed: In file included from ../../../../../Samples/NiViewer/glh/glh_obs.h:62:0, from ../../../../../Samples/NiViewer/NiViewer.cpp:62: ../../../../../Samples/NiViewer/glh/glh_linear.h:77:47: note: 'const std::error_code' is not derived from 'const std::__cxx11::basic_string<_CharT, _Traits, _Alloc>' #define GLH_EPSILON GLH_REAL(10e-6) ^ In file included from /usr/include/c++/7.2.0/string:52:0, from /usr/include/c++/7.2.0/bits/locale_classes.h:40, from /usr/include/c++/7.2.0/bits/ios_base.h:41, from /usr/include/c++/7.2.0/ios:42, from /usr/include/c++/7.2.0/ostream:38, from /usr/include/c++/7.2.0/iostream:39, from ../../../../../Samples/NiViewer/glh/glh_convenience.h:52, from ../../../../../Samples/NiViewer/glh/glh_glut2.h:61, from ../../../../../Samples/NiViewer/NiViewer.cpp:63: /usr/include/c++/7.2.0/bits/basic_string.h:5905:5: note: candidate: template<class _CharT, class _Traits, class _Alloc> bool std::operator<(const std::__cxx11::basic_string<_CharT, _Traits, _Alloc>&, const _CharT*) operator<(const basic_string<_CharT, _Traits, _Alloc>& __lhs, ^~~~~~~~ /usr/include/c++/7.2.0/bits/basic_string.h:5905:5: note: template argument deduction/substitution failed: In file included from ../../../../../Samples/NiViewer/glh/glh_obs.h:62:0, from ../../../../../Samples/NiViewer/NiViewer.cpp:62: ../../../../../Samples/NiViewer/glh/glh_linear.h:77:47: note: 'const std::error_code' is not derived from 'const std::__cxx11::basic_string<_CharT, _Traits, _Alloc>' #define GLH_EPSILON GLH_REAL(10e-6) ^ In file included from /usr/include/c++/7.2.0/string:52:0, from /usr/include/c++/7.2.0/bits/locale_classes.h:40, from /usr/include/c++/7.2.0/bits/ios_base.h:41, from /usr/include/c++/7.2.0/ios:42, from /usr/include/c++/7.2.0/ostream:38, from /usr/include/c++/7.2.0/iostream:39, from ../../../../../Samples/NiViewer/glh/glh_convenience.h:52, from ../../../../../Samples/NiViewer/glh/glh_glut2.h:61, from ../../../../../Samples/NiViewer/NiViewer.cpp:63: /usr/include/c++/7.2.0/bits/basic_string.h:5917:5: note: candidate: template<class _CharT, class _Traits, class _Alloc> bool std::operator<(const _CharT*, const std::__cxx11::basic_string<_CharT, _Traits, _Alloc>&) operator<(const _CharT* __lhs, ^~~~~~~~ /usr/include/c++/7.2.0/bits/basic_string.h:5917:5: note: template argument deduction/substitution failed: In file included from ../../../../../Samples/NiViewer/glh/glh_obs.h:62:0, from ../../../../../Samples/NiViewer/NiViewer.cpp:62: ../../../../../Samples/NiViewer/glh/glh_linear.h:77:47: note: mismatched types 'const _CharT*' and 'std::error_code' #define GLH_EPSILON GLH_REAL(10e-6) ^ In file included from /usr/include/c++/7.2.0/bits/ios_base.h:46:0, from /usr/include/c++/7.2.0/ios:42, from /usr/include/c++/7.2.0/ostream:38, from /usr/include/c++/7.2.0/iostream:39, from ../../../../../Samples/NiViewer/glh/glh_convenience.h:52, from ../../../../../Samples/NiViewer/glh/glh_glut2.h:61, from ../../../../../Samples/NiViewer/NiViewer.cpp:63: /usr/include/c++/7.2.0/system_error:208:3: note: candidate: bool std::operator<(const std::error_code&, const std::error_code&) operator<(const error_code& __lhs, const error_code& __rhs) noexcept ^~~~~~~~ /usr/include/c++/7.2.0/system_error:208:3: note: no known conversion for argument 2 from 'float' to 'const std::error_code&' /usr/include/c++/7.2.0/system_error:282:3: note: candidate: bool std::operator<(const std::error_condition&, const std::error_condition&) operator<(const error_condition& __lhs, ^~~~~~~~ /usr/include/c++/7.2.0/system_error:282:3: note: no known conversion for argument 1 from 'const std::error_code' to 'const std::error_condition&' In file included from ../../../../../Samples/NiViewer/glh/glh_obs.h:62:0, from ../../../../../Samples/NiViewer/NiViewer.cpp:62: ../../../../../Samples/NiViewer/glh/glh_linear.h:80:63: error: no match for 'operator>' (operand types are 'const std::error_code' and 'float') #define equivalent(a,b) (((a < b + GLH_EPSILON) && (a > b - GLH_EPSILON)) ? true : false) ../../../../../Samples/NiViewer/glh/glh_linear.h:80:63: note: candidate: operator>(int, float) <built-in> ../../../../../Samples/NiViewer/glh/glh_linear.h:80:63: note: no known conversion for argument 1 from 'const std::error_code' to 'int' In file included from /usr/include/c++/7.2.0/utility:70:0, from /usr/include/c++/7.2.0/algorithm:60, from ../../../../../Samples/NiViewer/glh/glh_glut2.h:51, from ../../../../../Samples/NiViewer/NiViewer.cpp:63: /usr/include/c++/7.2.0/bits/stl_pair.h:462:5: note: candidate: template<class _T1, class _T2> constexpr bool std::operator>(const std::pair<_T1, _T2>&, const std::pair<_T1, _T2>&) operator>(const pair<_T1, _T2>& __x, const pair<_T1, _T2>& __y) ^~~~~~~~ /usr/include/c++/7.2.0/bits/stl_pair.h:462:5: note: template argument deduction/substitution failed: In file included from ../../../../../Samples/NiViewer/glh/glh_obs.h:62:0, from ../../../../../Samples/NiViewer/NiViewer.cpp:62: ../../../../../Samples/NiViewer/glh/glh_linear.h:77:47: note: 'const std::error_code' is not derived from 'const std::pair<_T1, _T2>' #define GLH_EPSILON GLH_REAL(10e-6) ^ In file included from /usr/include/c++/7.2.0/bits/stl_algobase.h:67:0, from /usr/include/c++/7.2.0/algorithm:61, from ../../../../../Samples/NiViewer/glh/glh_glut2.h:51, from ../../../../../Samples/NiViewer/NiViewer.cpp:63: /usr/include/c++/7.2.0/bits/stl_iterator.h:317:5: note: candidate: template<class _Iterator> bool std::operator>(const std::reverse_iterator<_Iterator>&, const std::reverse_iterator<_Iterator>&) operator>(const reverse_iterator<_Iterator>& __x, ^~~~~~~~ /usr/include/c++/7.2.0/bits/stl_iterator.h:317:5: note: template argument deduction/substitution failed: In file included from ../../../../../Samples/NiViewer/glh/glh_obs.h:62:0, from ../../../../../Samples/NiViewer/NiViewer.cpp:62: ../../../../../Samples/NiViewer/glh/glh_linear.h:77:47: note: 'const std::error_code' is not derived from 'const std::reverse_iterator<_Iterator>' #define GLH_EPSILON GLH_REAL(10e-6) ^ In file included from /usr/include/c++/7.2.0/bits/stl_algobase.h:67:0, from /usr/include/c++/7.2.0/algorithm:61, from ../../../../../Samples/NiViewer/glh/glh_glut2.h:51, from ../../../../../Samples/NiViewer/NiViewer.cpp:63: /usr/include/c++/7.2.0/bits/stl_iterator.h:355:5: note: candidate: template<class _IteratorL, class _IteratorR> bool std::operator>(const std::reverse_iterator<_Iterator>&, const std::reverse_iterator<_IteratorR>&) operator>(const reverse_iterator<_IteratorL>& __x, ^~~~~~~~ /usr/include/c++/7.2.0/bits/stl_iterator.h:355:5: note: template argument deduction/substitution failed: In file included from ../../../../../Samples/NiViewer/glh/glh_obs.h:62:0, from ../../../../../Samples/NiViewer/NiViewer.cpp:62: ../../../../../Samples/NiViewer/glh/glh_linear.h:77:47: note: 'const std::error_code' is not derived from 'const std::reverse_iterator<_Iterator>' #define GLH_EPSILON GLH_REAL(10e-6) ^ In file included from /usr/include/c++/7.2.0/bits/stl_algobase.h:67:0, from /usr/include/c++/7.2.0/algorithm:61, from ../../../../../Samples/NiViewer/glh/glh_glut2.h:51, from ../../../../../Samples/NiViewer/NiViewer.cpp:63: /usr/include/c++/7.2.0/bits/stl_iterator.h:1166:5: note: candidate: template<class _IteratorL, class _IteratorR> bool std::operator>(const std::move_iterator<_IteratorL>&, const std::move_iterator<_IteratorR>&) operator>(const move_iterator<_IteratorL>& __x, ^~~~~~~~ /usr/include/c++/7.2.0/bits/stl_iterator.h:1166:5: note: template argument deduction/substitution failed: In file included from ../../../../../Samples/NiViewer/glh/glh_obs.h:62:0, from ../../../../../Samples/NiViewer/NiViewer.cpp:62: ../../../../../Samples/NiViewer/glh/glh_linear.h:77:47: note: 'const std::error_code' is not derived from 'const std::move_iterator<_IteratorL>' #define GLH_EPSILON GLH_REAL(10e-6) ^ In file included from /usr/include/c++/7.2.0/bits/stl_algobase.h:67:0, from /usr/include/c++/7.2.0/algorithm:61, from ../../../../../Samples/NiViewer/glh/glh_glut2.h:51, from ../../../../../Samples/NiViewer/NiViewer.cpp:63: /usr/include/c++/7.2.0/bits/stl_iterator.h:1172:5: note: candidate: template<class _Iterator> bool std::operator>(const std::move_iterator<_IteratorL>&, const std::move_iterator<_IteratorL>&) operator>(const move_iterator<_Iterator>& __x, ^~~~~~~~ /usr/include/c++/7.2.0/bits/stl_iterator.h:1172:5: note: template argument deduction/substitution failed: In file included from ../../../../../Samples/NiViewer/glh/glh_obs.h:62:0, from ../../../../../Samples/NiViewer/NiViewer.cpp:62: ../../../../../Samples/NiViewer/glh/glh_linear.h:77:47: note: 'const std::error_code' is not derived from 'const std::move_iterator<_IteratorL>' #define GLH_EPSILON GLH_REAL(10e-6) ^ In file included from /usr/include/c++/7.2.0/list:63:0, from ../../../../../Samples/NiViewer/glh/glh_glut2.h:52, from ../../../../../Samples/NiViewer/NiViewer.cpp:63: /usr/include/c++/7.2.0/bits/stl_list.h:1931:5: note: candidate: template<class _Tp, class _Alloc> bool std::operator>(const std::__cxx11::list<_Tp, _Alloc>&, const std::__cxx11::list<_Tp, _Alloc>&) operator>(const list<_Tp, _Alloc>& __x, const list<_Tp, _Alloc>& __y) ^~~~~~~~ /usr/include/c++/7.2.0/bits/stl_list.h:1931:5: note: template argument deduction/substitution failed: In file included from ../../../../../Samples/NiViewer/glh/glh_obs.h:62:0, from ../../../../../Samples/NiViewer/NiViewer.cpp:62: ../../../../../Samples/NiViewer/glh/glh_linear.h:77:47: note: 'const std::error_code' is not derived from 'const std::__cxx11::list<_Tp, _Alloc>' #define GLH_EPSILON GLH_REAL(10e-6) ^ In file included from /usr/include/c++/7.2.0/string:52:0, from /usr/include/c++/7.2.0/bits/locale_classes.h:40, from /usr/include/c++/7.2.0/bits/ios_base.h:41, from /usr/include/c++/7.2.0/ios:42, from /usr/include/c++/7.2.0/ostream:38, from /usr/include/c++/7.2.0/iostream:39, from ../../../../../Samples/NiViewer/glh/glh_convenience.h:52, from ../../../../../Samples/NiViewer/glh/glh_glut2.h:61, from ../../../../../Samples/NiViewer/NiViewer.cpp:63: /usr/include/c++/7.2.0/bits/basic_string.h:5930:5: note: candidate: template<class _CharT, class _Traits, class _Alloc> bool std::operator>(const std::__cxx11::basic_string<_CharT, _Traits, _Alloc>&, const std::__cxx11::basic_string<_CharT, _Traits, _Alloc>&) operator>(const basic_string<_CharT, _Traits, _Alloc>& __lhs, ^~~~~~~~ /usr/include/c++/7.2.0/bits/basic_string.h:5930:5: note: template argument deduction/substitution failed: In file included from ../../../../../Samples/NiViewer/glh/glh_obs.h:62:0, from ../../../../../Samples/NiViewer/NiViewer.cpp:62: ../../../../../Samples/NiViewer/glh/glh_linear.h:77:47: note: 'const std::error_code' is not derived from 'const std::__cxx11::basic_string<_CharT, _Traits, _Alloc>' #define GLH_EPSILON GLH_REAL(10e-6) ^ In file included from /usr/include/c++/7.2.0/string:52:0, from /usr/include/c++/7.2.0/bits/locale_classes.h:40, from /usr/include/c++/7.2.0/bits/ios_base.h:41, from /usr/include/c++/7.2.0/ios:42, from /usr/include/c++/7.2.0/ostream:38, from /usr/include/c++/7.2.0/iostream:39, from ../../../../../Samples/NiViewer/glh/glh_convenience.h:52, from ../../../../../Samples/NiViewer/glh/glh_glut2.h:61, from ../../../../../Samples/NiViewer/NiViewer.cpp:63: /usr/include/c++/7.2.0/bits/basic_string.h:5943:5: note: candidate: template<class _CharT, class _Traits, class _Alloc> bool std::operator>(const std::__cxx11::basic_string<_CharT, _Traits, _Alloc>&, const _CharT*) operator>(const basic_string<_CharT, _Traits, _Alloc>& __lhs, ^~~~~~~~ /usr/include/c++/7.2.0/bits/basic_string.h:5943:5: note: template argument deduction/substitution failed: In file included from ../../../../../Samples/NiViewer/glh/glh_obs.h:62:0, from ../../../../../Samples/NiViewer/NiViewer.cpp:62: ../../../../../Samples/NiViewer/glh/glh_linear.h:77:47: note: 'const std::error_code' is not derived from 'const std::__cxx11::basic_string<_CharT, _Traits, _Alloc>' #define GLH_EPSILON GLH_REAL(10e-6) ^ In file included from /usr/include/c++/7.2.0/string:52:0, from /usr/include/c++/7.2.0/bits/locale_classes.h:40, from /usr/include/c++/7.2.0/bits/ios_base.h:41, from /usr/include/c++/7.2.0/ios:42, from /usr/include/c++/7.2.0/ostream:38, from /usr/include/c++/7.2.0/iostream:39, from ../../../../../Samples/NiViewer/glh/glh_convenience.h:52, from ../../../../../Samples/NiViewer/glh/glh_glut2.h:61, from ../../../../../Samples/NiViewer/NiViewer.cpp:63: /usr/include/c++/7.2.0/bits/basic_string.h:5955:5: note: candidate: template<class _CharT, class _Traits, class _Alloc> bool std::operator>(const _CharT*, const std::__cxx11::basic_string<_CharT, _Traits, _Alloc>&) operator>(const _CharT* __lhs, ^~~~~~~~ /usr/include/c++/7.2.0/bits/basic_string.h:5955:5: note: template argument deduction/substitution failed: In file included from ../../../../../Samples/NiViewer/glh/glh_obs.h:62:0, from ../../../../../Samples/NiViewer/NiViewer.cpp:62: ../../../../../Samples/NiViewer/glh/glh_linear.h:77:47: note: mismatched types 'const _CharT*' and 'std::error_code' #define GLH_EPSILON GLH_REAL(10e-6) ^ /usr/include/c++/7.2.0/system_error: In function 'bool std::operator==(const std::error_condition&, const std::error_code&)': ../../../../../Samples/NiViewer/glh/glh_linear.h:80:33: error: expected unqualified-id before '(' token #define equivalent(a,b) (((a < b + GLH_EPSILON) && (a > b - GLH_EPSILON)) ? true : false) ^ ../../../../../Samples/NiViewer/glh/glh_linear.h:80:42: error: no match for 'operator+' (operand types are 'const std::error_condition' and 'float') #define equivalent(a,b) (((a < b + GLH_EPSILON) && (a > b - GLH_EPSILON)) ? true : false) ../../../../../Samples/NiViewer/glh/glh_linear.h:80:42: note: candidate: operator+(int, float) <built-in> ../../../../../Samples/NiViewer/glh/glh_linear.h:80:42: note: no known conversion for argument 1 from 'const std::error_condition' to 'int' In file included from /usr/include/c++/7.2.0/bits/stl_algobase.h:67:0, from /usr/include/c++/7.2.0/algorithm:61, from ../../../../../Samples/NiViewer/glh/glh_glut2.h:51, from ../../../../../Samples/NiViewer/NiViewer.cpp:63: /usr/include/c++/7.2.0/bits/stl_iterator.h:397:5: note: candidate: template<class _Iterator> std::reverse_iterator<_Iterator> std::operator+(typename std::reverse_iterator<_Iterator>::difference_type, const std::reverse_iterator<_Iterator>&) operator+(typename reverse_iterator<_Iterator>::difference_type __n, ^~~~~~~~ /usr/include/c++/7.2.0/bits/stl_iterator.h:397:5: note: template argument deduction/substitution failed: In file included from ../../../../../Samples/NiViewer/glh/glh_obs.h:62:0, from ../../../../../Samples/NiViewer/NiViewer.cpp:62: ../../../../../Samples/NiViewer/glh/glh_linear.h:77:47: note: mismatched types 'const std::reverse_iterator<_Iterator>' and 'float' #define GLH_EPSILON GLH_REAL(10e-6) ^ In file included from /usr/include/c++/7.2.0/bits/stl_algobase.h:67:0, from /usr/include/c++/7.2.0/algorithm:61, from ../../../../../Samples/NiViewer/glh/glh_glut2.h:51, from ../../../../../Samples/NiViewer/NiViewer.cpp:63: /usr/include/c++/7.2.0/bits/stl_iterator.h:1198:5: note: candidate: template<class _Iterator> std::move_iterator<_IteratorL> std::operator+(typename std::move_iterator<_IteratorL>::difference_type, const std::move_iterator<_IteratorL>&) operator+(typename move_iterator<_Iterator>::difference_type __n, ^~~~~~~~ /usr/include/c++/7.2.0/bits/stl_iterator.h:1198:5: note: template argument deduction/substitution failed: In file included from ../../../../../Samples/NiViewer/glh/glh_obs.h:62:0, from ../../../../../Samples/NiViewer/NiViewer.cpp:62: ../../../../../Samples/NiViewer/glh/glh_linear.h:77:47: note: mismatched types 'const std::move_iterator<_IteratorL>' and 'float' #define GLH_EPSILON GLH_REAL(10e-6) ^ In file included from /usr/include/c++/7.2.0/string:52:0, from /usr/include/c++/7.2.0/bits/locale_classes.h:40, from /usr/include/c++/7.2.0/bits/ios_base.h:41, from /usr/include/c++/7.2.0/ios:42, from /usr/include/c++/7.2.0/ostream:38, from /usr/include/c++/7.2.0/iostream:39, from ../../../../../Samples/NiViewer/glh/glh_convenience.h:52, from ../../../../../Samples/NiViewer/glh/glh_glut2.h:61, from ../../../../../Samples/NiViewer/NiViewer.cpp:63: /usr/include/c++/7.2.0/bits/basic_string.h:5686:5: note: candidate: template<class _CharT, class _Traits, class _Alloc> std::__cxx11::basic_string<_CharT, _Traits, _Alloc> std::operator+(const std::__cxx11::basic_string<_CharT, _Traits, _Alloc>&, const std::__cxx11::basic_string<_CharT, _Traits, _Alloc>&) operator+(const basic_string<_CharT, _Traits, _Alloc>& __lhs, ^~~~~~~~ /usr/include/c++/7.2.0/bits/basic_string.h:5686:5: note: template argument deduction/substitution failed: In file included from ../../../../../Samples/NiViewer/glh/glh_obs.h:62:0, from ../../../../../Samples/NiViewer/NiViewer.cpp:62: ../../../../../Samples/NiViewer/glh/glh_linear.h:77:47: note: 'const std::error_condition' is not derived from 'const std::__cxx11::basic_string<_CharT, _Traits, _Alloc>' #define GLH_EPSILON GLH_REAL(10e-6) ^ In file included from /usr/include/c++/7.2.0/string:53:0, from /usr/include/c++/7.2.0/bits/locale_classes.h:40, from /usr/include/c++/7.2.0/bits/ios_base.h:41, from /usr/include/c++/7.2.0/ios:42, from /usr/include/c++/7.2.0/ostream:38, from /usr/include/c++/7.2.0/iostream:39, from ../../../../../Samples/NiViewer/glh/glh_convenience.h:52, from ../../../../../Samples/NiViewer/glh/glh_glut2.h:61, from ../../../../../Samples/NiViewer/NiViewer.cpp:63: /usr/include/c++/7.2.0/bits/basic_string.tcc:1157:5: note: candidate: template<class _CharT, class _Traits, class _Alloc> std::__cxx11::basic_string<_CharT, _Traits, _Alloc> std::operator+(const _CharT*, const std::__cxx11::basic_string<_CharT, _Traits, _Alloc>&) operator+(const _CharT* __lhs, ^~~~~~~~ /usr/include/c++/7.2.0/bits/basic_string.tcc:1157:5: note: template argument deduction/substitution failed: In file included from ../../../../../Samples/NiViewer/glh/glh_obs.h:62:0, from ../../../../../Samples/NiViewer/NiViewer.cpp:62: ../../../../../Samples/NiViewer/glh/glh_linear.h:77:47: note: mismatched types 'const _CharT*' and 'std::error_condition' #define GLH_EPSILON GLH_REAL(10e-6) ^ In file included from /usr/include/c++/7.2.0/string:53:0, from /usr/include/c++/7.2.0/bits/locale_classes.h:40, from /usr/include/c++/7.2.0/bits/ios_base.h:41, from /usr/include/c++/7.2.0/ios:42, from /usr/include/c++/7.2.0/ostream:38, from /usr/include/c++/7.2.0/iostream:39, from ../../../../../Samples/NiViewer/glh/glh_convenience.h:52, from ../../../../../Samples/NiViewer/glh/glh_glut2.h:61, from ../../../../../Samples/NiViewer/NiViewer.cpp:63: /usr/include/c++/7.2.0/bits/basic_string.tcc:1173:5: note: candidate: template<class _CharT, class _Traits, class _Alloc> std::__cxx11::basic_string<_CharT, _Traits, _Alloc> std::operator+(_CharT, const std::__cxx11::basic_string<_CharT, _Traits, _Alloc>&) operator+(_CharT __lhs, const basic_string<_CharT, _Traits, _Alloc>& __rhs) ^~~~~~~~ /usr/include/c++/7.2.0/bits/basic_string.tcc:1173:5: note: template argument deduction/substitution failed: In file included from ../../../../../Samples/NiViewer/glh/glh_obs.h:62:0, from ../../../../../Samples/NiViewer/NiViewer.cpp:62: ../../../../../Samples/NiViewer/glh/glh_linear.h:77:47: note: mismatched types 'const std::__cxx11::basic_string<_CharT, _Traits, _Alloc>' and 'float' #define GLH_EPSILON GLH_REAL(10e-6) ^ In file included from /usr/include/c++/7.2.0/string:52:0, from /usr/include/c++/7.2.0/bits/locale_classes.h:40, from /usr/include/c++/7.2.0/bits/ios_base.h:41, from /usr/include/c++/7.2.0/ios:42, from /usr/include/c++/7.2.0/ostream:38, from /usr/include/c++/7.2.0/iostream:39, from ../../../../../Samples/NiViewer/glh/glh_convenience.h:52, from ../../../../../Samples/NiViewer/glh/glh_glut2.h:61, from ../../../../../Samples/NiViewer/NiViewer.cpp:63: /usr/include/c++/7.2.0/bits/basic_string.h:5723:5: note: candidate: template<class _CharT, class _Traits, class _Alloc> std::__cxx11::basic_string<_CharT, _Traits, _Alloc> std::operator+(const std::__cxx11::basic_string<_CharT, _Traits, _Alloc>&, const _CharT*) operator+(const basic_string<_CharT, _Traits, _Alloc>& __lhs, ^~~~~~~~ /usr/include/c++/7.2.0/bits/basic_string.h:5723:5: note: template argument deduction/substitution failed: In file included from ../../../../../Samples/NiViewer/glh/glh_obs.h:62:0, from ../../../../../Samples/NiViewer/NiViewer.cpp:62: ../../../../../Samples/NiViewer/glh/glh_linear.h:77:47: note: 'const std::error_condition' is not derived from 'const std::__cxx11::basic_string<_CharT, _Traits, _Alloc>' #define GLH_EPSILON GLH_REAL(10e-6) ^ In file included from /usr/include/c++/7.2.0/string:52:0, from /usr/include/c++/7.2.0/bits/locale_classes.h:40, from /usr/include/c++/7.2.0/bits/ios_base.h:41, from /usr/include/c++/7.2.0/ios:42, from /usr/include/c++/7.2.0/ostream:38, from /usr/include/c++/7.2.0/iostream:39, from ../../../../../Samples/NiViewer/glh/glh_convenience.h:52, from ../../../../../Samples/NiViewer/glh/glh_glut2.h:61, from ../../../../../Samples/NiViewer/NiViewer.cpp:63: /usr/include/c++/7.2.0/bits/basic_string.h:5739:5: note: candidate: template<class _CharT, class _Traits, class _Alloc> std::__cxx11::basic_string<_CharT, _Traits, _Alloc> std::operator+(const std::__cxx11::basic_string<_CharT, _Traits, _Alloc>&, _CharT) operator+(const basic_string<_CharT, _Traits, _Alloc>& __lhs, _CharT __rhs) ^~~~~~~~ /usr/include/c++/7.2.0/bits/basic_string.h:5739:5: note: template argument deduction/substitution failed: In file included from ../../../../../Samples/NiViewer/glh/glh_obs.h:62:0, from ../../../../../Samples/NiViewer/NiViewer.cpp:62: ../../../../../Samples/NiViewer/glh/glh_linear.h:77:47: note: 'const std::error_condition' is not derived from 'const std::__cxx11::basic_string<_CharT, _Traits, _Alloc>' #define GLH_EPSILON GLH_REAL(10e-6) ^ In file included from /usr/include/c++/7.2.0/string:52:0, from /usr/include/c++/7.2.0/bits/locale_classes.h:40, from /usr/include/c++/7.2.0/bits/ios_base.h:41, from /usr/include/c++/7.2.0/ios:42, from /usr/include/c++/7.2.0/ostream:38, from /usr/include/c++/7.2.0/iostream:39, from ../../../../../Samples/NiViewer/glh/glh_convenience.h:52, from ../../../../../Samples/NiViewer/glh/glh_glut2.h:61, from ../../../../../Samples/NiViewer/NiViewer.cpp:63: /usr/include/c++/7.2.0/bits/basic_string.h:5751:5: note: candidate: template<class _CharT, class _Traits, class _Alloc> std::__cxx11::basic_string<_CharT, _Traits, _Alloc> std::operator+(std::__cxx11::basic_string<_CharT, _Traits, _Alloc>&&, const std::__cxx11::basic_string<_CharT, _Traits, _Alloc>&) operator+(basic_string<_CharT, _Traits, _Alloc>&& __lhs, ^~~~~~~~ /usr/include/c++/7.2.0/bits/basic_string.h:5751:5: note: template argument deduction/substitution failed: In file included from ../../../../../Samples/NiViewer/glh/glh_obs.h:62:0, from ../../../../../Samples/NiViewer/NiViewer.cpp:62: ../../../../../Samples/NiViewer/glh/glh_linear.h:77:47: note: types 'std::__cxx11::basic_string<_CharT, _Traits, _Alloc>' and 'const std::error_condition' have incompatible cv-qualifiers #define GLH_EPSILON GLH_REAL(10e-6) ^ In file included from /usr/include/c++/7.2.0/string:52:0, from /usr/include/c++/7.2.0/bits/locale_classes.h:40, from /usr/include/c++/7.2.0/bits/ios_base.h:41, from /usr/include/c++/7.2.0/ios:42, from /usr/include/c++/7.2.0/ostream:38, from /usr/include/c++/7.2.0/iostream:39, from ../../../../../Samples/NiViewer/glh/glh_convenience.h:52, from ../../../../../Samples/NiViewer/glh/glh_glut2.h:61, from ../../../../../Samples/NiViewer/NiViewer.cpp:63: /usr/include/c++/7.2.0/bits/basic_string.h:5757:5: note: candidate: template<class _CharT, class _Traits, class _Alloc> std::__cxx11::basic_string<_CharT, _Traits, _Alloc> std::operator+(const std::__cxx11::basic_string<_CharT, _Traits, _Alloc>&, std::__cxx11::basic_string<_CharT, _Traits, _Alloc>&&) operator+(const basic_string<_CharT, _Traits, _Alloc>& __lhs, ^~~~~~~~ /usr/include/c++/7.2.0/bits/basic_string.h:5757:5: note: template argument deduction/substitution failed: In file included from ../../../../../Samples/NiViewer/glh/glh_obs.h:62:0, from ../../../../../Samples/NiViewer/NiViewer.cpp:62: ../../../../../Samples/NiViewer/glh/glh_linear.h:77:47: note: 'const std::error_condition' is not derived from 'const std::__cxx11::basic_string<_CharT, _Traits, _Alloc>' #define GLH_EPSILON GLH_REAL(10e-6) ^ In file included from /usr/include/c++/7.2.0/string:52:0, from /usr/include/c++/7.2.0/bits/locale_classes.h:40, from /usr/include/c++/7.2.0/bits/ios_base.h:41, from /usr/include/c++/7.2.0/ios:42, from /usr/include/c++/7.2.0/ostream:38, from /usr/include/c++/7.2.0/iostream:39, from ../../../../../Samples/NiViewer/glh/glh_convenience.h:52, from ../../../../../Samples/NiViewer/glh/glh_glut2.h:61, from ../../../../../Samples/NiViewer/NiViewer.cpp:63: /usr/include/c++/7.2.0/bits/basic_string.h:5763:5: note: candidate: template<class _CharT, class _Traits, class _Alloc> std::__cxx11::basic_string<_CharT, _Traits, _Alloc> std::operator+(std::__cxx11::basic_string<_CharT, _Traits, _Alloc>&&, std::__cxx11::basic_string<_CharT, _Traits, _Alloc>&&) operator+(basic_string<_CharT, _Traits, _Alloc>&& __lhs, ^~~~~~~~ /usr/include/c++/7.2.0/bits/basic_string.h:5763:5: note: template argument deduction/substitution failed: In file included from ../../../../../Samples/NiViewer/glh/glh_obs.h:62:0, from ../../../../../Samples/NiViewer/NiViewer.cpp:62: ../../../../../Samples/NiViewer/glh/glh_linear.h:77:47: note: types 'std::__cxx11::basic_string<_CharT, _Traits, _Alloc>' and 'const std::error_condition' have incompatible cv-qualifiers #define GLH_EPSILON GLH_REAL(10e-6) ^ In file included from /usr/include/c++/7.2.0/string:52:0, from /usr/include/c++/7.2.0/bits/locale_classes.h:40, from /usr/include/c++/7.2.0/bits/ios_base.h:41, from /usr/include/c++/7.2.0/ios:42, from /usr/include/c++/7.2.0/ostream:38, from /usr/include/c++/7.2.0/iostream:39, from ../../../../../Samples/NiViewer/glh/glh_convenience.h:52, from ../../../../../Samples/NiViewer/glh/glh_glut2.h:61, from ../../../../../Samples/NiViewer/NiViewer.cpp:63: /usr/include/c++/7.2.0/bits/basic_string.h:5775:5: note: candidate: template<class _CharT, class _Traits, class _Alloc> std::__cxx11::basic_string<_CharT, _Traits, _Alloc> std::operator+(const _CharT*, std::__cxx11::basic_string<_CharT, _Traits, _Alloc>&&) operator+(const _CharT* __lhs, ^~~~~~~~ /usr/include/c++/7.2.0/bits/basic_string.h:5775:5: note: template argument deduction/substitution failed: In file included from ../../../../../Samples/NiViewer/glh/glh_obs.h:62:0, from ../../../../../Samples/NiViewer/NiViewer.cpp:62: ../../../../../Samples/NiViewer/glh/glh_linear.h:77:47: note: mismatched types 'const _CharT*' and 'std::error_condition' #define GLH_EPSILON GLH_REAL(10e-6) ^ In file included from /usr/include/c++/7.2.0/string:52:0, from /usr/include/c++/7.2.0/bits/locale_classes.h:40, from /usr/include/c++/7.2.0/bits/ios_base.h:41, from /usr/include/c++/7.2.0/ios:42, from /usr/include/c++/7.2.0/ostream:38, from /usr/include/c++/7.2.0/iostream:39, from ../../../../../Samples/NiViewer/glh/glh_convenience.h:52, from ../../../../../Samples/NiViewer/glh/glh_glut2.h:61, from ../../../../../Samples/NiViewer/NiViewer.cpp:63: /usr/include/c++/7.2.0/bits/basic_string.h:5781:5: note: candidate: template<class _CharT, class _Traits, class _Alloc> std::__cxx11::basic_string<_CharT, _Traits, _Alloc> std::operator+(_CharT, std::__cxx11::basic_string<_CharT, _Traits, _Alloc>&&) operator+(_CharT __lhs, ^~~~~~~~ /usr/include/c++/7.2.0/bits/basic_string.h:5781:5: note: template argument deduction/substitution failed: In file included from ../../../../../Samples/NiViewer/glh/glh_obs.h:62:0, from ../../../../../Samples/NiViewer/NiViewer.cpp:62: ../../../../../Samples/NiViewer/glh/glh_linear.h:77:47: note: mismatched types 'std::__cxx11::basic_string<_CharT, _Traits, _Alloc>' and 'float' #define GLH_EPSILON GLH_REAL(10e-6) ^ In file included from /usr/include/c++/7.2.0/string:52:0, from /usr/include/c++/7.2.0/bits/locale_classes.h:40, from /usr/include/c++/7.2.0/bits/ios_base.h:41, from /usr/include/c++/7.2.0/ios:42, from /usr/include/c++/7.2.0/ostream:38, from /usr/include/c++/7.2.0/iostream:39, from ../../../../../Samples/NiViewer/glh/glh_convenience.h:52, from ../../../../../Samples/NiViewer/glh/glh_glut2.h:61, from ../../../../../Samples/NiViewer/NiViewer.cpp:63: /usr/include/c++/7.2.0/bits/basic_string.h:5787:5: note: candidate: template<class _CharT, class _Traits, class _Alloc> std::__cxx11::basic_string<_CharT, _Traits, _Alloc> std::operator+(std::__cxx11::basic_string<_CharT, _Traits, _Alloc>&&, const _CharT*) operator+(basic_string<_CharT, _Traits, _Alloc>&& __lhs, ^~~~~~~~ /usr/include/c++/7.2.0/bits/basic_string.h:5787:5: note: template argument deduction/substitution failed: In file included from ../../../../../Samples/NiViewer/glh/glh_obs.h:62:0, from ../../../../../Samples/NiViewer/NiViewer.cpp:62: ../../../../../Samples/NiViewer/glh/glh_linear.h:77:47: note: types 'std::__cxx11::basic_string<_CharT, _Traits, _Alloc>' and 'const std::error_condition' have incompatible cv-qualifiers #define GLH_EPSILON GLH_REAL(10e-6) ^ In file included from /usr/include/c++/7.2.0/string:52:0, from /usr/include/c++/7.2.0/bits/locale_classes.h:40, from /usr/include/c++/7.2.0/bits/ios_base.h:41, from /usr/include/c++/7.2.0/ios:42, from /usr/include/c++/7.2.0/ostream:38, from /usr/include/c++/7.2.0/iostream:39, from ../../../../../Samples/NiViewer/glh/glh_convenience.h:52, from ../../../../../Samples/NiViewer/glh/glh_glut2.h:61, from ../../../../../Samples/NiViewer/NiViewer.cpp:63: /usr/include/c++/7.2.0/bits/basic_string.h:5793:5: note: candidate: template<class _CharT, class _Traits, class _Alloc> std::__cxx11::basic_string<_CharT, _Traits, _Alloc> std::operator+(std::__cxx11::basic_string<_CharT, _Traits, _Alloc>&&, _CharT) operator+(basic_string<_CharT, _Traits, _Alloc>&& __lhs, ^~~~~~~~ /usr/include/c++/7.2.0/bits/basic_string.h:5793:5: note: template argument deduction/substitution failed: In file included from ../../../../../Samples/NiViewer/glh/glh_obs.h:62:0, from ../../../../../Samples/NiViewer/NiViewer.cpp:62: ../../../../../Samples/NiViewer/glh/glh_linear.h:77:47: note: types 'std::__cxx11::basic_string<_CharT, _Traits, _Alloc>' and 'const std::error_condition' have incompatible cv-qualifiers #define GLH_EPSILON GLH_REAL(10e-6) ^ ../../../../../Samples/NiViewer/glh/glh_linear.h:80:67: error: no match for 'operator-' (operand types are 'const std::error_condition' and 'float') #define equivalent(a,b) (((a < b + GLH_EPSILON) && (a > b - GLH_EPSILON)) ? true : false) ../../../../../Samples/NiViewer/glh/glh_linear.h:80:67: note: candidate: operator-(int, float) <built-in> ../../../../../Samples/NiViewer/glh/glh_linear.h:80:67: note: no known conversion for argument 1 from 'const std::error_condition' to 'int' In file included from /usr/include/c++/7.2.0/bits/stl_algobase.h:67:0, from /usr/include/c++/7.2.0/algorithm:61, from ../../../../../Samples/NiViewer/glh/glh_glut2.h:51, from ../../../../../Samples/NiViewer/NiViewer.cpp:63: /usr/include/c++/7.2.0/bits/stl_iterator.h:389:5: note: candidate: template<class _IteratorL, class _IteratorR> decltype ((__y.base() - __x.base())) std::operator-(const std::reverse_iterator<_Iterator>&, const std::reverse_iterator<_IteratorR>&) operator-(const reverse_iterator<_IteratorL>& __x, ^~~~~~~~ /usr/include/c++/7.2.0/bits/stl_iterator.h:389:5: note: template argument deduction/substitution failed: In file included from ../../../../../Samples/NiViewer/glh/glh_obs.h:62:0, from ../../../../../Samples/NiViewer/NiViewer.cpp:62: ../../../../../Samples/NiViewer/glh/glh_linear.h:77:47: note: 'const std::error_condition' is not derived from 'const std::reverse_iterator<_Iterator>' #define GLH_EPSILON GLH_REAL(10e-6) ^ In file included from /usr/include/c++/7.2.0/bits/stl_algobase.h:67:0, from /usr/include/c++/7.2.0/algorithm:61, from ../../../../../Samples/NiViewer/glh/glh_glut2.h:51, from ../../../../../Samples/NiViewer/NiViewer.cpp:63: /usr/include/c++/7.2.0/bits/stl_iterator.h:1191:5: note: candidate: template<class _IteratorL, class _IteratorR> decltype ((__x.base() - __y.base())) std::operator-(const std::move_iterator<_IteratorL>&, const std::move_iterator<_IteratorR>&) operator-(const move_iterator<_IteratorL>& __x, ^~~~~~~~ /usr/include/c++/7.2.0/bits/stl_iterator.h:1191:5: note: template argument deduction/substitution failed: In file included from ../../../../../Samples/NiViewer/glh/glh_obs.h:62:0, from ../../../../../Samples/NiViewer/NiViewer.cpp:62: ../../../../../Samples/NiViewer/glh/glh_linear.h:77:47: note: 'const std::error_condition' is not derived from 'const std::move_iterator<_IteratorL>' #define GLH_EPSILON GLH_REAL(10e-6) ^ ../../../../../Samples/NiViewer/glh/glh_linear.h:80:33: error: expected unqualified-id before '(' token #define equivalent(a,b) (((a < b + GLH_EPSILON) && (a > b - GLH_EPSILON)) ? true : false) ^ ../../../../../Samples/NiViewer/glh/glh_linear.h:80:38: error: no match for 'operator<' (operand types are 'const std::error_code' and 'float') #define equivalent(a,b) (((a < b + GLH_EPSILON) && (a > b - GLH_EPSILON)) ? true : false) ../../../../../Samples/NiViewer/glh/glh_linear.h:80:38: note: candidate: operator<(int, float) <built-in> ../../../../../Samples/NiViewer/glh/glh_linear.h:80:38: note: no known conversion for argument 1 from 'const std::error_code' to 'int' In file included from /usr/include/c++/7.2.0/utility:70:0, from /usr/include/c++/7.2.0/algorithm:60, from ../../../../../Samples/NiViewer/glh/glh_glut2.h:51, from ../../../../../Samples/NiViewer/NiViewer.cpp:63: /usr/include/c++/7.2.0/bits/stl_pair.h:449:5: note: candidate: template<class _T1, class _T2> constexpr bool std::operator<(const std::pair<_T1, _T2>&, const std::pair<_T1, _T2>&) operator<(const pair<_T1, _T2>& __x, const pair<_T1, _T2>& __y) ^~~~~~~~ /usr/include/c++/7.2.0/bits/stl_pair.h:449:5: note: template argument deduction/substitution failed: In file included from ../../../../../Samples/NiViewer/glh/glh_obs.h:62:0, from ../../../../../Samples/NiViewer/NiViewer.cpp:62: ../../../../../Samples/NiViewer/glh/glh_linear.h:77:47: note: 'const std::error_code' is not derived from 'const std::pair<_T1, _T2>' #define GLH_EPSILON GLH_REAL(10e-6) ^ In file included from /usr/include/c++/7.2.0/bits/stl_algobase.h:67:0, from /usr/include/c++/7.2.0/algorithm:61, from ../../../../../Samples/NiViewer/glh/glh_glut2.h:51, from ../../../../../Samples/NiViewer/NiViewer.cpp:63: /usr/include/c++/7.2.0/bits/stl_iterator.h:305:5: note: candidate: template<class _Iterator> bool std::operator<(const std::reverse_iterator<_Iterator>&, const std::reverse_iterator<_Iterator>&) operator<(const reverse_iterator<_Iterator>& __x, ^~~~~~~~ /usr/include/c++/7.2.0/bits/stl_iterator.h:305:5: note: template argument deduction/substitution failed: In file included from ../../../../../Samples/NiViewer/glh/glh_obs.h:62:0, from ../../../../../Samples/NiViewer/NiViewer.cpp:62: ../../../../../Samples/NiViewer/glh/glh_linear.h:77:47: note: 'const std::error_code' is not derived from 'const std::reverse_iterator<_Iterator>' #define GLH_EPSILON GLH_REAL(10e-6) ^ In file included from /usr/include/c++/7.2.0/bits/stl_algobase.h:67:0, from /usr/include/c++/7.2.0/algorithm:61, from ../../../../../Samples/NiViewer/glh/glh_glut2.h:51, from ../../../../../Samples/NiViewer/NiViewer.cpp:63: /usr/include/c++/7.2.0/bits/stl_iterator.h:343:5: note: candidate: template<class _IteratorL, class _IteratorR> bool std::operator<(const std::reverse_iterator<_Iterator>&, const std::reverse_iterator<_IteratorR>&) operator<(const reverse_iterator<_IteratorL>& __x, ^~~~~~~~ /usr/include/c++/7.2.0/bits/stl_iterator.h:343:5: note: template argument deduction/substitution failed: In file included from ../../../../../Samples/NiViewer/glh/glh_obs.h:62:0, from ../../../../../Samples/NiViewer/NiViewer.cpp:62: ../../../../../Samples/NiViewer/glh/glh_linear.h:77:47: note: 'const std::error_code' is not derived from 'const std::reverse_iterator<_Iterator>' #define GLH_EPSILON GLH_REAL(10e-6) ^ In file included from /usr/include/c++/7.2.0/bits/stl_algobase.h:67:0, from /usr/include/c++/7.2.0/algorithm:61, from ../../../../../Samples/NiViewer/glh/glh_glut2.h:51, from ../../../../../Samples/NiViewer/NiViewer.cpp:63: /usr/include/c++/7.2.0/bits/stl_iterator.h:1142:5: note: candidate: template<class _IteratorL, class _IteratorR> bool std::operator<(const std::move_iterator<_IteratorL>&, const std::move_iterator<_IteratorR>&) operator<(const move_iterator<_IteratorL>& __x, ^~~~~~~~ /usr/include/c++/7.2.0/bits/stl_iterator.h:1142:5: note: template argument deduction/substitution failed: In file included from ../../../../../Samples/NiViewer/glh/glh_obs.h:62:0, from ../../../../../Samples/NiViewer/NiViewer.cpp:62: ../../../../../Samples/NiViewer/glh/glh_linear.h:77:47: note: 'const std::error_code' is not derived from 'const std::move_iterator<_IteratorL>' #define GLH_EPSILON GLH_REAL(10e-6) ^ In file included from /usr/include/c++/7.2.0/bits/stl_algobase.h:67:0, from /usr/include/c++/7.2.0/algorithm:61, from ../../../../../Samples/NiViewer/glh/glh_glut2.h:51, from ../../../../../Samples/NiViewer/NiViewer.cpp:63: /usr/include/c++/7.2.0/bits/stl_iterator.h:1148:5: note: candidate: template<class _Iterator> bool std::operator<(const std::move_iterator<_IteratorL>&, const std::move_iterator<_IteratorL>&) operator<(const move_iterator<_Iterator>& __x, ^~~~~~~~ /usr/include/c++/7.2.0/bits/stl_iterator.h:1148:5: note: template argument deduction/substitution failed: In file included from ../../../../../Samples/NiViewer/glh/glh_obs.h:62:0, from ../../../../../Samples/NiViewer/NiViewer.cpp:62: ../../../../../Samples/NiViewer/glh/glh_linear.h:77:47: note: 'const std::error_code' is not derived from 'const std::move_iterator<_IteratorL>' #define GLH_EPSILON GLH_REAL(10e-6) ^ In file included from /usr/include/c++/7.2.0/list:63:0, from ../../../../../Samples/NiViewer/glh/glh_glut2.h:52, from ../../../../../Samples/NiViewer/NiViewer.cpp:63: /usr/include/c++/7.2.0/bits/stl_list.h:1918:5: note: candidate: template<class _Tp, class _Alloc> bool std::operator<(const std::__cxx11::list<_Tp, _Alloc>&, const std::__cxx11::list<_Tp, _Alloc>&) operator<(const list<_Tp, _Alloc>& __x, const list<_Tp, _Alloc>& __y) ^~~~~~~~ /usr/include/c++/7.2.0/bits/stl_list.h:1918:5: note: template argument deduction/substitution failed: In file included from ../../../../../Samples/NiViewer/glh/glh_obs.h:62:0, from ../../../../../Samples/NiViewer/NiViewer.cpp:62: ../../../../../Samples/NiViewer/glh/glh_linear.h:77:47: note: 'const std::error_code' is not derived from 'const std::__cxx11::list<_Tp, _Alloc>' #define GLH_EPSILON GLH_REAL(10e-6) ^ In file included from /usr/include/c++/7.2.0/string:52:0, from /usr/include/c++/7.2.0/bits/locale_classes.h:40, from /usr/include/c++/7.2.0/bits/ios_base.h:41, from /usr/include/c++/7.2.0/ios:42, from /usr/include/c++/7.2.0/ostream:38, from /usr/include/c++/7.2.0/iostream:39, from ../../../../../Samples/NiViewer/glh/glh_convenience.h:52, from ../../../../../Samples/NiViewer/glh/glh_glut2.h:61, from ../../../../../Samples/NiViewer/NiViewer.cpp:63: /usr/include/c++/7.2.0/bits/basic_string.h:5892:5: note: candidate: template<class _CharT, class _Traits, class _Alloc> bool std::operator<(const std::__cxx11::basic_string<_CharT, _Traits, _Alloc>&, const std::__cxx11::basic_string<_CharT, _Traits, _Alloc>&) operator<(const basic_string<_CharT, _Traits, _Alloc>& __lhs, ^~~~~~~~ /usr/include/c++/7.2.0/bits/basic_string.h:5892:5: note: template argument deduction/substitution failed: In file included from ../../../../../Samples/NiViewer/glh/glh_obs.h:62:0, from ../../../../../Samples/NiViewer/NiViewer.cpp:62: ../../../../../Samples/NiViewer/glh/glh_linear.h:77:47: note: 'const std::error_code' is not derived from 'const std::__cxx11::basic_string<_CharT, _Traits, _Alloc>' #define GLH_EPSILON GLH_REAL(10e-6) ^ In file included from /usr/include/c++/7.2.0/string:52:0, from /usr/include/c++/7.2.0/bits/locale_classes.h:40, from /usr/include/c++/7.2.0/bits/ios_base.h:41, from /usr/include/c++/7.2.0/ios:42, from /usr/include/c++/7.2.0/ostream:38, from /usr/include/c++/7.2.0/iostream:39, from ../../../../../Samples/NiViewer/glh/glh_convenience.h:52, from ../../../../../Samples/NiViewer/glh/glh_glut2.h:61, from ../../../../../Samples/NiViewer/NiViewer.cpp:63: /usr/include/c++/7.2.0/bits/basic_string.h:5905:5: note: candidate: template<class _CharT, class _Traits, class _Alloc> bool std::operator<(const std::__cxx11::basic_string<_CharT, _Traits, _Alloc>&, const _CharT*) operator<(const basic_string<_CharT, _Traits, _Alloc>& __lhs, ^~~~~~~~ /usr/include/c++/7.2.0/bits/basic_string.h:5905:5: note: template argument deduction/substitution failed: In file included from ../../../../../Samples/NiViewer/glh/glh_obs.h:62:0, from ../../../../../Samples/NiViewer/NiViewer.cpp:62: ../../../../../Samples/NiViewer/glh/glh_linear.h:77:47: note: 'const std::error_code' is not derived from 'const std::__cxx11::basic_string<_CharT, _Traits, _Alloc>' #define GLH_EPSILON GLH_REAL(10e-6) ^ In file included from /usr/include/c++/7.2.0/string:52:0, from /usr/include/c++/7.2.0/bits/locale_classes.h:40, from /usr/include/c++/7.2.0/bits/ios_base.h:41, from /usr/include/c++/7.2.0/ios:42, from /usr/include/c++/7.2.0/ostream:38, from /usr/include/c++/7.2.0/iostream:39, from ../../../../../Samples/NiViewer/glh/glh_convenience.h:52, from ../../../../../Samples/NiViewer/glh/glh_glut2.h:61, from ../../../../../Samples/NiViewer/NiViewer.cpp:63: /usr/include/c++/7.2.0/bits/basic_string.h:5917:5: note: candidate: template<class _CharT, class _Traits, class _Alloc> bool std::operator<(const _CharT*, const std::__cxx11::basic_string<_CharT, _Traits, _Alloc>&) operator<(const _CharT* __lhs, ^~~~~~~~ /usr/include/c++/7.2.0/bits/basic_string.h:5917:5: note: template argument deduction/substitution failed: In file included from ../../../../../Samples/NiViewer/glh/glh_obs.h:62:0, from ../../../../../Samples/NiViewer/NiViewer.cpp:62: ../../../../../Samples/NiViewer/glh/glh_linear.h:77:47: note: mismatched types 'const _CharT*' and 'std::error_code' #define GLH_EPSILON GLH_REAL(10e-6) ^ In file included from /usr/include/c++/7.2.0/bits/ios_base.h:46:0, from /usr/include/c++/7.2.0/ios:42, from /usr/include/c++/7.2.0/ostream:38, from /usr/include/c++/7.2.0/iostream:39, from ../../../../../Samples/NiViewer/glh/glh_convenience.h:52, from ../../../../../Samples/NiViewer/glh/glh_glut2.h:61, from ../../../../../Samples/NiViewer/NiViewer.cpp:63: /usr/include/c++/7.2.0/system_error:208:3: note: candidate: bool std::operator<(const std::error_code&, const std::error_code&) operator<(const error_code& __lhs, const error_code& __rhs) noexcept ^~~~~~~~ /usr/include/c++/7.2.0/system_error:208:3: note: no known conversion for argument 2 from 'float' to 'const std::error_code&' /usr/include/c++/7.2.0/system_error:282:3: note: candidate: bool std::operator<(const std::error_condition&, const std::error_condition&) operator<(const error_condition& __lhs, ^~~~~~~~ /usr/include/c++/7.2.0/system_error:282:3: note: no known conversion for argument 1 from 'const std::error_code' to 'const std::error_condition&' In file included from ../../../../../Samples/NiViewer/glh/glh_obs.h:62:0, from ../../../../../Samples/NiViewer/NiViewer.cpp:62: ../../../../../Samples/NiViewer/glh/glh_linear.h:80:63: error: no match for 'operator>' (operand types are 'const std::error_code' and 'float') #define equivalent(a,b) (((a < b + GLH_EPSILON) && (a > b - GLH_EPSILON)) ? true : false) ../../../../../Samples/NiViewer/glh/glh_linear.h:80:63: note: candidate: operator>(int, float) <built-in> ../../../../../Samples/NiViewer/glh/glh_linear.h:80:63: note: no known conversion for argument 1 from 'const std::error_code' to 'int' In file included from /usr/include/c++/7.2.0/utility:70:0, from /usr/include/c++/7.2.0/algorithm:60, from ../../../../../Samples/NiViewer/glh/glh_glut2.h:51, from ../../../../../Samples/NiViewer/NiViewer.cpp:63: /usr/include/c++/7.2.0/bits/stl_pair.h:462:5: note: candidate: template<class _T1, class _T2> constexpr bool std::operator>(const std::pair<_T1, _T2>&, const std::pair<_T1, _T2>&) operator>(const pair<_T1, _T2>& __x, const pair<_T1, _T2>& __y) ^~~~~~~~ /usr/include/c++/7.2.0/bits/stl_pair.h:462:5: note: template argument deduction/substitution failed: In file included from ../../../../../Samples/NiViewer/glh/glh_obs.h:62:0, from ../../../../../Samples/NiViewer/NiViewer.cpp:62: ../../../../../Samples/NiViewer/glh/glh_linear.h:77:47: note: 'const std::error_code' is not derived from 'const std::pair<_T1, _T2>' #define GLH_EPSILON GLH_REAL(10e-6) ^ In file included from /usr/include/c++/7.2.0/bits/stl_algobase.h:67:0, from /usr/include/c++/7.2.0/algorithm:61, from ../../../../../Samples/NiViewer/glh/glh_glut2.h:51, from ../../../../../Samples/NiViewer/NiViewer.cpp:63: /usr/include/c++/7.2.0/bits/stl_iterator.h:317:5: note: candidate: template<class _Iterator> bool std::operator>(const std::reverse_iterator<_Iterator>&, const std::reverse_iterator<_Iterator>&) operator>(const reverse_iterator<_Iterator>& __x, ^~~~~~~~ /usr/include/c++/7.2.0/bits/stl_iterator.h:317:5: note: template argument deduction/substitution failed: In file included from ../../../../../Samples/NiViewer/glh/glh_obs.h:62:0, from ../../../../../Samples/NiViewer/NiViewer.cpp:62: ../../../../../Samples/NiViewer/glh/glh_linear.h:77:47: note: 'const std::error_code' is not derived from 'const std::reverse_iterator<_Iterator>' #define GLH_EPSILON GLH_REAL(10e-6) ^ In file included from /usr/include/c++/7.2.0/bits/stl_algobase.h:67:0, from /usr/include/c++/7.2.0/algorithm:61, from ../../../../../Samples/NiViewer/glh/glh_glut2.h:51, from ../../../../../Samples/NiViewer/NiViewer.cpp:63: /usr/include/c++/7.2.0/bits/stl_iterator.h:355:5: note: candidate: template<class _IteratorL, class _IteratorR> bool std::operator>(const std::reverse_iterator<_Iterator>&, const std::reverse_iterator<_IteratorR>&) operator>(const reverse_iterator<_IteratorL>& __x, ^~~~~~~~ /usr/include/c++/7.2.0/bits/stl_iterator.h:355:5: note: template argument deduction/substitution failed: In file included from ../../../../../Samples/NiViewer/glh/glh_obs.h:62:0, from ../../../../../Samples/NiViewer/NiViewer.cpp:62: ../../../../../Samples/NiViewer/glh/glh_linear.h:77:47: note: 'const std::error_code' is not derived from 'const std::reverse_iterator<_Iterator>' #define GLH_EPSILON GLH_REAL(10e-6) ^ In file included from /usr/include/c++/7.2.0/bits/stl_algobase.h:67:0, from /usr/include/c++/7.2.0/algorithm:61, from ../../../../../Samples/NiViewer/glh/glh_glut2.h:51, from ../../../../../Samples/NiViewer/NiViewer.cpp:63: /usr/include/c++/7.2.0/bits/stl_iterator.h:1166:5: note: candidate: template<class _IteratorL, class _IteratorR> bool std::operator>(const std::move_iterator<_IteratorL>&, const std::move_iterator<_IteratorR>&) operator>(const move_iterator<_IteratorL>& __x, ^~~~~~~~ /usr/include/c++/7.2.0/bits/stl_iterator.h:1166:5: note: template argument deduction/substitution failed: In file included from ../../../../../Samples/NiViewer/glh/glh_obs.h:62:0, from ../../../../../Samples/NiViewer/NiViewer.cpp:62: ../../../../../Samples/NiViewer/glh/glh_linear.h:77:47: note: 'const std::error_code' is not derived from 'const std::move_iterator<_IteratorL>' #define GLH_EPSILON GLH_REAL(10e-6) ^ In file included from /usr/include/c++/7.2.0/bits/stl_algobase.h:67:0, from /usr/include/c++/7.2.0/algorithm:61, from ../../../../../Samples/NiViewer/glh/glh_glut2.h:51, from ../../../../../Samples/NiViewer/NiViewer.cpp:63: /usr/include/c++/7.2.0/bits/stl_iterator.h:1172:5: note: candidate: template<class _Iterator> bool std::operator>(const std::move_iterator<_IteratorL>&, const std::move_iterator<_IteratorL>&) operator>(const move_iterator<_Iterator>& __x, ^~~~~~~~ /usr/include/c++/7.2.0/bits/stl_iterator.h:1172:5: note: template argument deduction/substitution failed: In file included from ../../../../../Samples/NiViewer/glh/glh_obs.h:62:0, from ../../../../../Samples/NiViewer/NiViewer.cpp:62: ../../../../../Samples/NiViewer/glh/glh_linear.h:77:47: note: 'const std::error_code' is not derived from 'const std::move_iterator<_IteratorL>' #define GLH_EPSILON GLH_REAL(10e-6) ^ In file included from /usr/include/c++/7.2.0/list:63:0, from ../../../../../Samples/NiViewer/glh/glh_glut2.h:52, from ../../../../../Samples/NiViewer/NiViewer.cpp:63: /usr/include/c++/7.2.0/bits/stl_list.h:1931:5: note: candidate: template<class _Tp, class _Alloc> bool std::operator>(const std::__cxx11::list<_Tp, _Alloc>&, const std::__cxx11::list<_Tp, _Alloc>&) operator>(const list<_Tp, _Alloc>& __x, const list<_Tp, _Alloc>& __y) ^~~~~~~~ /usr/include/c++/7.2.0/bits/stl_list.h:1931:5: note: template argument deduction/substitution failed: In file included from ../../../../../Samples/NiViewer/glh/glh_obs.h:62:0, from ../../../../../Samples/NiViewer/NiViewer.cpp:62: ../../../../../Samples/NiViewer/glh/glh_linear.h:77:47: note: 'const std::error_code' is not derived from 'const std::__cxx11::list<_Tp, _Alloc>' #define GLH_EPSILON GLH_REAL(10e-6) ^ In file included from /usr/include/c++/7.2.0/string:52:0, from /usr/include/c++/7.2.0/bits/locale_classes.h:40, from /usr/include/c++/7.2.0/bits/ios_base.h:41, from /usr/include/c++/7.2.0/ios:42, from /usr/include/c++/7.2.0/ostream:38, from /usr/include/c++/7.2.0/iostream:39, from ../../../../../Samples/NiViewer/glh/glh_convenience.h:52, from ../../../../../Samples/NiViewer/glh/glh_glut2.h:61, from ../../../../../Samples/NiViewer/NiViewer.cpp:63: /usr/include/c++/7.2.0/bits/basic_string.h:5930:5: note: candidate: template<class _CharT, class _Traits, class _Alloc> bool std::operator>(const std::__cxx11::basic_string<_CharT, _Traits, _Alloc>&, const std::__cxx11::basic_string<_CharT, _Traits, _Alloc>&) operator>(const basic_string<_CharT, _Traits, _Alloc>& __lhs, ^~~~~~~~ /usr/include/c++/7.2.0/bits/basic_string.h:5930:5: note: template argument deduction/substitution failed: In file included from ../../../../../Samples/NiViewer/glh/glh_obs.h:62:0, from ../../../../../Samples/NiViewer/NiViewer.cpp:62: ../../../../../Samples/NiViewer/glh/glh_linear.h:77:47: note: 'const std::error_code' is not derived from 'const std::__cxx11::basic_string<_CharT, _Traits, _Alloc>' #define GLH_EPSILON GLH_REAL(10e-6) ^ In file included from /usr/include/c++/7.2.0/string:52:0, from /usr/include/c++/7.2.0/bits/locale_classes.h:40, from /usr/include/c++/7.2.0/bits/ios_base.h:41, from /usr/include/c++/7.2.0/ios:42, from /usr/include/c++/7.2.0/ostream:38, from /usr/include/c++/7.2.0/iostream:39, from ../../../../../Samples/NiViewer/glh/glh_convenience.h:52, from ../../../../../Samples/NiViewer/glh/glh_glut2.h:61, from ../../../../../Samples/NiViewer/NiViewer.cpp:63: /usr/include/c++/7.2.0/bits/basic_string.h:5943:5: note: candidate: template<class _CharT, class _Traits, class _Alloc> bool std::operator>(const std::__cxx11::basic_string<_CharT, _Traits, _Alloc>&, const _CharT*) operator>(const basic_string<_CharT, _Traits, _Alloc>& __lhs, ^~~~~~~~ /usr/include/c++/7.2.0/bits/basic_string.h:5943:5: note: template argument deduction/substitution failed: In file included from ../../../../../Samples/NiViewer/glh/glh_obs.h:62:0, from ../../../../../Samples/NiViewer/NiViewer.cpp:62: ../../../../../Samples/NiViewer/glh/glh_linear.h:77:47: note: 'const std::error_code' is not derived from 'const std::__cxx11::basic_string<_CharT, _Traits, _Alloc>' #define GLH_EPSILON GLH_REAL(10e-6) ^ In file included from /usr/include/c++/7.2.0/string:52:0, from /usr/include/c++/7.2.0/bits/locale_classes.h:40, from /usr/include/c++/7.2.0/bits/ios_base.h:41, from /usr/include/c++/7.2.0/ios:42, from /usr/include/c++/7.2.0/ostream:38, from /usr/include/c++/7.2.0/iostream:39, from ../../../../../Samples/NiViewer/glh/glh_convenience.h:52, from ../../../../../Samples/NiViewer/glh/glh_glut2.h:61, from ../../../../../Samples/NiViewer/NiViewer.cpp:63: /usr/include/c++/7.2.0/bits/basic_string.h:5955:5: note: candidate: template<class _CharT, class _Traits, class _Alloc> bool std::operator>(const _CharT*, const std::__cxx11::basic_string<_CharT, _Traits, _Alloc>&) operator>(const _CharT* __lhs, ^~~~~~~~ /usr/include/c++/7.2.0/bits/basic_string.h:5955:5: note: template argument deduction/substitution failed: In file included from ../../../../../Samples/NiViewer/glh/glh_obs.h:62:0, from ../../../../../Samples/NiViewer/NiViewer.cpp:62: ../../../../../Samples/NiViewer/glh/glh_linear.h:77:47: note: mismatched types 'const _CharT*' and 'std::error_code' #define GLH_EPSILON GLH_REAL(10e-6) ^ make[1]: *** [../../Common/CommonCppMakefile:123: x64-PLD/NiViewer.o] Error 1 make[1]: Leaving directory '/tmp/B.jXlV1P/BUILD/OpenNI-OpenNI-1e9524f/Platform/Linux/Build/Samples/NiViewer' make: *** [Makefile:150: Samples/NiViewer] Error 2 make: *** Waiting for unfinished jobs.... make[1]: Entering directory '/tmp/B.jXlV1P/BUILD/OpenNI-OpenNI-1e9524f/Platform/Linux/Build/Samples/NiHandTracker' x86_64-pld-linux-g++ -o ../../../Bin/x64-PLD/Sample-NiHandTracker ./x64-PLD/NiSimpleViewer.o ./x64-PLD/NiHandViewer.o ./x64-PLD/NiHandTracker.o ./x64-PLD/main.o -L../../../Bin/x64-PLD -lglut -lGL -lOpenNI make[1]: Leaving directory '/tmp/B.jXlV1P/BUILD/OpenNI-OpenNI-1e9524f/Platform/Linux/Build/Samples/NiHandTracker' make[1]: Entering directory '/tmp/B.jXlV1P/BUILD/OpenNI-OpenNI-1e9524f/Platform/Linux/Build/Samples/NiUserSelection' x86_64-pld-linux-g++ -MD -MP -MT "./x64-PLD/SceneDrawer.d x64-PLD/SceneDrawer.o" -c -O2 -fwrapv -pipe -Wformat -Werror=format-security -gdwarf-4 -fno-debug-types-section -fvar-tracking-assignments -g2 -Wp,-D_FORTIFY_SOURCE=2 -fstack-protector-strong --param=ssp-buffer-size=4 -fPIC -march=x86-64 -gdwarf-4 -fno-debug-types-section -fvar-tracking-assignments -g2 -I../../../../../Include -o x64-PLD/SceneDrawer.o ../../../../../Samples/NiUserSelection/SceneDrawer.cpp ../../../../../Samples/NiUserSelection/SceneDrawer.cpp: In member function 'void SceneDrawer::DrawDepthMapTexture()': ../../../../../Samples/NiUserSelection/SceneDrawer.cpp:154:73: warning: narrowing conversion of 'g_nXRes' from 'XnUInt16 {aka short unsigned int}' to 'GLfloat {aka float}' inside { } [-Wnarrowing] GLfloat verts[8] = { g_nXRes, g_nYRes, g_nXRes, 0, 0, 0, 0, g_nYRes }; ^ ../../../../../Samples/NiUserSelection/SceneDrawer.cpp:154:73: warning: narrowing conversion of 'g_nYRes' from 'XnUInt16 {aka short unsigned int}' to 'GLfloat {aka float}' inside { } [-Wnarrowing] ../../../../../Samples/NiUserSelection/SceneDrawer.cpp:154:73: warning: narrowing conversion of 'g_nXRes' from 'XnUInt16 {aka short unsigned int}' to 'GLfloat {aka float}' inside { } [-Wnarrowing] ../../../../../Samples/NiUserSelection/SceneDrawer.cpp:154:73: warning: narrowing conversion of 'g_nYRes' from 'XnUInt16 {aka short unsigned int}' to 'GLfloat {aka float}' inside { } [-Wnarrowing] make[1]: Leaving directory '/tmp/B.jXlV1P/BUILD/OpenNI-OpenNI-1e9524f/Platform/Linux/Build/Samples/NiUserSelection' make[1]: Entering directory '/tmp/B.jXlV1P/BUILD/OpenNI-OpenNI-1e9524f/Platform/Linux/Build/Samples/NiUserSelection' x86_64-pld-linux-g++ -MD -MP -MT "./x64-PLD/main.d x64-PLD/main.o" -c -O2 -fwrapv -pipe -Wformat -Werror=format-security -gdwarf-4 -fno-debug-types-section -fvar-tracking-assignments -g2 -Wp,-D_FORTIFY_SOURCE=2 -fstack-protector-strong --param=ssp-buffer-size=4 -fPIC -march=x86-64 -gdwarf-4 -fno-debug-types-section -fvar-tracking-assignments -g2 -I../../../../../Include -o x64-PLD/main.o ../../../../../Samples/NiUserSelection/main.cpp make[1]: Leaving directory '/tmp/B.jXlV1P/BUILD/OpenNI-OpenNI-1e9524f/Platform/Linux/Build/Samples/NiUserSelection' make[1]: Entering directory '/tmp/B.jXlV1P/BUILD/OpenNI-OpenNI-1e9524f/Platform/Linux/Build/Samples/NiUserSelection' x86_64-pld-linux-g++ -MD -MP -MT "./x64-PLD/PoseToggleUserSelector.d x64-PLD/PoseToggleUserSelector.o" -c -O2 -fwrapv -pipe -Wformat -Werror=format-security -gdwarf-4 -fno-debug-types-section -fvar-tracking-assignments -g2 -Wp,-D_FORTIFY_SOURCE=2 -fstack-protector-strong --param=ssp-buffer-size=4 -fPIC -march=x86-64 -gdwarf-4 -fno-debug-types-section -fvar-tracking-assignments -g2 -I../../../../../Include -o x64-PLD/PoseToggleUserSelector.o ../../../../../Samples/NiUserSelection/PoseToggleUserSelector.cpp make[1]: Leaving directory '/tmp/B.jXlV1P/BUILD/OpenNI-OpenNI-1e9524f/Platform/Linux/Build/Samples/NiUserSelection' make[1]: Entering directory '/tmp/B.jXlV1P/BUILD/OpenNI-OpenNI-1e9524f/Platform/Linux/Build/Samples/NiUserSelection' x86_64-pld-linux-g++ -MD -MP -MT "./x64-PLD/UserTracker.d x64-PLD/UserTracker.o" -c -O2 -fwrapv -pipe -Wformat -Werror=format-security -gdwarf-4 -fno-debug-types-section -fvar-tracking-assignments -g2 -Wp,-D_FORTIFY_SOURCE=2 -fstack-protector-strong --param=ssp-buffer-size=4 -fPIC -march=x86-64 -gdwarf-4 -fno-debug-types-section -fvar-tracking-assignments -g2 -I../../../../../Include -o x64-PLD/UserTracker.o ../../../../../Samples/NiUserSelection/UserTracker.cpp make[1]: Leaving directory '/tmp/B.jXlV1P/BUILD/OpenNI-OpenNI-1e9524f/Platform/Linux/Build/Samples/NiUserSelection' make[1]: Entering directory '/tmp/B.jXlV1P/BUILD/OpenNI-OpenNI-1e9524f/Platform/Linux/Build/Samples/NiUserSelection' x86_64-pld-linux-g++ -MD -MP -MT "./x64-PLD/SinglePoseUserSelector.d x64-PLD/SinglePoseUserSelector.o" -c -O2 -fwrapv -pipe -Wformat -Werror=format-security -gdwarf-4 -fno-debug-types-section -fvar-tracking-assignments -g2 -Wp,-D_FORTIFY_SOURCE=2 -fstack-protector-strong --param=ssp-buffer-size=4 -fPIC -march=x86-64 -gdwarf-4 -fno-debug-types-section -fvar-tracking-assignments -g2 -I../../../../../Include -o x64-PLD/SinglePoseUserSelector.o ../../../../../Samples/NiUserSelection/SinglePoseUserSelector.cpp make[1]: Leaving directory '/tmp/B.jXlV1P/BUILD/OpenNI-OpenNI-1e9524f/Platform/Linux/Build/Samples/NiUserSelection' make[1]: Entering directory '/tmp/B.jXlV1P/BUILD/OpenNI-OpenNI-1e9524f/Platform/Linux/Build/Samples/NiUserSelection' x86_64-pld-linux-g++ -MD -MP -MT "./x64-PLD/ClosestUserSelector.d x64-PLD/ClosestUserSelector.o" -c -O2 -fwrapv -pipe -Wformat -Werror=format-security -gdwarf-4 -fno-debug-types-section -fvar-tracking-assignments -g2 -Wp,-D_FORTIFY_SOURCE=2 -fstack-protector-strong --param=ssp-buffer-size=4 -fPIC -march=x86-64 -gdwarf-4 -fno-debug-types-section -fvar-tracking-assignments -g2 -I../../../../../Include -o x64-PLD/ClosestUserSelector.o ../../../../../Samples/NiUserSelection/ClosestUserSelector.cpp make[1]: Leaving directory '/tmp/B.jXlV1P/BUILD/OpenNI-OpenNI-1e9524f/Platform/Linux/Build/Samples/NiUserSelection' make[1]: Entering directory '/tmp/B.jXlV1P/BUILD/OpenNI-OpenNI-1e9524f/Platform/Linux/Build/Wrappers/OpenNI.java' javac -d x64-PLD ../../../../../Wrappers/OpenNI.java/src/org/openni/*.java jar -cf ../../../Bin/x64-PLD/org.openni.jar -C x64-PLD . make[1]: Leaving directory '/tmp/B.jXlV1P/BUILD/OpenNI-OpenNI-1e9524f/Platform/Linux/Build/Wrappers/OpenNI.java' make[1]: Entering directory '/tmp/B.jXlV1P/BUILD/OpenNI-OpenNI-1e9524f/Platform/Linux/Build/Samples/NiUserSelection' x86_64-pld-linux-g++ -o ../../../Bin/x64-PLD/Sample-NiUserSelection ./x64-PLD/UserSelector.o ./x64-PLD/DefaultTrackingInitializer.o ./x64-PLD/PoseUserSelector.o ./x64-PLD/opengles.o ./x64-PLD/ExitPoseDetector.o ./x64-PLD/SampleManager.o ./x64-PLD/TrackingInitializer.o ./x64-PLD/SceneDrawer.o ./x64-PLD/UserTracker.o ./x64-PLD/PoseToggleUserSelector.o ./x64-PLD/main.o ./x64-PLD/SinglePoseUserSelector.o ./x64-PLD/ClosestUserSelector.o -L../../../Bin/x64-PLD -lglut -lGL -lOpenNI make[1]: Leaving directory '/tmp/B.jXlV1P/BUILD/OpenNI-OpenNI-1e9524f/Platform/Linux/Build/Samples/NiUserSelection' error: Bad exit status from /tmp/B.jXlV1P/BUILD/tmp/rpm-tmp.32781 (%build) RPM build errors: Bad exit status from /tmp/B.jXlV1P/BUILD/tmp/rpm-tmp.32781 (%build) ended at: Tue Nov 28 23:59:03 2017, done in 0:00:19.104273 error: No files produced. mesg: ttyname failed: Inappropriate ioctl for device + chmod -R u+rwX /tmp/B.jXlV1P/BUILD + rm -rf /tmp/B.jXlV1P/tmp /tmp/B.jXlV1P/BUILD mesg: ttyname failed: Inappropriate ioctl for device + rm -rf /tmp/B.jXlV1P Begin-PLD-Builder-Info Build-Time: user:62.83s sys:4.55s real:26.89s (faults io:0 non-io:1480663) End-PLD-Builder-Info
[Back to list of logs] [View rpm -qa of builder]