FailedOk

th/SRPMS[OK]
th/x32[OK]
th/i686[OK]
th/x86_64[OK]

ac/SRPMS[OK]
ac/i386[OK]
ac/i586[OK]
ac/i686[OK]
ac/alpha[OK]
ac/amd64[OK]
ac/athlon[OK]
ac/ppc[OK]
ac/sparc[OK]
ac/sparc64[OK]

Advanced Search
main()
Powered by PLD Linux
(c) 2002-2018 PLD Team
$Revision: 1.37 $
Powered by /dev/zero.
Your IP: 54.81.183.183

abrt 335e87be-215e-4acf-b134-93f8e42c9e3b

Status:Failed
Source URL:ftp://buildlogs.pld-linux.org/th/x86_64/FAIL/abrt,335e87be-215e-4acf-b134-93f8e42c9e3b.bz2
text/plain URL:View!
full text:View!
rpm -qa of builder:View!
Date:2018/05/14 03:59:10
Runtime:0:00:16.671641

Toc:

  • error 1
  • rpm: error: Failed build dependencies:
  • error 2
  • rpm: error: Failed build dependencies:
  • prep
  • Executing(%prep): /bin/sh -e /tmp/B.NO1CvO/BUILD/tmp/rpm-tmp.97566
  • build
  • Executing(%build): /bin/sh -e /tmp/B.NO1CvO/BUILD/tmp/rpm-tmp.97566
  • error 3
  • hooklib.c:78:13: error: incompatible type for argument 1 of 'log'
  • error 4
  • hooklib.c:78:9: error: too many arguments to function 'log'
  • error 5
  • hooklib.c:253:9: error: incompatible type for argument 1 of 'log'
  • error 6
  • hooklib.c:364:17: error: incompatible type for argument 1 of 'log'
  • error 7
  • hooklib.c:364:13: error: too many arguments to function 'log'
  • error 8
  • hooklib.c:368:17: error: incompatible type for argument 1 of 'log'
  • error 9
  • hooklib.c:368:13: error: too many arguments to function 'log'
  • error 10
  • hooklib.c:440:13: error: incompatible type for argument 1 of 'log'
  • error 11
  • hooklib.c:440:9: error: too many arguments to function 'log'
  • error 12
  • make[3]: *** [Makefile:650: libabrt_la-hooklib.lo] Error 1
  • error 13
  • kernel.c:74:28: error: incompatible type for argument 1 of 'log'
  • error 14
  • kernel.c:549:17: error: incompatible type for argument 1 of 'log'
  • error 15
  • kernel.c:549:13: error: too many arguments to function 'log'
  • error 16
  • kernel.c:551:17: error: incompatible type for argument 1 of 'log'
  • error 17
  • make[3]: *** [Makefile:671: libabrt_la-kernel.lo] Error 1
  • error 18
  • problem_api.c:93:13: error: incompatible type for argument 1 of 'log'
  • error 19
  • problem_api.c:93:9: error: too many arguments to function 'log'
  • error 20
  • make[3]: *** [Makefile:699: libabrt_la-problem_api.lo] Error 1
  • error 21
  • ignored_problems.c:179:19: error: incompatible type for argument 1 of 'log'
  • error 22
  • ignored_problems.c:179:15: error: too many arguments to function 'log'
  • error 23
  • ignored_problems.c:198:15: error: incompatible type for argument 1 of 'log'
  • error 24
  • ignored_problems.c:198:11: error: too many arguments to function 'log'
  • error 25
  • make[3]: *** [Makefile:713: libabrt_la-ignored_problems.lo] Error 1
  • error 26
  • make[2]: *** [Makefile:475: all-recursive] Error 1
  • error 27
  • make[1]: *** [Makefile:757: all-recursive] Error 1
  • error 28
  • error: Bad exit status from /tmp/B.NO1CvO/BUILD/tmp/rpm-tmp.97566 (%build)
  • error 29
  • RPM build errors:
  • error 30
  • error: No files produced.

Content:

checking if we should skip the build
started at: Mon May 14 03:58:32 2018
killing old processes on a builder
mesg: ttyname failed: Inappropriate ioctl for device
sending signal 9 to pid -1
Killed
fetching https://srcbuilder.pld-linux.org/th//srpms/335e87be-215e-4acf-b134-93f8e42c9e3b/abrt-2.10.0-3.src.rpm
fetched 2856528 bytes, 2610.6 K/s
installing srpm: abrt-2.10.0-3.src.rpm
mesg: ttyname failed: Inappropriate ioctl for device
+ install -d /tmp/B.NO1CvO/BUILD /tmp/B.NO1CvO/RPMS
+ LC_ALL=en_US.UTF-8
+ rpm -qp --changelog abrt-2.10.0-3.src.rpm
* Mon May 14 2018 PLD Linux Team <feedback@pld-linux.org>
- For complete changelog see: http://git.pld-linux.org/?p=packages/abrt.git;a=log;h=master
+ rpm -Uhv --nodeps --define '_topdir /tmp/B.NO1CvO' --define '_specdir %{_topdir}' --define '_sourcedir %{_specdir}' --define '_rpmdir %{_topdir}/RPMS' --define '_builddir %{_topdir}/BUILD' abrt-2.10.0-3.src.rpm Preparing... ################################################## abrt ################################################## + rm -f abrt-2.10.0-3.src.rpm mesg: ttyname failed: Inappropriate ioctl for device + install -m 700 -d /tmp/B.NO1CvO/BUILD/tmp mesg: ttyname failed: Inappropriate ioctl for device + TMPDIR=/tmp/B.NO1CvO/BUILD/tmp + exec nice -n 0 rpmbuild -bp --short-circuit --nodeps --define '_topdir /tmp/B.NO1CvO' --define '_specdir %{_topdir}' --define '_sourcedir %{_specdir}' --define '_rpmdir %{_topdir}/RPMS' --define '_builddir %{_topdir}/BUILD' --target x86_64-pld-linux --define 'prep exit 0' /tmp/B.NO1CvO/abrt.spec Building target platforms: x86_64-pld-linux checking BuildConflict-ing packages no BuildConflicts found checking BR rpm: error: Failed build dependencies: rpm: libreport-devel >= 2.9.0 is needed by abrt-2.10.0-3.src rpm: libreport-gtk-devel >= 2.9.0 is needed by abrt-2.10.0-3.src rpm: libreport-web-devel >= 2.9.0 is needed by abrt-2.10.0-3.src rpm: Building target platforms: x86_64-pld-linux updating poldek cache... ready is up to date Retrieving th::packages.ndir.md... th is up to date Retrieving th::packages.ndir.md... th is up to date Retrieving th-ready::packages.ndir.md... th-ready is up to date Retrieving th-ready::packages.ndir.md... th-ready is up to date Retrieving th-test::packages.ndir.md... th-test is up to date Retrieving th-test::packages.ndir.md... th-test is up to date checking conflicting packages in BRed packages poldek: Loading [pndir]ready... poldek: Loading [pndir]th-test... poldek: Loading [pndir]th-test... poldek: Loading [pndir]th-ready... poldek: Loading [pndir]th-ready... poldek: Loading [pndir]th... poldek: Loading [pndir]th... poldek: 27547 packages read poldek: Removed 756 duplicate packages from available set poldek: Processing dependencies... poldek: libreport-devel-2.9.5-3.x86_64 marks libreport-2.9.5-3.x86_64 (cap libreport = 2.9.5-3) poldek: libreport-gtk-devel-2.9.5-3.x86_64 marks libreport-gtk-2.9.5-3.x86_64 (cap libreport-gtk = 2.9.5-3) poldek: libreport-web-devel-2.9.5-3.x86_64 marks libreport-web-2.9.5-3.x86_64 (cap libreport-web = 2.9.5-3) poldek: There are 6 packages to install (3 marked by dependencies): poldek: I libreport-devel-2.9.5-3.x86_64 libreport-gtk-devel-2.9.5-3.x86_64 poldek: I libreport-web-devel-2.9.5-3.x86_64 poldek: D libreport-2.9.5-3.x86_64 libreport-gtk-2.9.5-3.x86_64 poldek: D libreport-web-2.9.5-3.x86_64 poldek: This operation will use 2.7MB of disk space. poldek: Need to get 547.7KB of archives (547.7KB to download). poldek: poldek: Retrieving [1/6] th-test::libreport-2.9.5-3.x86_64.rpm... poldek: ..............................done poldek: Retrieving [2/6] th-test::libreport-devel-2.9.5-3.x86_64.rpm... poldek: ..............................done poldek: Retrieving [3/6] th-test::libreport-gtk-2.9.5-3.x86_64.rpm... poldek: ..............................done poldek: Retrieving [4/6] th-test::libreport-gtk-devel-2.9.5-3.x86_64.rpm... poldek: ..............................done poldek: Retrieving [5/6] th-test::libreport-web-2.9.5-3.x86_64.rpm... poldek: ..............................done poldek: Retrieving [6/6] th-test::libreport-web-devel-2.9.5-3.x86_64.rpm... poldek: ..............................done poldek: Executing pm-command.sh --upgrade -vh --test --root / --define _check_dirname_deps 1... poldek: Preparing... ################################################## no conflicts found checking BR rpm: error: Failed build dependencies: rpm: libreport-devel >= 2.9.0 is needed by abrt-2.10.0-3.src rpm: libreport-gtk-devel >= 2.9.0 is needed by abrt-2.10.0-3.src rpm: libreport-web-devel >= 2.9.0 is needed by abrt-2.10.0-3.src rpm: Building target platforms: x86_64-pld-linux installing BR: libreport\-devel libreport\-gtk\-devel libreport\-web\-devel + poldek --noask --caplookup -Q -v '--ignore=hhvm-*' '--ignore=php4-*' '--ignore=php52-*' '--ignore=php54-*' '--ignore=php55-*' '--ignore=php56-*' '--ignore=php70-*' '--ignore=php71-*' '--ignore=php72-*' --upgrade libreport-devel libreport-gtk-devel libreport-web-devel Loading [pndir]ready... Loading [pndir]th-test... Loading [pndir]th-test... Loading [pndir]th-ready... Loading [pndir]th-ready... Loading [pndir]th... Loading [pndir]th... 27547 packages read Removed 756 duplicate packages from available set Processing dependencies... libreport-devel-2.9.5-3.x86_64 marks libreport-2.9.5-3.x86_64 (cap libreport = 2.9.5-3) libreport-gtk-devel-2.9.5-3.x86_64 marks libreport-gtk-2.9.5-3.x86_64 (cap libreport-gtk = 2.9.5-3) libreport-web-devel-2.9.5-3.x86_64 marks libreport-web-2.9.5-3.x86_64 (cap libreport-web = 2.9.5-3) There are 6 packages to install (3 marked by dependencies): I libreport-devel-2.9.5-3.x86_64 libreport-gtk-devel-2.9.5-3.x86_64 I libreport-web-devel-2.9.5-3.x86_64 D libreport-2.9.5-3.x86_64 libreport-gtk-2.9.5-3.x86_64 D libreport-web-2.9.5-3.x86_64 This operation will use 2.7MB of disk space. Need to get 547.7KB of archives. Executing pm-command.sh --upgrade -vh --root / --define _check_dirname_deps 1... Preparing... ################################################## libreport ################################################## libreport-gtk ################################################## libreport-web ################################################## libreport-devel ################################################## libreport-gtk-devel ################################################## libreport-web-devel ################################################## building RPM using: set -ex; : build-id: 335e87be-215e-4acf-b134-93f8e42c9e3b; TMPDIR=/tmp/B.NO1CvO/BUILD/tmp exec nice -n 0 rpmbuild -bb --define '_smp_mflags -j9' --define '_make_opts -Otarget' --define '_pld_builder 1' --define '_topdir /tmp/B.NO1CvO' --define '_specdir %{_topdir}' --define '_sourcedir %{_specdir}' --define '_rpmdir %{_topdir}/RPMS' --define '_builddir %{_topdir}/BUILD' --target x86_64-pld-linux /tmp/B.NO1CvO/abrt.spec mesg: ttyname failed: Inappropriate ioctl for device + : build-id: 335e87be-215e-4acf-b134-93f8e42c9e3b + TMPDIR=/tmp/B.NO1CvO/BUILD/tmp + exec nice -n 0 rpmbuild -bb --define '_smp_mflags -j9' --define '_make_opts -Otarget' --define '_pld_builder 1' --define '_topdir /tmp/B.NO1CvO' --define '_specdir %{_topdir}' --define '_sourcedir %{_specdir}' --define '_rpmdir %{_topdir}/RPMS' --define '_builddir %{_topdir}/BUILD' --target x86_64-pld-linux /tmp/B.NO1CvO/abrt.spec Building target platforms: x86_64-pld-linux Executing(%prep): /bin/sh -e /tmp/B.NO1CvO/BUILD/tmp/rpm-tmp.97566 + umask 022 + cd /tmp/B.NO1CvO/BUILD + cd /tmp/B.NO1CvO/BUILD + rm -rf abrt-2.10.0 + /usr/bin/gzip -dc /tmp/B.NO1CvO/abrt-2.10.0.tar.gz + /bin/tar -xf - + STATUS=0 + '[' 0 -ne 0 ']' + cd abrt-2.10.0 + /bin/id -u + '[' 1000 '=' 0 ']' + /bin/id -u + '[' 1000 '=' 0 ']' + /bin/chmod -Rf a+rX,u+w,g-w,o-w . + echo 'Patch #0 (abrt-rpm5.patch):' Patch #0 (abrt-rpm5.patch): + '[' -f /tmp/B.NO1CvO/abrt-rpm5.patch ']' + /bin/cat /tmp/B.NO1CvO/abrt-rpm5.patch + /usr/bin/patch -s -p1 + echo 'Patch #2 (abrt-link.patch):' Patch #2 (abrt-link.patch): + '[' -f /tmp/B.NO1CvO/abrt-link.patch ']' + /bin/cat /tmp/B.NO1CvO/abrt-link.patch + /usr/bin/patch -s -p1 + /bin/sed -n -e '/^%changelog/,$p' abrt.spec.in + >changelog + tail -n +2 + exit 0 Executing(%build): /bin/sh -e /tmp/B.NO1CvO/BUILD/tmp/rpm-tmp.97566 TMP=/home/users/builder/tmp HOME=/home/users/builder PATH=/home/users/builder/GNUstep/Tools:/usr/local/bin:/usr/bin:/bin:/home/users/builder/bin TMPDIR=/tmp/B.NO1CvO/BUILD/tmp + umask 022 + cd /tmp/B.NO1CvO/BUILD + cd abrt-2.10.0 + libtoolize --copy --force --install libtoolize: putting auxiliary files in '.'. libtoolize: copying file './config.guess' libtoolize: copying file './config.sub' libtoolize: copying file './install-sh' libtoolize: copying file './ltmain.sh' libtoolize: putting macros in AC_CONFIG_MACRO_DIRS, 'm4'. libtoolize: copying file 'm4/libtool.m4' libtoolize: copying file 'm4/ltoptions.m4' libtoolize: copying file 'm4/ltsugar.m4' libtoolize: copying file 'm4/ltversion.m4' libtoolize: copying file 'm4/lt~obsolete.m4' + aclocal -I m4 + autoconf + autoheader + automake -a -c -f --foreign configure.ac:52: warning: The 'AM_PROG_MKDIR_P' macro is deprecated, and its use is discouraged. configure.ac:52: You should use the Autoconf-provided 'AC_PROG_MKDIR_P' macro instead, configure.ac:52: and use '$(MKDIR_P)' instead of '$(mkdir_p)'in your Makefile.am files. configure.ac:31: installing './compile' configure.ac:23: installing './missing' doc/Makefile.am:107: warning: '%'-style pattern rules are a GNU make extension doc/dbus-configuration/Makefile.am:1: warning: wildcard *.xml.in: non-POSIX variable name doc/dbus-configuration/Makefile.am:1: (probably a GNU make extension) doc/dbus-configuration/Makefile.am:3: warning: '%'-style pattern rules are a GNU make extension src/applet/Makefile.am: installing './depcomp' src/dbus/Makefile.am:142: warning: eventsconfdir multiply defined in condition TRUE ... src/dbus/Makefile.am:11: ... 'eventsconfdir' previously defined here src/hooks/Makefile.am:94: warning: ':='-style assignments are not portable src/hooks/Makefile.am:94: warning: notdir $(wildcard *~: non-POSIX variable name src/hooks/Makefile.am:94: (probably a GNU make extension) src/plugins/Makefile.am:483: warning: '%'-style pattern rules are a GNU make extension src/python-problem/doc/Makefile.am:13: warning: PAPEROPT_$(PAPER: non-POSIX recursive variable expansion src/python-problem/doc/Makefile.am:15: warning: PAPEROPT_$(PAPER: non-POSIX recursive variable expansion + ./configure 'LDFLAGS=-Wl,--as-needed -Wl,--no-copy-dt-needed-entries -Wl,-z,relro -Wl,-z,combreloc ' 'CFLAGS=-O2 -fwrapv -pipe -Wformat -Werror=format-security -gdwarf-4 -fno-debug-types-section -fvar-tracking-assignments -g2 -Wp,-D_FORTIFY_SOURCE=2 -fstack-protector-strong --param=ssp-buffer-size=4 -fPIC -march=x86-64 -gdwarf-4 -fno-debug-types-section -fvar-tracking-assignments -g2 ' 'CXXFLAGS=-O2 -fwrapv -pipe -Wformat -Werror=format-security -gdwarf-4 -fno-debug-types-section -fvar-tracking-assignments -g2 -Wp,-D_FORTIFY_SOURCE=2 -fstack-protector-strong --param=ssp-buffer-size=4 -fPIC -march=x86-64 -gdwarf-4 -fno-debug-types-section -fvar-tracking-assignments -g2 ' 'FFLAGS=-O2 -fwrapv -pipe -Wformat -Werror=format-security -gdwarf-4 -fno-debug-types-section -fvar-tracking-assignments -g2 -Wp,-D_FORTIFY_SOURCE=2 -fstack-protector-strong --param=ssp-buffer-size=4 -fPIC -march=x86-64 -gdwarf-4 -fno-debug-types-section -fvar-tracking-assignments -g2 ' 'FCFLAGS=-O2 -fwrapv -pipe -Wformat -Werror=format-security -gdwarf-4 -fno-debug-types-section -fvar-tracking-assignments -g2 -Wp,-D_FORTIFY_SOURCE=2 -fstack-protector-strong --param=ssp-buffer-size=4 -fPIC -march=x86-64 -gdwarf-4 -fno-debug-types-section -fvar-tracking-assignments -g2 ' 'CPPFLAGS=' 'CC=x86_64-pld-linux-gcc' 'CXX=x86_64-pld-linux-g++' '--host=x86_64-pld-linux' '--build=x86_64-pld-linux' '--prefix=/usr' '--exec-prefix=/usr' '--bindir=/usr/bin' '--sbindir=/usr/sbin' '--sysconfdir=/etc' '--datadir=/usr/share' '--includedir=/usr/include' '--libdir=/usr/lib64' '--libexecdir=/usr/libexec' '--localstatedir=/var' '--sharedstatedir=/var/lib' '--mandir=/usr/share/man' '--infodir=/usr/share/info' '--x-libraries=/usr/lib64' --disable-silent-rules '--with-systemdsystemunitdir=/lib/systemd/system' checking for a BSD-compatible install... /usr/bin/install -c checking whether build environment is sane... yes checking for a thread-safe mkdir -p... /bin/mkdir -p checking for mawk... mawk checking whether make sets $(MAKE)... yes checking whether make supports nested variables... yes checking whether UID '1000' is supported by ustar format... yes checking whether GID '1000' is supported by ustar format... yes checking how to create a ustar tar archive... gnutar checking whether make supports nested variables... (cached) yes checking whether make supports nested variables... (cached) yes checking whether make supports the include directive... yes (GNU style) checking for x86_64-pld-linux-gcc... x86_64-pld-linux-gcc checking whether the C compiler works... yes checking for C compiler default output file name... a.out checking for suffix of executables... checking whether we are cross compiling... no checking for suffix of object files... o checking whether we are using the GNU C compiler... yes checking whether x86_64-pld-linux-gcc accepts -g... yes checking for x86_64-pld-linux-gcc option to accept ISO C89... none needed checking whether x86_64-pld-linux-gcc understands -c and -o together... yes checking dependency style of x86_64-pld-linux-gcc... gcc3 checking for x86_64-pld-linux-ar... no checking for x86_64-pld-linux-lib... no checking for x86_64-pld-linux-link... no checking for ar... ar checking the archiver (ar) interface... ar checking build system type... x86_64-pld-linux-gnu checking host system type... x86_64-pld-linux-gnu checking how to print strings... print -r checking for a sed that does not truncate output... /bin/sed checking for grep that handles long lines and -e... /bin/grep checking for egrep... /bin/grep -E checking for fgrep... /bin/grep -F checking for ld used by x86_64-pld-linux-gcc... /usr/bin/ld checking if the linker (/usr/bin/ld) is GNU ld... yes checking for BSD- or MS-compatible name lister (nm)... /usr/bin/nm -B checking the name lister (/usr/bin/nm -B) interface... BSD nm checking whether ln -s works... yes checking the maximum length of command line arguments... 1572864 checking how to convert x86_64-pld-linux-gnu file names to x86_64-pld-linux-gnu format... func_convert_file_noop checking how to convert x86_64-pld-linux-gnu file names to toolchain format... func_convert_file_noop checking for /usr/bin/ld option to reload object files... -r checking for x86_64-pld-linux-objdump... no checking for objdump... objdump checking how to recognize dependent libraries... pass_all checking for x86_64-pld-linux-dlltool... no checking for dlltool... no checking how to associate runtime and link libraries... print -r -- checking for x86_64-pld-linux-ar... ar checking for archiver @FILE support... @ checking for x86_64-pld-linux-strip... no checking for strip... strip checking for x86_64-pld-linux-ranlib... no checking for ranlib... ranlib checking command to parse /usr/bin/nm -B output from x86_64-pld-linux-gcc object... ok checking for sysroot... no checking for a working dd... /bin/dd checking how to truncate binary pipes... /bin/dd bs=4096 count=1 checking for x86_64-pld-linux-mt... no checking for mt... no checking if : is a manifest tool... no checking how to run the C preprocessor... x86_64-pld-linux-gcc -E checking for ANSI C header files... yes checking for sys/types.h... yes checking for sys/stat.h... yes checking for stdlib.h... yes checking for string.h... yes checking for memory.h... yes checking for strings.h... yes checking for inttypes.h... yes checking for stdint.h... yes checking for unistd.h... yes checking for dlfcn.h... yes checking for objdir... .libs checking if x86_64-pld-linux-gcc supports -fno-rtti -fno-exceptions... no checking for x86_64-pld-linux-gcc option to produce PIC... -fPIC -DPIC checking if x86_64-pld-linux-gcc PIC flag -fPIC -DPIC works... yes checking if x86_64-pld-linux-gcc static flag -static works... yes checking if x86_64-pld-linux-gcc supports -c -o file.o... yes checking if x86_64-pld-linux-gcc supports -c -o file.o... (cached) yes checking whether the x86_64-pld-linux-gcc linker (/usr/bin/ld -m elf_x86_64) supports shared libraries... yes checking whether -lc should be explicitly linked in... no checking dynamic linker characteristics... GNU/Linux ld.so checking how to hardcode library paths into programs... immediate checking whether stripping libraries is possible... yes checking if libtool supports shared libraries... yes checking whether to build shared libraries... yes checking whether to build static libraries... no checking for x86_64-pld-linux-gcc... (cached) x86_64-pld-linux-gcc checking whether we are using the GNU C compiler... (cached) yes checking whether x86_64-pld-linux-gcc accepts -g... (cached) yes checking for x86_64-pld-linux-gcc option to accept ISO C89... (cached) none needed checking whether x86_64-pld-linux-gcc understands -c and -o together... (cached) yes checking dependency style of x86_64-pld-linux-gcc... (cached) gcc3 checking whether ln -s works... yes checking for special C compiler options needed for large files... no checking for _FILE_OFFSET_BITS value needed for large files... no checking whether NLS is requested... yes checking for msgfmt... /usr/bin/msgfmt checking for gmsgfmt... /usr/bin/msgfmt checking for xgettext... /usr/bin/xgettext checking for msgmerge... /usr/bin/msgmerge checking for ld used by GCC... /usr/bin/ld -m elf_x86_64 checking if the linker (/usr/bin/ld -m elf_x86_64) is GNU ld... yes checking for shared library run path origin... done checking for CFPreferencesCopyAppValue... no checking for CFLocaleCopyCurrent... no checking for GNU gettext in libc... yes checking whether to use NLS... yes checking where the gettext function comes from... libc checking for intltool >= 0.35.0... 0.51.0 found checking for intltool-update... /usr/bin/intltool-update checking for intltool-merge... /usr/bin/intltool-merge checking for intltool-extract... /usr/bin/intltool-extract checking for xgettext... (cached) /usr/bin/xgettext checking for msgmerge... (cached) /usr/bin/msgmerge checking for msgfmt... (cached) /usr/bin/msgfmt checking for gmsgfmt... (cached) /usr/bin/msgfmt checking for perl... /usr/bin/perl checking for perl >= 5.8.1... 5.26.1 checking for XML::Parser... ok checking for python... /usr/bin/python checking for python version... 2.7 checking for python platform... linux2 checking for python script directory... ${prefix}/share/python2.7/site-packages checking for python extension module directory... ${exec_prefix}/lib64/python2.7/site-packages checking for asciidoc... /usr/bin/asciidoc checking for xmlto... /usr/bin/xmlto checking for python-config... /usr/bin/python-config checking for python3... /usr/bin/python3 checking for python3-config... /usr/bin/python3-config checking for sphinx-build... /usr/bin/sphinx-build checking for nosetests... /usr/bin/nosetests checking for x86_64-pld-linux-pkg-config... no checking for pkg-config... /usr/bin/pkg-config checking pkg-config is at least version 0.9.0... yes checking for gtk+-3.0... yes checking for glib-2.0 >= 2.43... yes checking for dbus-1... yes checking for libxml-2.0... yes checking for rpm... yes checking for libnotify >= 0.7.0... yes checking for nss... yes checking for libreport... yes checking for libreport-gtk... yes checking for polkit-gobject-1... yes checking for polkit-agent-1... yes checking for gio-2.0... yes checking for gio-unix-2.0... yes checking for satyr... yes checking for libsystemd... yes checking for gsettings-desktop-schemas >= 3.15.1... yes checking for x86_64-pld-linux-pkg-config... /usr/bin/pkg-config checking pkg-config is at least version 0.9.0... yes checking sys/inotify.h usability... yes checking sys/inotify.h presence... yes checking for sys/inotify.h... yes checking locale.h usability... yes checking locale.h presence... yes checking for locale.h... yes checking for augparse... /usr/bin/augparse checking for findmnt... /bin/findmnt checking for gdb... /usr/bin/gdb checking for doxygen... /usr/bin/doxygen checking whether to build Doxygen documentation... no checking for json... no checking for json-c... yes checking for libreport-web... yes checking for hawkey... yes checking for libselinux... yes checking for valgrind... valgrind checking that generated files are newer than configure... done configure: creating ./config.status config.status: creating tests/Makefile config.status: creating tests/atlocal config.status: creating Makefile config.status: creating abrt.pc config.status: creating abrt.spec config.status: creating apidoc/Makefile config.status: creating apidoc/Doxyfile config.status: creating apidoc/html/Makefile config.status: creating doc/Makefile config.status: creating doc/problems-service/Makefile config.status: creating doc/dbus-configuration/Makefile config.status: creating src/include/Makefile config.status: creating src/lib/Makefile config.status: creating src/plugins/Makefile config.status: creating src/Makefile config.status: creating src/daemon/Makefile config.status: creating src/daemon/abrt-handle-upload config.status: creating src/hooks/Makefile config.status: creating src/applet/Makefile config.status: creating src/cli/Makefile config.status: creating src/cli-ng/Makefile config.status: creating src/cli-ng/abrtcli/Makefile config.status: creating src/cli-ng/tests/Makefile config.status: creating src/cli-ng/tests/clitests/Makefile config.status: creating src/configuration-gui/Makefile config.status: creating src/configuration-gui/abrt_gui.pc config.status: creating src/dbus/Makefile config.status: creating src/plugins/abrt-action-install-debuginfo config.status: creating src/plugins/abrt-action-analyze-vmcore config.status: creating src/plugins/abrt-action-analyze-vulnerability config.status: creating src/plugins/abrt-action-check-oops-for-hw-error config.status: creating src/plugins/abrt-action-check-oops-for-alt-component config.status: creating src/python-problem/Makefile config.status: creating src/python-problem/doc/Makefile config.status: creating src/python-problem/tests/Makefile config.status: creating src/python-problem/problem/Makefile config.status: creating src/python-problem/examples/Makefile config.status: creating po/Makefile.in config.status: creating icons/Makefile config.status: creating config.h config.status: executing depfiles commands config.status: executing libtool commands config.status: executing po-directories commands config.status: creating po/POTFILES config.status: creating po/Makefile config.status: executing tests/atconfig commands config.status: executing po/stamp-it commands + /usr/bin/make -Otarget -j9 (CDPATH="${ZSH_VERSION+.}:" && cd . && /bin/sh /tmp/B.NO1CvO/BUILD/abrt-2.10.0/missing autoheader) rm -f stamp-h1 touch config.h.in cd . && /bin/sh ./config.status config.h config.status: creating config.h config.status: config.h is unchanged /usr/bin/make all-recursive Making all in src Making all in include make[3]: Nothing to be done for 'all'. Making all in lib make[3]: Entering directory '/tmp/B.NO1CvO/BUILD/abrt-2.10.0/src/lib' /bin/sh ../../libtool --tag=CC --mode=compile x86_64-pld-linux-gcc -DLOCALEDIR=\"/usr/share/locale\" -DHAVE_CONFIG_H -I. -I../.. -I./../include -I./../lib -DVAR_RUN=\"/var/run\" -DCONF_DIR=\"/etc/abrt\" -DDEFAULT_CONF_DIR=\"/usr/share/abrt/conf.d\" -DPLUGINS_CONF_DIR=\"/etc/abrt/plugins\" -DDEFAULT_PLUGINS_CONF_DIR=\"/usr/share/abrt/conf.d/plugins\" -DEVENTS_DIR=\"/usr/share/libreport/events\" -DDEFAULT_DUMP_LOCATION=\"/var/spool/abrt\" -DGDB=\"/usr/bin/gdb\" -I/usr/include/glib-2.0 -I/usr/lib64/glib-2.0/include -I/usr/include/libreport -I/usr/include/glib-2.0 -I/usr/lib64/glib-2.0/include -pthread -I/usr/include/glib-2.0 -I/usr/lib64/glib-2.0/include -D_GNU_SOURCE -O2 -fwrapv -pipe -Wformat -Werror=format-security -gdwarf-4 -fno-debug-types-section -fvar-tracking-assignments -g2 -Wp,-D_FORTIFY_SOURCE=2 -fstack-protector-strong --param=ssp-buffer-size=4 -fPIC -march=x86-64 -gdwarf-4 -fno-debug-types-section -fvar-tracking-assignments -g2 -D_LARGEFILE_SOURCE -D_LARGEFILE64_SOURCE -D_FILE_OFFSET_BITS=64 -fno-strict-aliasing -std=gnu99 -Wall -Wwrite-strings -MT libabrt_la-libabrt_init.lo -MD -MP -MF .deps/libabrt_la-libabrt_init.Tpo -c -o libabrt_la-libabrt_init.lo `test -f 'libabrt_init.c' || echo './'`libabrt_init.c libtool: compile: x86_64-pld-linux-gcc -DLOCALEDIR=\"/usr/share/locale\" -DHAVE_CONFIG_H -I. -I../.. -I./../include -I./../lib -DVAR_RUN=\"/var/run\" -DCONF_DIR=\"/etc/abrt\" -DDEFAULT_CONF_DIR=\"/usr/share/abrt/conf.d\" -DPLUGINS_CONF_DIR=\"/etc/abrt/plugins\" -DDEFAULT_PLUGINS_CONF_DIR=\"/usr/share/abrt/conf.d/plugins\" -DEVENTS_DIR=\"/usr/share/libreport/events\" -DDEFAULT_DUMP_LOCATION=\"/var/spool/abrt\" -DGDB=\"/usr/bin/gdb\" -I/usr/include/glib-2.0 -I/usr/lib64/glib-2.0/include -I/usr/include/libreport -I/usr/include/glib-2.0 -I/usr/lib64/glib-2.0/include -pthread -I/usr/include/glib-2.0 -I/usr/lib64/glib-2.0/include -D_GNU_SOURCE -O2 -fwrapv -pipe -Wformat -Werror=format-security -gdwarf-4 -fno-debug-types-section -fvar-tracking-assignments -g2 -Wp,-D_FORTIFY_SOURCE=2 -fstack-protector-strong --param=ssp-buffer-size=4 -fPIC -march=x86-64 -gdwarf-4 -fno-debug-types-section -fvar-tracking-assignments -g2 -D_LARGEFILE_SOURCE -D_LARGEFILE64_SOURCE -D_FILE_OFFSET_BITS=64 -fno-strict-aliasing -std=gnu99 -Wall -Wwrite-strings -MT libabrt_la-libabrt_init.lo -MD -MP -MF .deps/libabrt_la-libabrt_init.Tpo -c libabrt_init.c -fPIC -DPIC -o .libs/libabrt_la-libabrt_init.o mv -f .deps/libabrt_la-libabrt_init.Tpo .deps/libabrt_la-libabrt_init.Plo make[3]: Leaving directory '/tmp/B.NO1CvO/BUILD/abrt-2.10.0/src/lib' make[3]: Entering directory '/tmp/B.NO1CvO/BUILD/abrt-2.10.0/src/lib' /bin/sh ../../libtool --tag=CC --mode=compile x86_64-pld-linux-gcc -DLOCALEDIR=\"/usr/share/locale\" -DHAVE_CONFIG_H -I. -I../.. -I./../include -I./../lib -DVAR_RUN=\"/var/run\" -DCONF_DIR=\"/etc/abrt\" -DDEFAULT_CONF_DIR=\"/usr/share/abrt/conf.d\" -DPLUGINS_CONF_DIR=\"/etc/abrt/plugins\" -DDEFAULT_PLUGINS_CONF_DIR=\"/usr/share/abrt/conf.d/plugins\" -DEVENTS_DIR=\"/usr/share/libreport/events\" -DDEFAULT_DUMP_LOCATION=\"/var/spool/abrt\" -DGDB=\"/usr/bin/gdb\" -I/usr/include/glib-2.0 -I/usr/lib64/glib-2.0/include -I/usr/include/libreport -I/usr/include/glib-2.0 -I/usr/lib64/glib-2.0/include -pthread -I/usr/include/glib-2.0 -I/usr/lib64/glib-2.0/include -D_GNU_SOURCE -O2 -fwrapv -pipe -Wformat -Werror=format-security -gdwarf-4 -fno-debug-types-section -fvar-tracking-assignments -g2 -Wp,-D_FORTIFY_SOURCE=2 -fstack-protector-strong --param=ssp-buffer-size=4 -fPIC -march=x86-64 -gdwarf-4 -fno-debug-types-section -fvar-tracking-assignments -g2 -D_LARGEFILE_SOURCE -D_LARGEFILE64_SOURCE -D_FILE_OFFSET_BITS=64 -fno-strict-aliasing -std=gnu99 -Wall -Wwrite-strings -MT libabrt_la-check_recent_crash_file.lo -MD -MP -MF .deps/libabrt_la-check_recent_crash_file.Tpo -c -o libabrt_la-check_recent_crash_file.lo `test -f 'check_recent_crash_file.c' || echo './'`check_recent_crash_file.c libtool: compile: x86_64-pld-linux-gcc -DLOCALEDIR=\"/usr/share/locale\" -DHAVE_CONFIG_H -I. -I../.. -I./../include -I./../lib -DVAR_RUN=\"/var/run\" -DCONF_DIR=\"/etc/abrt\" -DDEFAULT_CONF_DIR=\"/usr/share/abrt/conf.d\" -DPLUGINS_CONF_DIR=\"/etc/abrt/plugins\" -DDEFAULT_PLUGINS_CONF_DIR=\"/usr/share/abrt/conf.d/plugins\" -DEVENTS_DIR=\"/usr/share/libreport/events\" -DDEFAULT_DUMP_LOCATION=\"/var/spool/abrt\" -DGDB=\"/usr/bin/gdb\" -I/usr/include/glib-2.0 -I/usr/lib64/glib-2.0/include -I/usr/include/libreport -I/usr/include/glib-2.0 -I/usr/lib64/glib-2.0/include -pthread -I/usr/include/glib-2.0 -I/usr/lib64/glib-2.0/include -D_GNU_SOURCE -O2 -fwrapv -pipe -Wformat -Werror=format-security -gdwarf-4 -fno-debug-types-section -fvar-tracking-assignments -g2 -Wp,-D_FORTIFY_SOURCE=2 -fstack-protector-strong --param=ssp-buffer-size=4 -fPIC -march=x86-64 -gdwarf-4 -fno-debug-types-section -fvar-tracking-assignments -g2 -D_LARGEFILE_SOURCE -D_LARGEFILE64_SOURCE -D_FILE_OFFSET_BITS=64 -fno-strict-aliasing -std=gnu99 -Wall -Wwrite-strings -MT libabrt_la-check_recent_crash_file.lo -MD -MP -MF .deps/libabrt_la-check_recent_crash_file.Tpo -c check_recent_crash_file.c -fPIC -DPIC -o .libs/libabrt_la-check_recent_crash_file.o mv -f .deps/libabrt_la-check_recent_crash_file.Tpo .deps/libabrt_la-check_recent_crash_file.Plo make[3]: Leaving directory '/tmp/B.NO1CvO/BUILD/abrt-2.10.0/src/lib' make[3]: Entering directory '/tmp/B.NO1CvO/BUILD/abrt-2.10.0/src/lib' /bin/sh ../../libtool --tag=CC --mode=compile x86_64-pld-linux-gcc -DLOCALEDIR=\"/usr/share/locale\" -DHAVE_CONFIG_H -I. -I../.. -I./../include -I./../lib -DVAR_RUN=\"/var/run\" -DCONF_DIR=\"/etc/abrt\" -DDEFAULT_CONF_DIR=\"/usr/share/abrt/conf.d\" -DPLUGINS_CONF_DIR=\"/etc/abrt/plugins\" -DDEFAULT_PLUGINS_CONF_DIR=\"/usr/share/abrt/conf.d/plugins\" -DEVENTS_DIR=\"/usr/share/libreport/events\" -DDEFAULT_DUMP_LOCATION=\"/var/spool/abrt\" -DGDB=\"/usr/bin/gdb\" -I/usr/include/glib-2.0 -I/usr/lib64/glib-2.0/include -I/usr/include/libreport -I/usr/include/glib-2.0 -I/usr/lib64/glib-2.0/include -pthread -I/usr/include/glib-2.0 -I/usr/lib64/glib-2.0/include -D_GNU_SOURCE -O2 -fwrapv -pipe -Wformat -Werror=format-security -gdwarf-4 -fno-debug-types-section -fvar-tracking-assignments -g2 -Wp,-D_FORTIFY_SOURCE=2 -fstack-protector-strong --param=ssp-buffer-size=4 -fPIC -march=x86-64 -gdwarf-4 -fno-debug-types-section -fvar-tracking-assignments -g2 -D_LARGEFILE_SOURCE -D_LARGEFILE64_SOURCE -D_FILE_OFFSET_BITS=64 -fno-strict-aliasing -std=gnu99 -Wall -Wwrite-strings -MT libabrt_la-daemon_is_ok.lo -MD -MP -MF .deps/libabrt_la-daemon_is_ok.Tpo -c -o libabrt_la-daemon_is_ok.lo `test -f 'daemon_is_ok.c' || echo './'`daemon_is_ok.c libtool: compile: x86_64-pld-linux-gcc -DLOCALEDIR=\"/usr/share/locale\" -DHAVE_CONFIG_H -I. -I../.. -I./../include -I./../lib -DVAR_RUN=\"/var/run\" -DCONF_DIR=\"/etc/abrt\" -DDEFAULT_CONF_DIR=\"/usr/share/abrt/conf.d\" -DPLUGINS_CONF_DIR=\"/etc/abrt/plugins\" -DDEFAULT_PLUGINS_CONF_DIR=\"/usr/share/abrt/conf.d/plugins\" -DEVENTS_DIR=\"/usr/share/libreport/events\" -DDEFAULT_DUMP_LOCATION=\"/var/spool/abrt\" -DGDB=\"/usr/bin/gdb\" -I/usr/include/glib-2.0 -I/usr/lib64/glib-2.0/include -I/usr/include/libreport -I/usr/include/glib-2.0 -I/usr/lib64/glib-2.0/include -pthread -I/usr/include/glib-2.0 -I/usr/lib64/glib-2.0/include -D_GNU_SOURCE -O2 -fwrapv -pipe -Wformat -Werror=format-security -gdwarf-4 -fno-debug-types-section -fvar-tracking-assignments -g2 -Wp,-D_FORTIFY_SOURCE=2 -fstack-protector-strong --param=ssp-buffer-size=4 -fPIC -march=x86-64 -gdwarf-4 -fno-debug-types-section -fvar-tracking-assignments -g2 -D_LARGEFILE_SOURCE -D_LARGEFILE64_SOURCE -D_FILE_OFFSET_BITS=64 -fno-strict-aliasing -std=gnu99 -Wall -Wwrite-strings -MT libabrt_la-daemon_is_ok.lo -MD -MP -MF .deps/libabrt_la-daemon_is_ok.Tpo -c daemon_is_ok.c -fPIC -DPIC -o .libs/libabrt_la-daemon_is_ok.o mv -f .deps/libabrt_la-daemon_is_ok.Tpo .deps/libabrt_la-daemon_is_ok.Plo make[3]: Leaving directory '/tmp/B.NO1CvO/BUILD/abrt-2.10.0/src/lib' make[3]: Entering directory '/tmp/B.NO1CvO/BUILD/abrt-2.10.0/src/lib' /bin/sh ../../libtool --tag=CC --mode=compile x86_64-pld-linux-gcc -DLOCALEDIR=\"/usr/share/locale\" -DHAVE_CONFIG_H -I. -I../.. -I./../include -I./../lib -DVAR_RUN=\"/var/run\" -DCONF_DIR=\"/etc/abrt\" -DDEFAULT_CONF_DIR=\"/usr/share/abrt/conf.d\" -DPLUGINS_CONF_DIR=\"/etc/abrt/plugins\" -DDEFAULT_PLUGINS_CONF_DIR=\"/usr/share/abrt/conf.d/plugins\" -DEVENTS_DIR=\"/usr/share/libreport/events\" -DDEFAULT_DUMP_LOCATION=\"/var/spool/abrt\" -DGDB=\"/usr/bin/gdb\" -I/usr/include/glib-2.0 -I/usr/lib64/glib-2.0/include -I/usr/include/libreport -I/usr/include/glib-2.0 -I/usr/lib64/glib-2.0/include -pthread -I/usr/include/glib-2.0 -I/usr/lib64/glib-2.0/include -D_GNU_SOURCE -O2 -fwrapv -pipe -Wformat -Werror=format-security -gdwarf-4 -fno-debug-types-section -fvar-tracking-assignments -g2 -Wp,-D_FORTIFY_SOURCE=2 -fstack-protector-strong --param=ssp-buffer-size=4 -fPIC -march=x86-64 -gdwarf-4 -fno-debug-types-section -fvar-tracking-assignments -g2 -D_LARGEFILE_SOURCE -D_LARGEFILE64_SOURCE -D_FILE_OFFSET_BITS=64 -fno-strict-aliasing -std=gnu99 -Wall -Wwrite-strings -MT libabrt_la-notify_new_path.lo -MD -MP -MF .deps/libabrt_la-notify_new_path.Tpo -c -o libabrt_la-notify_new_path.lo `test -f 'notify_new_path.c' || echo './'`notify_new_path.c libtool: compile: x86_64-pld-linux-gcc -DLOCALEDIR=\"/usr/share/locale\" -DHAVE_CONFIG_H -I. -I../.. -I./../include -I./../lib -DVAR_RUN=\"/var/run\" -DCONF_DIR=\"/etc/abrt\" -DDEFAULT_CONF_DIR=\"/usr/share/abrt/conf.d\" -DPLUGINS_CONF_DIR=\"/etc/abrt/plugins\" -DDEFAULT_PLUGINS_CONF_DIR=\"/usr/share/abrt/conf.d/plugins\" -DEVENTS_DIR=\"/usr/share/libreport/events\" -DDEFAULT_DUMP_LOCATION=\"/var/spool/abrt\" -DGDB=\"/usr/bin/gdb\" -I/usr/include/glib-2.0 -I/usr/lib64/glib-2.0/include -I/usr/include/libreport -I/usr/include/glib-2.0 -I/usr/lib64/glib-2.0/include -pthread -I/usr/include/glib-2.0 -I/usr/lib64/glib-2.0/include -D_GNU_SOURCE -O2 -fwrapv -pipe -Wformat -Werror=format-security -gdwarf-4 -fno-debug-types-section -fvar-tracking-assignments -g2 -Wp,-D_FORTIFY_SOURCE=2 -fstack-protector-strong --param=ssp-buffer-size=4 -fPIC -march=x86-64 -gdwarf-4 -fno-debug-types-section -fvar-tracking-assignments -g2 -D_LARGEFILE_SOURCE -D_LARGEFILE64_SOURCE -D_FILE_OFFSET_BITS=64 -fno-strict-aliasing -std=gnu99 -Wall -Wwrite-strings -MT libabrt_la-notify_new_path.lo -MD -MP -MF .deps/libabrt_la-notify_new_path.Tpo -c notify_new_path.c -fPIC -DPIC -o .libs/libabrt_la-notify_new_path.o mv -f .deps/libabrt_la-notify_new_path.Tpo .deps/libabrt_la-notify_new_path.Plo make[3]: Leaving directory '/tmp/B.NO1CvO/BUILD/abrt-2.10.0/src/lib' make[3]: Entering directory '/tmp/B.NO1CvO/BUILD/abrt-2.10.0/src/lib' /bin/sh ../../libtool --tag=CC --mode=compile x86_64-pld-linux-gcc -DLOCALEDIR=\"/usr/share/locale\" -DHAVE_CONFIG_H -I. -I../.. -I./../include -I./../lib -DVAR_RUN=\"/var/run\" -DCONF_DIR=\"/etc/abrt\" -DDEFAULT_CONF_DIR=\"/usr/share/abrt/conf.d\" -DPLUGINS_CONF_DIR=\"/etc/abrt/plugins\" -DDEFAULT_PLUGINS_CONF_DIR=\"/usr/share/abrt/conf.d/plugins\" -DEVENTS_DIR=\"/usr/share/libreport/events\" -DDEFAULT_DUMP_LOCATION=\"/var/spool/abrt\" -DGDB=\"/usr/bin/gdb\" -I/usr/include/glib-2.0 -I/usr/lib64/glib-2.0/include -I/usr/include/libreport -I/usr/include/glib-2.0 -I/usr/lib64/glib-2.0/include -pthread -I/usr/include/glib-2.0 -I/usr/lib64/glib-2.0/include -D_GNU_SOURCE -O2 -fwrapv -pipe -Wformat -Werror=format-security -gdwarf-4 -fno-debug-types-section -fvar-tracking-assignments -g2 -Wp,-D_FORTIFY_SOURCE=2 -fstack-protector-strong --param=ssp-buffer-size=4 -fPIC -march=x86-64 -gdwarf-4 -fno-debug-types-section -fvar-tracking-assignments -g2 -D_LARGEFILE_SOURCE -D_LARGEFILE64_SOURCE -D_FILE_OFFSET_BITS=64 -fno-strict-aliasing -std=gnu99 -Wall -Wwrite-strings -MT libabrt_la-abrt_glib.lo -MD -MP -MF .deps/libabrt_la-abrt_glib.Tpo -c -o libabrt_la-abrt_glib.lo `test -f 'abrt_glib.c' || echo './'`abrt_glib.c libtool: compile: x86_64-pld-linux-gcc -DLOCALEDIR=\"/usr/share/locale\" -DHAVE_CONFIG_H -I. -I../.. -I./../include -I./../lib -DVAR_RUN=\"/var/run\" -DCONF_DIR=\"/etc/abrt\" -DDEFAULT_CONF_DIR=\"/usr/share/abrt/conf.d\" -DPLUGINS_CONF_DIR=\"/etc/abrt/plugins\" -DDEFAULT_PLUGINS_CONF_DIR=\"/usr/share/abrt/conf.d/plugins\" -DEVENTS_DIR=\"/usr/share/libreport/events\" -DDEFAULT_DUMP_LOCATION=\"/var/spool/abrt\" -DGDB=\"/usr/bin/gdb\" -I/usr/include/glib-2.0 -I/usr/lib64/glib-2.0/include -I/usr/include/libreport -I/usr/include/glib-2.0 -I/usr/lib64/glib-2.0/include -pthread -I/usr/include/glib-2.0 -I/usr/lib64/glib-2.0/include -D_GNU_SOURCE -O2 -fwrapv -pipe -Wformat -Werror=format-security -gdwarf-4 -fno-debug-types-section -fvar-tracking-assignments -g2 -Wp,-D_FORTIFY_SOURCE=2 -fstack-protector-strong --param=ssp-buffer-size=4 -fPIC -march=x86-64 -gdwarf-4 -fno-debug-types-section -fvar-tracking-assignments -g2 -D_LARGEFILE_SOURCE -D_LARGEFILE64_SOURCE -D_FILE_OFFSET_BITS=64 -fno-strict-aliasing -std=gnu99 -Wall -Wwrite-strings -MT libabrt_la-abrt_glib.lo -MD -MP -MF .deps/libabrt_la-abrt_glib.Tpo -c abrt_glib.c -fPIC -DPIC -o .libs/libabrt_la-abrt_glib.o mv -f .deps/libabrt_la-abrt_glib.Tpo .deps/libabrt_la-abrt_glib.Plo make[3]: Leaving directory '/tmp/B.NO1CvO/BUILD/abrt-2.10.0/src/lib' make[3]: Entering directory '/tmp/B.NO1CvO/BUILD/abrt-2.10.0/src/lib' /bin/sh ../../libtool --tag=CC --mode=compile x86_64-pld-linux-gcc -DLOCALEDIR=\"/usr/share/locale\" -DHAVE_CONFIG_H -I. -I../.. -I./../include -I./../lib -DVAR_RUN=\"/var/run\" -DCONF_DIR=\"/etc/abrt\" -DDEFAULT_CONF_DIR=\"/usr/share/abrt/conf.d\" -DPLUGINS_CONF_DIR=\"/etc/abrt/plugins\" -DDEFAULT_PLUGINS_CONF_DIR=\"/usr/share/abrt/conf.d/plugins\" -DEVENTS_DIR=\"/usr/share/libreport/events\" -DDEFAULT_DUMP_LOCATION=\"/var/spool/abrt\" -DGDB=\"/usr/bin/gdb\" -I/usr/include/glib-2.0 -I/usr/lib64/glib-2.0/include -I/usr/include/libreport -I/usr/include/glib-2.0 -I/usr/lib64/glib-2.0/include -pthread -I/usr/include/glib-2.0 -I/usr/lib64/glib-2.0/include -D_GNU_SOURCE -O2 -fwrapv -pipe -Wformat -Werror=format-security -gdwarf-4 -fno-debug-types-section -fvar-tracking-assignments -g2 -Wp,-D_FORTIFY_SOURCE=2 -fstack-protector-strong --param=ssp-buffer-size=4 -fPIC -march=x86-64 -gdwarf-4 -fno-debug-types-section -fvar-tracking-assignments -g2 -D_LARGEFILE_SOURCE -D_LARGEFILE64_SOURCE -D_FILE_OFFSET_BITS=64 -fno-strict-aliasing -std=gnu99 -Wall -Wwrite-strings -MT libabrt_la-abrt_conf.lo -MD -MP -MF .deps/libabrt_la-abrt_conf.Tpo -c -o libabrt_la-abrt_conf.lo `test -f 'abrt_conf.c' || echo './'`abrt_conf.c libtool: compile: x86_64-pld-linux-gcc -DLOCALEDIR=\"/usr/share/locale\" -DHAVE_CONFIG_H -I. -I../.. -I./../include -I./../lib -DVAR_RUN=\"/var/run\" -DCONF_DIR=\"/etc/abrt\" -DDEFAULT_CONF_DIR=\"/usr/share/abrt/conf.d\" -DPLUGINS_CONF_DIR=\"/etc/abrt/plugins\" -DDEFAULT_PLUGINS_CONF_DIR=\"/usr/share/abrt/conf.d/plugins\" -DEVENTS_DIR=\"/usr/share/libreport/events\" -DDEFAULT_DUMP_LOCATION=\"/var/spool/abrt\" -DGDB=\"/usr/bin/gdb\" -I/usr/include/glib-2.0 -I/usr/lib64/glib-2.0/include -I/usr/include/libreport -I/usr/include/glib-2.0 -I/usr/lib64/glib-2.0/include -pthread -I/usr/include/glib-2.0 -I/usr/lib64/glib-2.0/include -D_GNU_SOURCE -O2 -fwrapv -pipe -Wformat -Werror=format-security -gdwarf-4 -fno-debug-types-section -fvar-tracking-assignments -g2 -Wp,-D_FORTIFY_SOURCE=2 -fstack-protector-strong --param=ssp-buffer-size=4 -fPIC -march=x86-64 -gdwarf-4 -fno-debug-types-section -fvar-tracking-assignments -g2 -D_LARGEFILE_SOURCE -D_LARGEFILE64_SOURCE -D_FILE_OFFSET_BITS=64 -fno-strict-aliasing -std=gnu99 -Wall -Wwrite-strings -MT libabrt_la-abrt_conf.lo -MD -MP -MF .deps/libabrt_la-abrt_conf.Tpo -c abrt_conf.c -fPIC -DPIC -o .libs/libabrt_la-abrt_conf.o mv -f .deps/libabrt_la-abrt_conf.Tpo .deps/libabrt_la-abrt_conf.Plo make[3]: Leaving directory '/tmp/B.NO1CvO/BUILD/abrt-2.10.0/src/lib' make[3]: Entering directory '/tmp/B.NO1CvO/BUILD/abrt-2.10.0/src/lib' /bin/sh ../../libtool --tag=CC --mode=compile x86_64-pld-linux-gcc -DLOCALEDIR=\"/usr/share/locale\" -DHAVE_CONFIG_H -I. -I../.. -I./../include -I./../lib -DVAR_RUN=\"/var/run\" -DCONF_DIR=\"/etc/abrt\" -DDEFAULT_CONF_DIR=\"/usr/share/abrt/conf.d\" -DPLUGINS_CONF_DIR=\"/etc/abrt/plugins\" -DDEFAULT_PLUGINS_CONF_DIR=\"/usr/share/abrt/conf.d/plugins\" -DEVENTS_DIR=\"/usr/share/libreport/events\" -DDEFAULT_DUMP_LOCATION=\"/var/spool/abrt\" -DGDB=\"/usr/bin/gdb\" -I/usr/include/glib-2.0 -I/usr/lib64/glib-2.0/include -I/usr/include/libreport -I/usr/include/glib-2.0 -I/usr/lib64/glib-2.0/include -pthread -I/usr/include/glib-2.0 -I/usr/lib64/glib-2.0/include -D_GNU_SOURCE -O2 -fwrapv -pipe -Wformat -Werror=format-security -gdwarf-4 -fno-debug-types-section -fvar-tracking-assignments -g2 -Wp,-D_FORTIFY_SOURCE=2 -fstack-protector-strong --param=ssp-buffer-size=4 -fPIC -march=x86-64 -gdwarf-4 -fno-debug-types-section -fvar-tracking-assignments -g2 -D_LARGEFILE_SOURCE -D_LARGEFILE64_SOURCE -D_FILE_OFFSET_BITS=64 -fno-strict-aliasing -std=gnu99 -Wall -Wwrite-strings -MT libabrt_la-hooklib.lo -MD -MP -MF .deps/libabrt_la-hooklib.Tpo -c -o libabrt_la-hooklib.lo `test -f 'hooklib.c' || echo './'`hooklib.c libtool: compile: x86_64-pld-linux-gcc -DLOCALEDIR=\"/usr/share/locale\" -DHAVE_CONFIG_H -I. -I../.. -I./../include -I./../lib -DVAR_RUN=\"/var/run\" -DCONF_DIR=\"/etc/abrt\" -DDEFAULT_CONF_DIR=\"/usr/share/abrt/conf.d\" -DPLUGINS_CONF_DIR=\"/etc/abrt/plugins\" -DDEFAULT_PLUGINS_CONF_DIR=\"/usr/share/abrt/conf.d/plugins\" -DEVENTS_DIR=\"/usr/share/libreport/events\" -DDEFAULT_DUMP_LOCATION=\"/var/spool/abrt\" -DGDB=\"/usr/bin/gdb\" -I/usr/include/glib-2.0 -I/usr/lib64/glib-2.0/include -I/usr/include/libreport -I/usr/include/glib-2.0 -I/usr/lib64/glib-2.0/include -pthread -I/usr/include/glib-2.0 -I/usr/lib64/glib-2.0/include -D_GNU_SOURCE -O2 -fwrapv -pipe -Wformat -Werror=format-security -gdwarf-4 -fno-debug-types-section -fvar-tracking-assignments -g2 -Wp,-D_FORTIFY_SOURCE=2 -fstack-protector-strong --param=ssp-buffer-size=4 -fPIC -march=x86-64 -gdwarf-4 -fno-debug-types-section -fvar-tracking-assignments -g2 -D_LARGEFILE_SOURCE -D_LARGEFILE64_SOURCE -D_FILE_OFFSET_BITS=64 -fno-strict-aliasing -std=gnu99 -Wall -Wwrite-strings -MT libabrt_la-hooklib.lo -MD -MP -MF .deps/libabrt_la-hooklib.Tpo -c hooklib.c -fPIC -DPIC -o .libs/libabrt_la-hooklib.o hooklib.c: In function 'abrt_trim_problem_dirs': hooklib.c:78:9: warning: implicit declaration of function 'log' [-Wimplicit-function-declaration] log("%s is %.0f bytes (more than %.0fMiB), deleting '%s'", ^~~ hooklib.c:78:9: warning: incompatible implicit declaration of built-in function 'log' hooklib.c:78:9: note: include '<math.h>' or provide a declaration of 'log' hooklib.c:78:13: error: incompatible type for argument 1 of 'log' log("%s is %.0f bytes (more than %.0fMiB), deleting '%s'", ^~~~~~~~~~~~~~~~~~~~~~~~~~~~~~~~~~~~~~~~~~~~~~~~~~~~~ hooklib.c:78:13: note: expected 'double' but argument is of type 'const char *' hooklib.c:78:9: error: too many arguments to function 'log' log("%s is %.0f bytes (more than %.0fMiB), deleting '%s'", ^~~ hooklib.c: In function 'abrt_get_backtrace': hooklib.c:253:5: warning: incompatible implicit declaration of built-in function 'log' log(_("Generating backtrace")); ^~~ hooklib.c:253:5: note: include '<math.h>' or provide a declaration of 'log' hooklib.c:253:9: error: incompatible type for argument 1 of 'log' log(_("Generating backtrace")); ^ hooklib.c:253:9: note: expected 'double' but argument is of type 'char *' hooklib.c:364:17: error: incompatible type for argument 1 of 'log' log("Backtrace is too big (%u bytes), reducing depth to %u", ^~~~~~~~~~~~~~~~~~~~~~~~~~~~~~~~~~~~~~~~~~~~~~~~~~~~~~~ hooklib.c:364:17: note: expected 'double' but argument is of type 'const char *' hooklib.c:364:13: error: too many arguments to function 'log' log("Backtrace is too big (%u bytes), reducing depth to %u", ^~~ hooklib.c:368:17: error: incompatible type for argument 1 of 'log' log("Failed to generate backtrace, reducing depth to %u", ^~~~~~~~~~~~~~~~~~~~~~~~~~~~~~~~~~~~~~~~~~~~~~~~~~~~ hooklib.c:368:17: note: expected 'double' but argument is of type 'const char *' hooklib.c:368:13: error: too many arguments to function 'log' log("Failed to generate backtrace, reducing depth to %u", ^~~ hooklib.c: In function 'dump_suid_policy': hooklib.c:440:9: warning: incompatible implicit declaration of built-in function 'log' log("Can't open %s", filename); ^~~ hooklib.c:440:9: note: include '<math.h>' or provide a declaration of 'log' hooklib.c:440:13: error: incompatible type for argument 1 of 'log' log("Can't open %s", filename); ^~~~~~~~~~~~~~~ hooklib.c:440:13: note: expected 'double' but argument is of type 'const char *' hooklib.c:440:9: error: too many arguments to function 'log' log("Can't open %s", filename); ^~~ make[3]: *** [Makefile:650: libabrt_la-hooklib.lo] Error 1 make[3]: Leaving directory '/tmp/B.NO1CvO/BUILD/abrt-2.10.0/src/lib' make[3]: *** Waiting for unfinished jobs.... make[3]: Entering directory '/tmp/B.NO1CvO/BUILD/abrt-2.10.0/src/lib' /bin/sh ../../libtool --tag=CC --mode=compile x86_64-pld-linux-gcc -DLOCALEDIR=\"/usr/share/locale\" -DHAVE_CONFIG_H -I. -I../.. -I./../include -I./../lib -DVAR_RUN=\"/var/run\" -DCONF_DIR=\"/etc/abrt\" -DDEFAULT_CONF_DIR=\"/usr/share/abrt/conf.d\" -DPLUGINS_CONF_DIR=\"/etc/abrt/plugins\" -DDEFAULT_PLUGINS_CONF_DIR=\"/usr/share/abrt/conf.d/plugins\" -DEVENTS_DIR=\"/usr/share/libreport/events\" -DDEFAULT_DUMP_LOCATION=\"/var/spool/abrt\" -DGDB=\"/usr/bin/gdb\" -I/usr/include/glib-2.0 -I/usr/lib64/glib-2.0/include -I/usr/include/libreport -I/usr/include/glib-2.0 -I/usr/lib64/glib-2.0/include -pthread -I/usr/include/glib-2.0 -I/usr/lib64/glib-2.0/include -D_GNU_SOURCE -O2 -fwrapv -pipe -Wformat -Werror=format-security -gdwarf-4 -fno-debug-types-section -fvar-tracking-assignments -g2 -Wp,-D_FORTIFY_SOURCE=2 -fstack-protector-strong --param=ssp-buffer-size=4 -fPIC -march=x86-64 -gdwarf-4 -fno-debug-types-section -fvar-tracking-assignments -g2 -D_LARGEFILE_SOURCE -D_LARGEFILE64_SOURCE -D_FILE_OFFSET_BITS=64 -fno-strict-aliasing -std=gnu99 -Wall -Wwrite-strings -MT libabrt_la-migrate_dirs.lo -MD -MP -MF .deps/libabrt_la-migrate_dirs.Tpo -c -o libabrt_la-migrate_dirs.lo `test -f 'migrate_dirs.c' || echo './'`migrate_dirs.c libtool: compile: x86_64-pld-linux-gcc -DLOCALEDIR=\"/usr/share/locale\" -DHAVE_CONFIG_H -I. -I../.. -I./../include -I./../lib -DVAR_RUN=\"/var/run\" -DCONF_DIR=\"/etc/abrt\" -DDEFAULT_CONF_DIR=\"/usr/share/abrt/conf.d\" -DPLUGINS_CONF_DIR=\"/etc/abrt/plugins\" -DDEFAULT_PLUGINS_CONF_DIR=\"/usr/share/abrt/conf.d/plugins\" -DEVENTS_DIR=\"/usr/share/libreport/events\" -DDEFAULT_DUMP_LOCATION=\"/var/spool/abrt\" -DGDB=\"/usr/bin/gdb\" -I/usr/include/glib-2.0 -I/usr/lib64/glib-2.0/include -I/usr/include/libreport -I/usr/include/glib-2.0 -I/usr/lib64/glib-2.0/include -pthread -I/usr/include/glib-2.0 -I/usr/lib64/glib-2.0/include -D_GNU_SOURCE -O2 -fwrapv -pipe -Wformat -Werror=format-security -gdwarf-4 -fno-debug-types-section -fvar-tracking-assignments -g2 -Wp,-D_FORTIFY_SOURCE=2 -fstack-protector-strong --param=ssp-buffer-size=4 -fPIC -march=x86-64 -gdwarf-4 -fno-debug-types-section -fvar-tracking-assignments -g2 -D_LARGEFILE_SOURCE -D_LARGEFILE64_SOURCE -D_FILE_OFFSET_BITS=64 -fno-strict-aliasing -std=gnu99 -Wall -Wwrite-strings -MT libabrt_la-migrate_dirs.lo -MD -MP -MF .deps/libabrt_la-migrate_dirs.Tpo -c migrate_dirs.c -fPIC -DPIC -o .libs/libabrt_la-migrate_dirs.o mv -f .deps/libabrt_la-migrate_dirs.Tpo .deps/libabrt_la-migrate_dirs.Plo make[3]: Leaving directory '/tmp/B.NO1CvO/BUILD/abrt-2.10.0/src/lib' make[3]: Entering directory '/tmp/B.NO1CvO/BUILD/abrt-2.10.0/src/lib' /bin/sh ../../libtool --tag=CC --mode=compile x86_64-pld-linux-gcc -DLOCALEDIR=\"/usr/share/locale\" -DHAVE_CONFIG_H -I. -I../.. -I./../include -I./../lib -DVAR_RUN=\"/var/run\" -DCONF_DIR=\"/etc/abrt\" -DDEFAULT_CONF_DIR=\"/usr/share/abrt/conf.d\" -DPLUGINS_CONF_DIR=\"/etc/abrt/plugins\" -DDEFAULT_PLUGINS_CONF_DIR=\"/usr/share/abrt/conf.d/plugins\" -DEVENTS_DIR=\"/usr/share/libreport/events\" -DDEFAULT_DUMP_LOCATION=\"/var/spool/abrt\" -DGDB=\"/usr/bin/gdb\" -I/usr/include/glib-2.0 -I/usr/lib64/glib-2.0/include -I/usr/include/libreport -I/usr/include/glib-2.0 -I/usr/lib64/glib-2.0/include -pthread -I/usr/include/glib-2.0 -I/usr/lib64/glib-2.0/include -D_GNU_SOURCE -O2 -fwrapv -pipe -Wformat -Werror=format-security -gdwarf-4 -fno-debug-types-section -fvar-tracking-assignments -g2 -Wp,-D_FORTIFY_SOURCE=2 -fstack-protector-strong --param=ssp-buffer-size=4 -fPIC -march=x86-64 -gdwarf-4 -fno-debug-types-section -fvar-tracking-assignments -g2 -D_LARGEFILE_SOURCE -D_LARGEFILE64_SOURCE -D_FILE_OFFSET_BITS=64 -fno-strict-aliasing -std=gnu99 -Wall -Wwrite-strings -MT libabrt_la-kernel.lo -MD -MP -MF .deps/libabrt_la-kernel.Tpo -c -o libabrt_la-kernel.lo `test -f 'kernel.c' || echo './'`kernel.c libtool: compile: x86_64-pld-linux-gcc -DLOCALEDIR=\"/usr/share/locale\" -DHAVE_CONFIG_H -I. -I../.. -I./../include -I./../lib -DVAR_RUN=\"/var/run\" -DCONF_DIR=\"/etc/abrt\" -DDEFAULT_CONF_DIR=\"/usr/share/abrt/conf.d\" -DPLUGINS_CONF_DIR=\"/etc/abrt/plugins\" -DDEFAULT_PLUGINS_CONF_DIR=\"/usr/share/abrt/conf.d/plugins\" -DEVENTS_DIR=\"/usr/share/libreport/events\" -DDEFAULT_DUMP_LOCATION=\"/var/spool/abrt\" -DGDB=\"/usr/bin/gdb\" -I/usr/include/glib-2.0 -I/usr/lib64/glib-2.0/include -I/usr/include/libreport -I/usr/include/glib-2.0 -I/usr/lib64/glib-2.0/include -pthread -I/usr/include/glib-2.0 -I/usr/lib64/glib-2.0/include -D_GNU_SOURCE -O2 -fwrapv -pipe -Wformat -Werror=format-security -gdwarf-4 -fno-debug-types-section -fvar-tracking-assignments -g2 -Wp,-D_FORTIFY_SOURCE=2 -fstack-protector-strong --param=ssp-buffer-size=4 -fPIC -march=x86-64 -gdwarf-4 -fno-debug-types-section -fvar-tracking-assignments -g2 -D_LARGEFILE_SOURCE -D_LARGEFILE64_SOURCE -D_FILE_OFFSET_BITS=64 -fno-strict-aliasing -std=gnu99 -Wall -Wwrite-strings -MT libabrt_la-kernel.lo -MD -MP -MF .deps/libabrt_la-kernel.Tpo -c kernel.c -fPIC -DPIC -o .libs/libabrt_la-kernel.o kernel.c: In function 'record_oops': kernel.c:74:24: warning: implicit declaration of function 'log' [-Wimplicit-function-declaration] VERB3 if (rv == 0) log("Dropped oops: too short"); ^~~ kernel.c:74:24: warning: incompatible implicit declaration of built-in function 'log' kernel.c:74:24: note: include '<math.h>' or provide a declaration of 'log' kernel.c:74:28: error: incompatible type for argument 1 of 'log' VERB3 if (rv == 0) log("Dropped oops: too short"); ^~~~~~~~~~~~~~~~~~~~~~~~~ kernel.c:74:28: note: expected 'double' but argument is of type 'const char *' kernel.c: In function 'abrt_koops_hash_str_ext': kernel.c:549:13: warning: incompatible implicit declaration of built-in function 'log' log("Generating duphash: '%s'", hash_str); ^~~ kernel.c:549:13: note: include '<math.h>' or provide a declaration of 'log' kernel.c:549:17: error: incompatible type for argument 1 of 'log' log("Generating duphash: '%s'", hash_str); ^~~~~~~~~~~~~~~~~~~~~~~~~~ kernel.c:549:17: note: expected 'double' but argument is of type 'const char *' kernel.c:549:13: error: too many arguments to function 'log' log("Generating duphash: '%s'", hash_str); ^~~ kernel.c:551:13: warning: incompatible implicit declaration of built-in function 'log' log("Nothing useful for duphash"); ^~~ kernel.c:551:13: note: include '<math.h>' or provide a declaration of 'log' kernel.c:551:17: error: incompatible type for argument 1 of 'log' log("Nothing useful for duphash"); ^~~~~~~~~~~~~~~~~~~~~~~~~~~~ kernel.c:551:17: note: expected 'double' but argument is of type 'const char *' make[3]: *** [Makefile:671: libabrt_la-kernel.lo] Error 1 make[3]: Leaving directory '/tmp/B.NO1CvO/BUILD/abrt-2.10.0/src/lib' make[3]: Entering directory '/tmp/B.NO1CvO/BUILD/abrt-2.10.0/src/lib' /bin/sh ../../libtool --tag=CC --mode=compile x86_64-pld-linux-gcc -DLOCALEDIR=\"/usr/share/locale\" -DHAVE_CONFIG_H -I. -I../.. -I./../include -I./../lib -DVAR_RUN=\"/var/run\" -DCONF_DIR=\"/etc/abrt\" -DDEFAULT_CONF_DIR=\"/usr/share/abrt/conf.d\" -DPLUGINS_CONF_DIR=\"/etc/abrt/plugins\" -DDEFAULT_PLUGINS_CONF_DIR=\"/usr/share/abrt/conf.d/plugins\" -DEVENTS_DIR=\"/usr/share/libreport/events\" -DDEFAULT_DUMP_LOCATION=\"/var/spool/abrt\" -DGDB=\"/usr/bin/gdb\" -I/usr/include/glib-2.0 -I/usr/lib64/glib-2.0/include -I/usr/include/libreport -I/usr/include/glib-2.0 -I/usr/lib64/glib-2.0/include -pthread -I/usr/include/glib-2.0 -I/usr/lib64/glib-2.0/include -D_GNU_SOURCE -O2 -fwrapv -pipe -Wformat -Werror=format-security -gdwarf-4 -fno-debug-types-section -fvar-tracking-assignments -g2 -Wp,-D_FORTIFY_SOURCE=2 -fstack-protector-strong --param=ssp-buffer-size=4 -fPIC -march=x86-64 -gdwarf-4 -fno-debug-types-section -fvar-tracking-assignments -g2 -D_LARGEFILE_SOURCE -D_LARGEFILE64_SOURCE -D_FILE_OFFSET_BITS=64 -fno-strict-aliasing -std=gnu99 -Wall -Wwrite-strings -MT libabrt_la-problem_api.lo -MD -MP -MF .deps/libabrt_la-problem_api.Tpo -c -o libabrt_la-problem_api.lo `test -f 'problem_api.c' || echo './'`problem_api.c libtool: compile: x86_64-pld-linux-gcc -DLOCALEDIR=\"/usr/share/locale\" -DHAVE_CONFIG_H -I. -I../.. -I./../include -I./../lib -DVAR_RUN=\"/var/run\" -DCONF_DIR=\"/etc/abrt\" -DDEFAULT_CONF_DIR=\"/usr/share/abrt/conf.d\" -DPLUGINS_CONF_DIR=\"/etc/abrt/plugins\" -DDEFAULT_PLUGINS_CONF_DIR=\"/usr/share/abrt/conf.d/plugins\" -DEVENTS_DIR=\"/usr/share/libreport/events\" -DDEFAULT_DUMP_LOCATION=\"/var/spool/abrt\" -DGDB=\"/usr/bin/gdb\" -I/usr/include/glib-2.0 -I/usr/lib64/glib-2.0/include -I/usr/include/libreport -I/usr/include/glib-2.0 -I/usr/lib64/glib-2.0/include -pthread -I/usr/include/glib-2.0 -I/usr/lib64/glib-2.0/include -D_GNU_SOURCE -O2 -fwrapv -pipe -Wformat -Werror=format-security -gdwarf-4 -fno-debug-types-section -fvar-tracking-assignments -g2 -Wp,-D_FORTIFY_SOURCE=2 -fstack-protector-strong --param=ssp-buffer-size=4 -fPIC -march=x86-64 -gdwarf-4 -fno-debug-types-section -fvar-tracking-assignments -g2 -D_LARGEFILE_SOURCE -D_LARGEFILE64_SOURCE -D_FILE_OFFSET_BITS=64 -fno-strict-aliasing -std=gnu99 -Wall -Wwrite-strings -MT libabrt_la-problem_api.lo -MD -MP -MF .deps/libabrt_la-problem_api.Tpo -c problem_api.c -fPIC -DPIC -o .libs/libabrt_la-problem_api.o problem_api.c: In function 'add_dirname_to_GList': problem_api.c:93:9: warning: implicit declaration of function 'log' [-Wimplicit-function-declaration] log("Ignoring '%s': invalid owner, group or mode", dd->dd_dirname); ^~~ problem_api.c:93:9: warning: incompatible implicit declaration of built-in function 'log' problem_api.c:93:9: note: include '<math.h>' or provide a declaration of 'log' problem_api.c:93:13: error: incompatible type for argument 1 of 'log' log("Ignoring '%s': invalid owner, group or mode", dd->dd_dirname); ^~~~~~~~~~~~~~~~~~~~~~~~~~~~~~~~~~~~~~~~~~~~~ problem_api.c:93:13: note: expected 'double' but argument is of type 'const char *' problem_api.c:93:9: error: too many arguments to function 'log' log("Ignoring '%s': invalid owner, group or mode", dd->dd_dirname); ^~~ make[3]: *** [Makefile:699: libabrt_la-problem_api.lo] Error 1 make[3]: Leaving directory '/tmp/B.NO1CvO/BUILD/abrt-2.10.0/src/lib' make[3]: Entering directory '/tmp/B.NO1CvO/BUILD/abrt-2.10.0/src/lib' /bin/sh ../../libtool --tag=CC --mode=compile x86_64-pld-linux-gcc -DLOCALEDIR=\"/usr/share/locale\" -DHAVE_CONFIG_H -I. -I../.. -I./../include -I./../lib -DVAR_RUN=\"/var/run\" -DCONF_DIR=\"/etc/abrt\" -DDEFAULT_CONF_DIR=\"/usr/share/abrt/conf.d\" -DPLUGINS_CONF_DIR=\"/etc/abrt/plugins\" -DDEFAULT_PLUGINS_CONF_DIR=\"/usr/share/abrt/conf.d/plugins\" -DEVENTS_DIR=\"/usr/share/libreport/events\" -DDEFAULT_DUMP_LOCATION=\"/var/spool/abrt\" -DGDB=\"/usr/bin/gdb\" -I/usr/include/glib-2.0 -I/usr/lib64/glib-2.0/include -I/usr/include/libreport -I/usr/include/glib-2.0 -I/usr/lib64/glib-2.0/include -pthread -I/usr/include/glib-2.0 -I/usr/lib64/glib-2.0/include -D_GNU_SOURCE -O2 -fwrapv -pipe -Wformat -Werror=format-security -gdwarf-4 -fno-debug-types-section -fvar-tracking-assignments -g2 -Wp,-D_FORTIFY_SOURCE=2 -fstack-protector-strong --param=ssp-buffer-size=4 -fPIC -march=x86-64 -gdwarf-4 -fno-debug-types-section -fvar-tracking-assignments -g2 -D_LARGEFILE_SOURCE -D_LARGEFILE64_SOURCE -D_FILE_OFFSET_BITS=64 -fno-strict-aliasing -std=gnu99 -Wall -Wwrite-strings -MT libabrt_la-ignored_problems.lo -MD -MP -MF .deps/libabrt_la-ignored_problems.Tpo -c -o libabrt_la-ignored_problems.lo `test -f 'ignored_problems.c' || echo './'`ignored_problems.c libtool: compile: x86_64-pld-linux-gcc -DLOCALEDIR=\"/usr/share/locale\" -DHAVE_CONFIG_H -I. -I../.. -I./../include -I./../lib -DVAR_RUN=\"/var/run\" -DCONF_DIR=\"/etc/abrt\" -DDEFAULT_CONF_DIR=\"/usr/share/abrt/conf.d\" -DPLUGINS_CONF_DIR=\"/etc/abrt/plugins\" -DDEFAULT_PLUGINS_CONF_DIR=\"/usr/share/abrt/conf.d/plugins\" -DEVENTS_DIR=\"/usr/share/libreport/events\" -DDEFAULT_DUMP_LOCATION=\"/var/spool/abrt\" -DGDB=\"/usr/bin/gdb\" -I/usr/include/glib-2.0 -I/usr/lib64/glib-2.0/include -I/usr/include/libreport -I/usr/include/glib-2.0 -I/usr/lib64/glib-2.0/include -pthread -I/usr/include/glib-2.0 -I/usr/lib64/glib-2.0/include -D_GNU_SOURCE -O2 -fwrapv -pipe -Wformat -Werror=format-security -gdwarf-4 -fno-debug-types-section -fvar-tracking-assignments -g2 -Wp,-D_FORTIFY_SOURCE=2 -fstack-protector-strong --param=ssp-buffer-size=4 -fPIC -march=x86-64 -gdwarf-4 -fno-debug-types-section -fvar-tracking-assignments -g2 -D_LARGEFILE_SOURCE -D_LARGEFILE64_SOURCE -D_FILE_OFFSET_BITS=64 -fno-strict-aliasing -std=gnu99 -Wall -Wwrite-strings -MT libabrt_la-ignored_problems.lo -MD -MP -MF .deps/libabrt_la-ignored_problems.Tpo -c ignored_problems.c -fPIC -DPIC -o .libs/libabrt_la-ignored_problems.o ignored_problems.c: In function 'ignored_problems_add': ignored_problems.c:179:15: warning: implicit declaration of function 'log' [-Wimplicit-function-declaration] VERB1 log("Can't add problem '%s' to ignored problems:" ^~~ ignored_problems.c:179:15: warning: incompatible implicit declaration of built-in function 'log' ignored_problems.c:179:15: note: include '<math.h>' or provide a declaration of 'log' ignored_problems.c:179:19: error: incompatible type for argument 1 of 'log' VERB1 log("Can't add problem '%s' to ignored problems:" ^~~~~~~~~~~~~~~~~~~~~~~~~~~~~~~~~~~~~~~~~~~~~ ignored_problems.c:179:19: note: expected 'double' but argument is of type 'const char *' ignored_problems.c:179:15: error: too many arguments to function 'log' VERB1 log("Can't add problem '%s' to ignored problems:" ^~~ ignored_problems.c: In function 'ignored_problems_remove_row': ignored_problems.c:198:11: warning: incompatible implicit declaration of built-in function 'log' VERB1 log("Going to remove problem '%s' from ignored problems", problem_id); ^~~ ignored_problems.c:198:11: note: include '<math.h>' or provide a declaration of 'log' ignored_problems.c:198:15: error: incompatible type for argument 1 of 'log' VERB1 log("Going to remove problem '%s' from ignored problems", problem_id); ^~~~~~~~~~~~~~~~~~~~~~~~~~~~~~~~~~~~~~~~~~~~~~~~~~~~ ignored_problems.c:198:15: note: expected 'double' but argument is of type 'const char *' ignored_problems.c:198:11: error: too many arguments to function 'log' VERB1 log("Going to remove problem '%s' from ignored problems", problem_id); ^~~ make[3]: *** [Makefile:713: libabrt_la-ignored_problems.lo] Error 1 make[3]: Leaving directory '/tmp/B.NO1CvO/BUILD/abrt-2.10.0/src/lib' make[3]: Entering directory '/tmp/B.NO1CvO/BUILD/abrt-2.10.0/src/lib' /bin/sh ../../libtool --tag=CC --mode=compile x86_64-pld-linux-gcc -DLOCALEDIR=\"/usr/share/locale\" -DHAVE_CONFIG_H -I. -I../.. -I./../include -I./../lib -DVAR_RUN=\"/var/run\" -DCONF_DIR=\"/etc/abrt\" -DDEFAULT_CONF_DIR=\"/usr/share/abrt/conf.d\" -DPLUGINS_CONF_DIR=\"/etc/abrt/plugins\" -DDEFAULT_PLUGINS_CONF_DIR=\"/usr/share/abrt/conf.d/plugins\" -DEVENTS_DIR=\"/usr/share/libreport/events\" -DDEFAULT_DUMP_LOCATION=\"/var/spool/abrt\" -DGDB=\"/usr/bin/gdb\" -I/usr/include/glib-2.0 -I/usr/lib64/glib-2.0/include -I/usr/include/libreport -I/usr/include/glib-2.0 -I/usr/lib64/glib-2.0/include -pthread -I/usr/include/glib-2.0 -I/usr/lib64/glib-2.0/include -D_GNU_SOURCE -O2 -fwrapv -pipe -Wformat -Werror=format-security -gdwarf-4 -fno-debug-types-section -fvar-tracking-assignments -g2 -Wp,-D_FORTIFY_SOURCE=2 -fstack-protector-strong --param=ssp-buffer-size=4 -fPIC -march=x86-64 -gdwarf-4 -fno-debug-types-section -fvar-tracking-assignments -g2 -D_LARGEFILE_SOURCE -D_LARGEFILE64_SOURCE -D_FILE_OFFSET_BITS=64 -fno-strict-aliasing -std=gnu99 -Wall -Wwrite-strings -MT libabrt_la-problem_api_dbus.lo -MD -MP -MF .deps/libabrt_la-problem_api_dbus.Tpo -c -o libabrt_la-problem_api_dbus.lo `test -f 'problem_api_dbus.c' || echo './'`problem_api_dbus.c libtool: compile: x86_64-pld-linux-gcc -DLOCALEDIR=\"/usr/share/locale\" -DHAVE_CONFIG_H -I. -I../.. -I./../include -I./../lib -DVAR_RUN=\"/var/run\" -DCONF_DIR=\"/etc/abrt\" -DDEFAULT_CONF_DIR=\"/usr/share/abrt/conf.d\" -DPLUGINS_CONF_DIR=\"/etc/abrt/plugins\" -DDEFAULT_PLUGINS_CONF_DIR=\"/usr/share/abrt/conf.d/plugins\" -DEVENTS_DIR=\"/usr/share/libreport/events\" -DDEFAULT_DUMP_LOCATION=\"/var/spool/abrt\" -DGDB=\"/usr/bin/gdb\" -I/usr/include/glib-2.0 -I/usr/lib64/glib-2.0/include -I/usr/include/libreport -I/usr/include/glib-2.0 -I/usr/lib64/glib-2.0/include -pthread -I/usr/include/glib-2.0 -I/usr/lib64/glib-2.0/include -D_GNU_SOURCE -O2 -fwrapv -pipe -Wformat -Werror=format-security -gdwarf-4 -fno-debug-types-section -fvar-tracking-assignments -g2 -Wp,-D_FORTIFY_SOURCE=2 -fstack-protector-strong --param=ssp-buffer-size=4 -fPIC -march=x86-64 -gdwarf-4 -fno-debug-types-section -fvar-tracking-assignments -g2 -D_LARGEFILE_SOURCE -D_LARGEFILE64_SOURCE -D_FILE_OFFSET_BITS=64 -fno-strict-aliasing -std=gnu99 -Wall -Wwrite-strings -MT libabrt_la-problem_api_dbus.lo -MD -MP -MF .deps/libabrt_la-problem_api_dbus.Tpo -c problem_api_dbus.c -fPIC -DPIC -o .libs/libabrt_la-problem_api_dbus.o mv -f .deps/libabrt_la-problem_api_dbus.Tpo .deps/libabrt_la-problem_api_dbus.Plo make[3]: Leaving directory '/tmp/B.NO1CvO/BUILD/abrt-2.10.0/src/lib' make[2]: *** [Makefile:475: all-recursive] Error 1 make[1]: *** [Makefile:757: all-recursive] Error 1 make: *** [Makefile:545: all] Error 2 error: Bad exit status from /tmp/B.NO1CvO/BUILD/tmp/rpm-tmp.97566 (%build) RPM build errors: Bad exit status from /tmp/B.NO1CvO/BUILD/tmp/rpm-tmp.97566 (%build) ended at: Mon May 14 03:59:09 2018, done in 0:00:16.671641 error: No files produced. mesg: ttyname failed: Inappropriate ioctl for device + chmod -R u+rwX /tmp/B.NO1CvO/BUILD + rm -rf /tmp/B.NO1CvO/tmp /tmp/B.NO1CvO/BUILD mesg: ttyname failed: Inappropriate ioctl for device + rm -rf /tmp/B.NO1CvO Begin-PLD-Builder-Info Build-Time: user:22.48s sys:3.72s real:38.18s (faults io:0 non-io:1791883) End-PLD-Builder-Info
[Back to list of logs] [View rpm -qa of builder]