FailedOk

th/SRPMS[OK]
th/x32[OK]
th/i686[OK]
th/x86_64[OK]

ac/SRPMS[OK]
ac/i386[OK]
ac/i586[OK]
ac/i686[OK]
ac/alpha[OK]
ac/amd64[OK]
ac/athlon[OK]
ac/ppc[OK]
ac/sparc[OK]
ac/sparc64[OK]

Advanced Search
main()
Powered by PLD Linux
(c) 2002-2019 PLD Team
$Revision: 1.37 $
Powered by Microsoft Windows 2003.
Your IP: 18.206.194.210

asymptote 4ad4e217-d91a-4940-b1e5-aaf73bc9776a

Status:Failed
Source URL:ftp://buildlogs.pld-linux.org/th/x86_64/FAIL/asymptote,4ad4e217-d91a-4940-b1e5-aaf73bc9776a.bz2
text/plain URL:View!
full text:View!
rpm -qa of builder:View!
Date:2019/10/19 00:29:37
Runtime:0:01:06.025518

Toc:

  • error 1
  • /usr/include/gc/gc_cpp.h:545: undefined reference to `GC_throw_bad_alloc()'
  • error 2
  • /usr/include/gc/gc_cpp.h:410: undefined reference to `GC_throw_bad_alloc()'
  • error 3
  • /usr/bin/ld: /usr/include/gc/gc_cpp.h:410: undefined reference to `GC_throw_bad_alloc()'
  • error 4
  • /usr/bin/ld: /usr/include/gc/gc_cpp.h:410: undefined reference to `GC_throw_bad_alloc()'
  • error 5
  • /usr/bin/ld: /usr/include/gc/gc_cpp.h:410: undefined reference to `GC_throw_bad_alloc()'
  • error 6
  • collect2: error: ld returned 1 exit status
  • error 7
  • error: Bad exit status from /tmp/B.zr_JaG/BUILD/tmp/rpm-tmp.63055 (%build)
  • error 8
  • RPM build errors:
  • error 9
  • error: No files produced.

Content:

                 from constructor.cc:23:
memory.h: In function 'void mem::compact(int)':
memory.h:185:29: warning: 'GC_dont_expand' is deprecated [-Wdeprecated-declarations]
  185 | inline void compact(int x) {GC_dont_expand=x;}
      |                             ^~~~~~~~~~~~~~
In file included from memory.h:50,
                 from common.h:35,
                 from errormsg.h:12,
                 from stack.h:13,
                 from constructor.cc:23:
/usr/include/gc/gc.h:255:31: note: declared here
  255 | GC_API GC_ATTR_DEPRECATED int GC_dont_expand;
      |                               ^~~~~~~~~~~~~~
x86_64-pld-linux-g++ -Wall -DHAVE_CONFIG_H -D_FILE_OFFSET_BITS=64 -DUSEGC  -pthread -DFFTWPP_SINGLE_THREAD  -O2 -fwrapv -pipe -Wformat -Werror=format-security -gdwarf-4 -fno-debug-types-section -fvar-tracking-assignments -g2 -Wp,-D_FORTIFY_SOURCE=2 -fstack-protector-strong --param=ssp-buffer-size=4 -Werror=trampolines -fPIC -march=x86-64 -gdwarf-4 -fno-debug-types-section -fvar-tracking-assignments -g2  -O2 -fwrapv -pipe -Wformat -Werror=format-security -gdwarf-4 -fno-debug-types-section -fvar-tracking-assignments -g2 -Wp,-D_FORTIFY_SOURCE=2 -fstack-protector-strong --param=ssp-buffer-size=4 -Werror=trampolines -fPIC -march=x86-64 -gdwarf-4 -fno-debug-types-section -fvar-tracking-assignments -g2  -fno-var-tracking -I. -I/usr/include/gc -I/usr/include/gc -o main.o -c main.cc
In file included from common.h:35,
                 from main.cc:28:
memory.h: In function 'void mem::compact(int)':
memory.h:185:29: warning: 'GC_dont_expand' is deprecated [-Wdeprecated-declarations]
  185 | inline void compact(int x) {GC_dont_expand=x;}
      |                             ^~~~~~~~~~~~~~
In file included from memory.h:50,
                 from common.h:35,
                 from main.cc:28:
/usr/include/gc/gc.h:255:31: note: declared here
  255 | GC_API GC_ATTR_DEPRECATED int GC_dont_expand;
      |                               ^~~~~~~~~~~~~~
x86_64-pld-linux-g++ -Wall -DHAVE_CONFIG_H -D_FILE_OFFSET_BITS=64 -DUSEGC  -pthread -DFFTWPP_SINGLE_THREAD  -O2 -fwrapv -pipe -Wformat -Werror=format-security -gdwarf-4 -fno-debug-types-section -fvar-tracking-assignments -g2 -Wp,-D_FORTIFY_SOURCE=2 -fstack-protector-strong --param=ssp-buffer-size=4 -Werror=trampolines -fPIC -march=x86-64 -gdwarf-4 -fno-debug-types-section -fvar-tracking-assignments -g2  -O2 -fwrapv -pipe -Wformat -Werror=format-security -gdwarf-4 -fno-debug-types-section -fvar-tracking-assignments -g2 -Wp,-D_FORTIFY_SOURCE=2 -fstack-protector-strong --param=ssp-buffer-size=4 -Werror=trampolines -fPIC -march=x86-64 -gdwarf-4 -fno-debug-types-section -fvar-tracking-assignments -g2  -fno-var-tracking -I. -I/usr/include/gc -I/usr/include/gc -o symbol.o -c symbol.cc
In file included from common.h:35,
                 from settings.h:14,
                 from symbol.cc:15:
memory.h: In function 'void mem::compact(int)':
memory.h:185:29: warning: 'GC_dont_expand' is deprecated [-Wdeprecated-declarations]
  185 | inline void compact(int x) {GC_dont_expand=x;}
      |                             ^~~~~~~~~~~~~~
In file included from memory.h:50,
                 from common.h:35,
                 from settings.h:14,
                 from symbol.cc:15:
/usr/include/gc/gc.h:255:31: note: declared here
  255 | GC_API GC_ATTR_DEPRECATED int GC_dont_expand;
      |                               ^~~~~~~~~~~~~~
x86_64-pld-linux-g++ -Wall -DHAVE_CONFIG_H -D_FILE_OFFSET_BITS=64 -DUSEGC  -pthread -DFFTWPP_SINGLE_THREAD  -O2 -fwrapv -pipe -Wformat -Werror=format-security -gdwarf-4 -fno-debug-types-section -fvar-tracking-assignments -g2 -Wp,-D_FORTIFY_SOURCE=2 -fstack-protector-strong --param=ssp-buffer-size=4 -Werror=trampolines -fPIC -march=x86-64 -gdwarf-4 -fno-debug-types-section -fvar-tracking-assignments -g2  -O2 -fwrapv -pipe -Wformat -Werror=format-security -gdwarf-4 -fno-debug-types-section -fvar-tracking-assignments -g2 -Wp,-D_FORTIFY_SOURCE=2 -fstack-protector-strong --param=ssp-buffer-size=4 -Werror=trampolines -fPIC -march=x86-64 -gdwarf-4 -fno-debug-types-section -fvar-tracking-assignments -g2  -fno-var-tracking -I. -I/usr/include/gc -I/usr/include/gc -o writePRC.o -c prc/writePRC.cc
x86_64-pld-linux-g++ -Wall -DHAVE_CONFIG_H -D_FILE_OFFSET_BITS=64 -DUSEGC  -pthread -DFFTWPP_SINGLE_THREAD  -O2 -fwrapv -pipe -Wformat -Werror=format-security -gdwarf-4 -fno-debug-types-section -fvar-tracking-assignments -g2 -Wp,-D_FORTIFY_SOURCE=2 -fstack-protector-strong --param=ssp-buffer-size=4 -Werror=trampolines -fPIC -march=x86-64 -gdwarf-4 -fno-debug-types-section -fvar-tracking-assignments -g2  -O2 -fwrapv -pipe -Wformat -Werror=format-security -gdwarf-4 -fno-debug-types-section -fvar-tracking-assignments -g2 -Wp,-D_FORTIFY_SOURCE=2 -fstack-protector-strong --param=ssp-buffer-size=4 -Werror=trampolines -fPIC -march=x86-64 -gdwarf-4 -fno-debug-types-section -fvar-tracking-assignments -g2  -fno-var-tracking -I. -I/usr/include/gc -I/usr/include/gc -o process.o -c process.cc
In file included from common.h:35,
                 from errormsg.h:12,
                 from types.h:17,
                 from process.cc:10:
memory.h: In function 'void mem::compact(int)':
memory.h:185:29: warning: 'GC_dont_expand' is deprecated [-Wdeprecated-declarations]
  185 | inline void compact(int x) {GC_dont_expand=x;}
      |                             ^~~~~~~~~~~~~~
In file included from memory.h:50,
                 from common.h:35,
                 from errormsg.h:12,
                 from types.h:17,
                 from process.cc:10:
/usr/include/gc/gc.h:255:31: note: declared here
  255 | GC_API GC_ATTR_DEPRECATED int GC_dont_expand;
      |                               ^~~~~~~~~~~~~~
x86_64-pld-linux-g++ -Wall -DHAVE_CONFIG_H -D_FILE_OFFSET_BITS=64 -DUSEGC  -pthread -DFFTWPP_SINGLE_THREAD  -O2 -fwrapv -pipe -Wformat -Werror=format-security -gdwarf-4 -fno-debug-types-section -fvar-tracking-assignments -g2 -Wp,-D_FORTIFY_SOURCE=2 -fstack-protector-strong --param=ssp-buffer-size=4 -Werror=trampolines -fPIC -march=x86-64 -gdwarf-4 -fno-debug-types-section -fvar-tracking-assignments -g2  -O2 -fwrapv -pipe -Wformat -Werror=format-security -gdwarf-4 -fno-debug-types-section -fvar-tracking-assignments -g2 -Wp,-D_FORTIFY_SOURCE=2 -fstack-protector-strong --param=ssp-buffer-size=4 -Werror=trampolines -fPIC -march=x86-64 -gdwarf-4 -fno-debug-types-section -fvar-tracking-assignments -g2  -fno-var-tracking -I. -I/usr/include/gc -I/usr/include/gc -o glrender.o -c glrender.cc
In file included from common.h:35,
                 from glrender.cc:12:
memory.h: In function 'void mem::compact(int)':
memory.h:185:29: warning: 'GC_dont_expand' is deprecated [-Wdeprecated-declarations]
  185 | inline void compact(int x) {GC_dont_expand=x;}
      |                             ^~~~~~~~~~~~~~
In file included from memory.h:50,
                 from common.h:35,
                 from glrender.cc:12:
/usr/include/gc/gc.h:255:31: note: declared here
  255 | GC_API GC_ATTR_DEPRECATED int GC_dont_expand;
      |                               ^~~~~~~~~~~~~~
x86_64-pld-linux-g++ -Wall -DHAVE_CONFIG_H -D_FILE_OFFSET_BITS=64 -DUSEGC  -pthread -DFFTWPP_SINGLE_THREAD  -O2 -fwrapv -pipe -Wformat -Werror=format-security -gdwarf-4 -fno-debug-types-section -fvar-tracking-assignments -g2 -Wp,-D_FORTIFY_SOURCE=2 -fstack-protector-strong --param=ssp-buffer-size=4 -Werror=trampolines -fPIC -march=x86-64 -gdwarf-4 -fno-debug-types-section -fvar-tracking-assignments -g2  -O2 -fwrapv -pipe -Wformat -Werror=format-security -gdwarf-4 -fno-debug-types-section -fvar-tracking-assignments -g2 -Wp,-D_FORTIFY_SOURCE=2 -fstack-protector-strong --param=ssp-buffer-size=4 -Werror=trampolines -fPIC -march=x86-64 -gdwarf-4 -fno-debug-types-section -fvar-tracking-assignments -g2  -fno-var-tracking -I. -I/usr/include/gc -I/usr/include/gc -o oPRCFile.o -c prc/oPRCFile.cc
if test ! -s revision.cc -o "2.41" != "2.41"; then     \
  echo "const char *REVISION="\"2.41\"\; > revision.cc; \
fi
x86_64-pld-linux-g++ -Wall -DHAVE_CONFIG_H -D_FILE_OFFSET_BITS=64 -DUSEGC  -pthread -DFFTWPP_SINGLE_THREAD  -O2 -fwrapv -pipe -Wformat -Werror=format-security -gdwarf-4 -fno-debug-types-section -fvar-tracking-assignments -g2 -Wp,-D_FORTIFY_SOURCE=2 -fstack-protector-strong --param=ssp-buffer-size=4 -Werror=trampolines -fPIC -march=x86-64 -gdwarf-4 -fno-debug-types-section -fvar-tracking-assignments -g2  -O2 -fwrapv -pipe -Wformat -Werror=format-security -gdwarf-4 -fno-debug-types-section -fvar-tracking-assignments -g2 -Wp,-D_FORTIFY_SOURCE=2 -fstack-protector-strong --param=ssp-buffer-size=4 -Werror=trampolines -fPIC -march=x86-64 -gdwarf-4 -fno-debug-types-section -fvar-tracking-assignments -g2  -fno-var-tracking -I. -I/usr/include/gc -I/usr/include/gc -o revision.o -c revision.cc;
echo string VERSION=\"2.41\"\; > base/version.asy
echo @set VERSION 2.41 > doc/version.texi
echo @set Datadir /usr/share >> doc/version.texi
echo "#!/usr/bin/env python" > GUI/xasyVersion.py
echo xasyVersion = \"2.41\" >> GUI/xasyVersion.py
if test -n ""; then \
  cat asy.rc | sed -e "s/ASYMPTOTE_VERSION/2.41/" | \
  windres -o asy.o; \
fi
if test -n ""; then \
          x86_64-pld-linux-g++ -Wall -DHAVE_CONFIG_H -D_FILE_OFFSET_BITS=64 -DUSEGC  -pthread -DFFTWPP_SINGLE_THREAD  -O2 -fwrapv -pipe -Wformat -Werror=format-security -gdwarf-4 -fno-debug-types-section -fvar-tracking-assignments -g2 -Wp,-D_FORTIFY_SOURCE=2 -fstack-protector-strong --param=ssp-buffer-size=4 -Werror=trampolines -fPIC -march=x86-64 -gdwarf-4 -fno-debug-types-section -fvar-tracking-assignments -g2  -O2 -fwrapv -pipe -Wformat -Werror=format-security -gdwarf-4 -fno-debug-types-section -fvar-tracking-assignments -g2 -Wp,-D_FORTIFY_SOURCE=2 -fstack-protector-strong --param=ssp-buffer-size=4 -Werror=trampolines -fPIC -march=x86-64 -gdwarf-4 -fno-debug-types-section -fvar-tracking-assignments -g2  -fno-var-tracking -o asy camperror.o path.o drawpath.o drawlabel.o picture.o psfile.o texfile.o util.o settings.o guide.o flatguide.o knot.o drawfill.o path3.o drawpath3.o drawsurface.o beziercurve.o bezierpatch.o pen.o pipestream.o types.o builtin.o gsl.o runtime.o runbacktrace.o runpicture.o runlabel.o runhistory.o runarray.o runfile.o runsystem.o runpair.o runtriple.o runpath.o runpath3d.o runstring.o runmath.o env.o genv.o stm.o dec.o errormsg.o callable.o name.o symbol.o entry.o exp.o newexp.o stack.o camp.tab.o lex.yy.o access.o virtualfieldaccess.o absyn.o record.o interact.o fileio.o fftw++asy.o simpson.o coder.o coenv.o impdatum.o locate.o parser.o program.o application.o varinit.o fundec.o refaccess.o envcompleter.o process.o constructor.o array.o Delaunay.o predicates.o PRCbitStream.o oPRCFile.o PRCdouble.o writePRC.o glrender.o tr.o arcball.o algebra3.o quaternion.o main.o revision.o asy.o  -Wl,--as-needed -Wl,--no-copy-dt-needed-entries -Wl,-z,relro -Wl,-z,combreloc   -lOSMesa -lglut -lGLU -lGL -lfftw3 -lreadline -lrt -lsigsegv -lz -lm -L/usr/lib -lgc  -ltermcap -lgsl -lgslcblas    -s -static; \
else \
  ln -sf GUI/xasy.py xasy; \
  x86_64-pld-linux-g++ -Wall -DHAVE_CONFIG_H -D_FILE_OFFSET_BITS=64 -DUSEGC  -pthread -DFFTWPP_SINGLE_THREAD  -O2 -fwrapv -pipe -Wformat -Werror=format-security -gdwarf-4 -fno-debug-types-section -fvar-tracking-assignments -g2 -Wp,-D_FORTIFY_SOURCE=2 -fstack-protector-strong --param=ssp-buffer-size=4 -Werror=trampolines -fPIC -march=x86-64 -gdwarf-4 -fno-debug-types-section -fvar-tracking-assignments -g2  -O2 -fwrapv -pipe -Wformat -Werror=format-security -gdwarf-4 -fno-debug-types-section -fvar-tracking-assignments -g2 -Wp,-D_FORTIFY_SOURCE=2 -fstack-protector-strong --param=ssp-buffer-size=4 -Werror=trampolines -fPIC -march=x86-64 -gdwarf-4 -fno-debug-types-section -fvar-tracking-assignments -g2  -fno-var-tracking -o asy camperror.o path.o drawpath.o drawlabel.o picture.o psfile.o texfile.o util.o settings.o guide.o flatguide.o knot.o drawfill.o path3.o drawpath3.o drawsurface.o beziercurve.o bezierpatch.o pen.o pipestream.o types.o builtin.o gsl.o runtime.o runbacktrace.o runpicture.o runlabel.o runhistory.o runarray.o runfile.o runsystem.o runpair.o runtriple.o runpath.o runpath3d.o runstring.o runmath.o env.o genv.o stm.o dec.o errormsg.o callable.o name.o symbol.o entry.o exp.o newexp.o stack.o camp.tab.o lex.yy.o access.o virtualfieldaccess.o absyn.o record.o interact.o fileio.o fftw++asy.o simpson.o coder.o coenv.o impdatum.o locate.o parser.o program.o application.o varinit.o fundec.o refaccess.o envcompleter.o process.o constructor.o array.o Delaunay.o predicates.o PRCbitStream.o oPRCFile.o PRCdouble.o writePRC.o glrender.o tr.o arcball.o algebra3.o quaternion.o main.o revision.o -Wl,--as-needed -Wl,--no-copy-dt-needed-entries -Wl,-z,relro -Wl,-z,combreloc   -lOSMesa -lglut -lGLU -lGL -lfftw3 -lreadline -lrt -lsigsegv -lz -lm -L/usr/lib -lgc -lncurses -lgsl -lgslcblas   ; \
fi
/usr/bin/ld: skipping incompatible /usr/lib/librt.so when searching for -lrt
/usr/bin/ld: skipping incompatible /usr/lib/libstdc++.so when searching for -lstdc++
/usr/bin/ld: skipping incompatible /usr/lib/libstdc++.a when searching for -lstdc++
/usr/bin/ld: skipping incompatible /usr/lib/libm.so when searching for -lm
/usr/bin/ld: skipping incompatible /usr/lib/libpthread.so when searching for -lpthread
/usr/bin/ld: skipping incompatible /usr/lib/libc.so when searching for -lc
/usr/bin/ld: picture.o: in function `operator new(unsigned long, GCPlacement, void (*)(void*, void*), void*)':
/usr/include/gc/gc_cpp.h:545: undefined reference to `GC_throw_bad_alloc()'
/usr/bin/ld: settings.o: in function `gc::operator new(unsigned long)':
/usr/include/gc/gc_cpp.h:410: undefined reference to `GC_throw_bad_alloc()'
/usr/bin/ld: /usr/include/gc/gc_cpp.h:410: undefined reference to `GC_throw_bad_alloc()'
/usr/bin/ld: /usr/include/gc/gc_cpp.h:410: undefined reference to `GC_throw_bad_alloc()'
/usr/bin/ld: /usr/include/gc/gc_cpp.h:410: undefined reference to `GC_throw_bad_alloc()'
/usr/bin/ld: settings.o:/usr/include/gc/gc_cpp.h:410: more undefined references to `GC_throw_bad_alloc()' follow
collect2: error: ld returned 1 exit status
make: *** [Makefile:109: asy] Error 1
error: Bad exit status from /tmp/B.zr_JaG/BUILD/tmp/rpm-tmp.63055 (%build)


RPM build errors:
    Bad exit status from /tmp/B.zr_JaG/BUILD/tmp/rpm-tmp.63055 (%build)
ended at: Sat Oct 19 00:29:37 2019, done in 0:01:06.025518
error: No files produced.
+ chmod -R u+rwX /tmp/B.zr_JaG/BUILD
+ rm -rf /tmp/B.zr_JaG/tmp /tmp/B.zr_JaG/BUILD
+ rm -rf /tmp/B.zr_JaG
Begin-PLD-Builder-Info
Build-Time: user:366.71s sys:23.37s real:70.37s (faults io:0 non-io:5678140)

End-PLD-Builder-Info
[Back to list of logs] [View rpm -qa of builder]