FailedOk

th/SRPMS[OK]
th/x32[OK]
th/i686[OK]
th/x86_64[OK]

ac/SRPMS[OK]
ac/i386[OK]
ac/i586[OK]
ac/i686[OK]
ac/alpha[OK]
ac/amd64[OK]
ac/athlon[OK]
ac/ppc[OK]
ac/sparc[OK]
ac/sparc64[OK]

Advanced Search
main()
Powered by PLD Linux
(c) 2002-2019 PLD Team
$Revision: 1.37 $
Powered by voodoo magic.
Your IP: 35.175.120.174

asymptote 50be0140-6057-4b6b-9e62-e353bc5cd3fc

Status:Failed
Source URL:ftp://buildlogs.pld-linux.org/th/x86_64/FAIL/asymptote,50be0140-6057-4b6b-9e62-e353bc5cd3fc.bz2
text/plain URL:View!
rpm -qa of builder:View!
Date:2019/10/19 14:24:29
Runtime:0:01:05.014457

Toc:

  • prep
  • Executing(%prep): /bin/sh -e /tmp/B.jwtwCh/BUILD/tmp/rpm-tmp.12738
  • build
  • Executing(%build): /bin/sh -e /tmp/B.jwtwCh/BUILD/tmp/rpm-tmp.12738
  • error 1
  • /usr/include/gc/gc_cpp.h:545: undefined reference to `GC_throw_bad_alloc()'
  • error 2
  • /usr/include/gc/gc_cpp.h:410: undefined reference to `GC_throw_bad_alloc()'
  • error 3
  • /usr/bin/ld: /usr/include/gc/gc_cpp.h:410: undefined reference to `GC_throw_bad_alloc()'
  • error 4
  • /usr/bin/ld: /usr/include/gc/gc_cpp.h:410: undefined reference to `GC_throw_bad_alloc()'
  • error 5
  • /usr/bin/ld: /usr/include/gc/gc_cpp.h:410: undefined reference to `GC_throw_bad_alloc()'
  • error 6
  • collect2: error: ld returned 1 exit status
  • error 7
  • error: Bad exit status from /tmp/B.jwtwCh/BUILD/tmp/rpm-tmp.12738 (%build)
  • error 8
  • RPM build errors:
  • error 9
  • error: No files produced.

Content:

request from: baggins
checking if we should skip the build
started at: Sat Oct 19 14:23:22 2019
killing old processes on a builder
sending signal 9 to pid -1
Killed
cleaning up /tmp
fetching https://srcbuilder.pld-linux.org/th//srpms/50be0140-6057-4b6b-9e62-e353bc5cd3fc/asymptote-2.41-2.src.rpm
fetched 3521082 bytes, 5642.5 K/s
installing srpm: asymptote-2.41-2.src.rpm
+ install -d /tmp/B.jwtwCh/BUILD /tmp/B.jwtwCh/RPMS
+ LC_ALL=en_US.UTF-8
+ rpm -qp --changelog asymptote-2.41-2.src.rpm
* Sat Oct 19 2019 PLD Linux Team <feedback@pld-linux.org>
- For complete changelog see: http://git.pld-linux.org/?p=packages/asymptote.git;a=log;h=master
* Thu Oct 17 2019 Arkadiusz Miƛkiewicz <arekm@maven.pl> f0d71ab
- release 2 (by relup.sh) + rpm -Uhv --nodeps --define '_topdir /tmp/B.jwtwCh' --define '_specdir %{_topdir}' --define '_sourcedir %{_specdir}' --define '_rpmdir %{_topdir}/RPMS' --define '_builddir %{_topdir}/BUILD' asymptote-2.41-2.src.rpm Preparing... ################################################## asymptote ################################################## + rm -f asymptote-2.41-2.src.rpm + install -m 700 -d /tmp/B.jwtwCh/BUILD/tmp + TMPDIR=/tmp/B.jwtwCh/BUILD/tmp + exec nice -n 0 rpmbuild -bp --short-circuit --nodeps --define '_topdir /tmp/B.jwtwCh' --define '_specdir %{_topdir}' --define '_sourcedir %{_specdir}' --define '_rpmdir %{_topdir}/RPMS' --define '_builddir %{_topdir}/BUILD' --target x86_64-pld-linux --define 'prep exit 0' /tmp/B.jwtwCh/asymptote.spec Building target platforms: x86_64-pld-linux checking BuildConflict-ing packages no BuildConflicts found checking BR rpm: Building target platforms: x86_64-pld-linux no BR needed building RPM using: set -ex; : build-id: 50be0140-6057-4b6b-9e62-e353bc5cd3fc; TMPDIR=/tmp/B.jwtwCh/BUILD/tmp exec nice -n 0 rpmbuild -bb --define '_smp_mflags -j9' --define '_make_opts -Otarget' --define '_pld_builder 1' --define '_topdir /tmp/B.jwtwCh' --define '_specdir %{_topdir}' --define '_sourcedir %{_specdir}' --define '_rpmdir %{_topdir}/RPMS' --define '_builddir %{_topdir}/BUILD' --target x86_64-pld-linux /tmp/B.jwtwCh/asymptote.spec + : build-id: 50be0140-6057-4b6b-9e62-e353bc5cd3fc + TMPDIR=/tmp/B.jwtwCh/BUILD/tmp + exec nice -n 0 rpmbuild -bb --define '_smp_mflags -j9' --define '_make_opts -Otarget' --define '_pld_builder 1' --define '_topdir /tmp/B.jwtwCh' --define '_specdir %{_topdir}' --define '_sourcedir %{_specdir}' --define '_rpmdir %{_topdir}/RPMS' --define '_builddir %{_topdir}/BUILD' --target x86_64-pld-linux /tmp/B.jwtwCh/asymptote.spec Building target platforms: x86_64-pld-linux Executing(%prep): /bin/sh -e /tmp/B.jwtwCh/BUILD/tmp/rpm-tmp.12738 + umask 022 + cd /tmp/B.jwtwCh/BUILD + cd /tmp/B.jwtwCh/BUILD + rm -rf asymptote-2.41 + /usr/bin/gzip -dc /tmp/B.jwtwCh/asymptote-2.41.src.tgz + /bin/tar -xf - + STATUS=0 + '[' 0 -ne 0 ']' + cd asymptote-2.41 + /bin/id -u + '[' 1000 '=' 0 ']' + /bin/id -u + '[' 1000 '=' 0 ']' + /bin/chmod -Rf a+rX,u+w,g-w,o-w . + echo 'Patch #0 (asymptote-memrchr.patch):' Patch #0 (asymptote-memrchr.patch): + '[' -f /tmp/B.jwtwCh/asymptote-memrchr.patch ']' + /bin/cat /tmp/B.jwtwCh/asymptote-memrchr.patch + /usr/bin/patch -s -p1 + exit 0 Executing(%build): /bin/sh -e /tmp/B.jwtwCh/BUILD/tmp/rpm-tmp.12738 TMP=/home/users/builder/tmp HOME=/home/users/builder PATH=/home/users/builder/GNUstep/Tools:/usr/local/bin:/usr/bin:/bin:/home/users/builder/bin TMPDIR=/tmp/B.jwtwCh/BUILD/tmp + umask 022 + cd /tmp/B.jwtwCh/BUILD + cd asymptote-2.41 + autoconf + autoheader + ./configure 'LDFLAGS=-Wl,--as-needed -Wl,--no-copy-dt-needed-entries -Wl,-z,relro -Wl,-z,combreloc ' 'CFLAGS=-O2 -fwrapv -pipe -Wformat -Werror=format-security -gdwarf-4 -fno-debug-types-section -fvar-tracking-assignments -g2 -Wp,-D_FORTIFY_SOURCE=2 -fstack-protector-strong --param=ssp-buffer-size=4 -Werror=trampolines -fPIC -march=x86-64 -gdwarf-4 -fno-debug-types-section -fvar-tracking-assignments -g2 ' 'CXXFLAGS=-O2 -fwrapv -pipe -Wformat -Werror=format-security -gdwarf-4 -fno-debug-types-section -fvar-tracking-assignments -g2 -Wp,-D_FORTIFY_SOURCE=2 -fstack-protector-strong --param=ssp-buffer-size=4 -Werror=trampolines -fPIC -march=x86-64 -gdwarf-4 -fno-debug-types-section -fvar-tracking-assignments -g2 ' 'FFLAGS=-O2 -fwrapv -pipe -Wformat -Werror=format-security -gdwarf-4 -fno-debug-types-section -fvar-tracking-assignments -g2 -Wp,-D_FORTIFY_SOURCE=2 -fstack-protector-strong --param=ssp-buffer-size=4 -Werror=trampolines -fPIC -march=x86-64 -gdwarf-4 -fno-debug-types-section -fvar-tracking-assignments -g2 ' 'FCFLAGS=-O2 -fwrapv -pipe -Wformat -Werror=format-security -gdwarf-4 -fno-debug-types-section -fvar-tracking-assignments -g2 -Wp,-D_FORTIFY_SOURCE=2 -fstack-protector-strong --param=ssp-buffer-size=4 -Werror=trampolines -fPIC -march=x86-64 -gdwarf-4 -fno-debug-types-section -fvar-tracking-assignments -g2 ' 'CPPFLAGS=' 'CC=x86_64-pld-linux-gcc' 'CXX=x86_64-pld-linux-g++' '--host=x86_64-pld-linux' '--build=x86_64-pld-linux' '--prefix=/usr' '--exec-prefix=/usr' '--bindir=/usr/bin' '--sbindir=/usr/sbin' '--sysconfdir=/etc' '--datadir=/usr/share' '--includedir=/usr/include' '--libdir=/usr/lib64' '--libexecdir=/usr/libexec' '--localstatedir=/var' '--sharedstatedir=/var/lib' '--mandir=/usr/share/man' '--infodir=/usr/share/info' '--x-libraries=/usr/lib64' '--enable-gc=system' '--with-docdir=/usr/share/doc/asymptote-doc' checking for x86_64-pld-linux-gcc... x86_64-pld-linux-gcc checking whether the C compiler works... yes checking for C compiler default output file name... a.out checking for suffix of executables... checking whether we are cross compiling... no checking for suffix of object files... o checking whether we are using the GNU C compiler... yes checking whether x86_64-pld-linux-gcc accepts -g... yes checking for x86_64-pld-linux-gcc option to accept ISO C89... none needed checking how to run the C preprocessor... x86_64-pld-linux-gcc -E checking for grep that handles long lines and -e... /bin/grep checking for egrep... /bin/grep -E checking for ANSI C header files... yes checking for sys/types.h... yes checking for sys/stat.h... yes checking for stdlib.h... yes checking for string.h... yes checking for memory.h... yes checking for strings.h... yes checking for inttypes.h... yes checking for stdint.h... yes checking for unistd.h... yes checking whether byte ordering is bigendian... no checking for kpsewhich... true checking for kpsewhich... (cached) true checking for texi2dvi... texi2dvi configure: Using /usr/share/texmf/tex/latex/asymptote for LaTeX style file configure: Using /usr/share/texmf/tex/context/third/asymptote for ConTeXT style file checking whether we are using the GNU C++ compiler... yes checking whether x86_64-pld-linux-g++ accepts -g... yes checking for flex... flex checking lex output file root... lex.yy checking lex library... none needed checking whether yytext is a pointer... no checking whether we are using the GNU C++ compiler... (cached) yes checking whether x86_64-pld-linux-g++ accepts -g... (cached) yes checking for a BSD-compatible install... /usr/bin/install -c checking for x86_64-pld-linux-gcc... (cached) x86_64-pld-linux-gcc checking whether we are using the GNU C compiler... (cached) yes checking whether x86_64-pld-linux-gcc accepts -g... (cached) yes checking for x86_64-pld-linux-gcc option to accept ISO C89... (cached) none needed checking whether make sets $(MAKE)... yes checking for bison... bison -y checking how to run the C++ preprocessor... x86_64-pld-linux-g++ -E checking unordered_map usability... yes checking unordered_map presence... yes checking for unordered_map... yes checking for gc-7.6.0.tar.gz... yes checking gc.h usability... yes checking gc.h presence... yes checking for gc.h... yes checking for GC_malloc in -lgc... yes configure: enabling system Boehm Garbage Collector checking for getopt_long_only... yes checking for sqrt in -lm... yes checking for deflate in -lz... yes checking build system type... x86_64-pld-linux-gnu checking host system type... x86_64-pld-linux-gnu checking for the pthreads library -lpthreads... no checking whether pthreads work without any flags... no checking whether pthreads work with -Kthread... no checking whether pthreads work with -kthread... no checking for the pthreads library -llthread... no checking whether pthreads work with -pthread... yes checking for joinable pthread attribute... PTHREAD_CREATE_JOINABLE checking if more special flags are required for pthreads... no checking for PTHREAD_PRIO_INHERIT... yes checking for stackoverflow_install_handler in -lsigsegv... yes checking for sched_yield in -lrt... yes checking for history_list in -lreadline... yes checking ncurses/curses.h usability... yes checking ncurses/curses.h presence... yes checking for ncurses/curses.h... yes checking for setupterm in -lncurses... yes checking for sys/wait.h that is POSIX.1 compatible... yes checking fenv.h usability... yes checking fenv.h presence... yes checking for fenv.h... yes checking stddef.h usability... yes checking stddef.h presence... yes checking for stddef.h... yes checking libintl.h usability... yes checking libintl.h presence... yes checking for libintl.h... yes checking fpu_control.h usability... yes checking fpu_control.h presence... yes checking for fpu_control.h... yes checking for library containing xdrstdio_create... none required checking gsl/gsl_sf.h usability... yes checking gsl/gsl_sf.h presence... yes checking for gsl/gsl_sf.h... yes checking for gsl_sf_debye_6 in -lgsl... yes checking fftw3.h usability... yes checking fftw3.h presence... yes checking for fftw3.h... yes checking for fftw_execute in -lfftw3... yes checking for glDepthMask in -lGL... yes checking for gluNewNurbsRenderer in -lGLU... yes checking for glutMainLoop in -lglut... yes checking for OSMesaCreateContext in -lOSMesa... yes checking for pid_t... yes checking for size_t... yes checking for ptrdiff_t... yes checking for long long... yes checking for long... yes checking for an ANSI C-conforming const... yes checking for inline... inline checking return type of signal handlers... void checking vfork.h usability... no checking vfork.h presence... no checking for vfork.h... no checking for fork... yes checking for vfork... yes checking for working fork... yes checking for working vfork... (cached) yes checking for dup2... yes checking for floor... yes checking for memset... yes checking for pow... yes checking for sqrt... yes checking for strchr... yes checking for tgamma... yes checking for memrchr... yes checking for strftime... yes checking for strptime... yes checking for error_at_line... yes checking for _LARGEFILE_SOURCE value needed for large files... no configure: creating ./config.status config.status: creating Makefile config.status: creating doc/Makefile config.status: creating doc/png/Makefile config.status: creating config.h + /usr/bin/make -Otarget -j9 all Creating arcball.d Creating quaternion.d Creating algebra3.d Creating predicates.d Creating PRCdouble.d Creating oPRCFile.d Creating PRCbitStream.d Creating tr.d Creating main.d Creating writePRC.d Creating Delaunay.d Creating array.d Creating constructor.d Creating envcompleter.d Creating process.d Creating refaccess.d Creating glrender.d Creating varinit.d Creating fundec.d Creating simpson.d Creating program.d Creating parser.d Creating application.d Creating locate.d Creating impdatum.d Creating coenv.d Creating fftw++asy.d Creating coder.d Creating record.d Creating absyn.d Creating interact.d Creating virtualfieldaccess.d Creating lex.yy.d Creating access.d Creating fileio.d Creating stack.d Creating newexp.d Creating symbol.d Creating entry.d Creating camp.tab.d Creating name.d Creating callable.d Creating errormsg.d Creating exp.d Creating dec.d Creating stm.d Creating genv.d Creating runmath.d Creating env.d Creating runpath.d Creating runpath3d.d Creating runstring.d Creating runtriple.d Creating runpair.d Creating runfile.d Creating runsystem.d Creating runarray.d Creating runhistory.d Creating runlabel.d Creating runpicture.d Creating types.d Creating runtime.d Creating runbacktrace.d Creating pipestream.d Creating gsl.d Creating builtin.d Creating pen.d Creating knot.d Creating path3.d Creating bezierpatch.d Creating beziercurve.d Creating drawpath3.d Creating drawfill.d Creating drawsurface.d Creating flatguide.d Creating util.d Creating guide.d Creating psfile.d Creating texfile.d Creating settings.d Creating drawlabel.d Creating drawpath.d Creating picture.d Creating path.d Creating camperror.d x86_64-pld-linux-g++ -Wall -DHAVE_CONFIG_H -D_FILE_OFFSET_BITS=64 -DUSEGC -pthread -DFFTWPP_SINGLE_THREAD -O2 -fwrapv -pipe -Wformat -Werror=format-security -gdwarf-4 -fno-debug-types-section -fvar-tracking-assignments -g2 -Wp,-D_FORTIFY_SOURCE=2 -fstack-protector-strong --param=ssp-buffer-size=4 -Werror=trampolines -fPIC -march=x86-64 -gdwarf-4 -fno-debug-types-section -fvar-tracking-assignments -g2 -O2 -fwrapv -pipe -Wformat -Werror=format-security -gdwarf-4 -fno-debug-types-section -fvar-tracking-assignments -g2 -Wp,-D_FORTIFY_SOURCE=2 -fstack-protector-strong --param=ssp-buffer-size=4 -Werror=trampolines -fPIC -march=x86-64 -gdwarf-4 -fno-debug-types-section -fvar-tracking-assignments -g2 -fno-var-tracking -I. -I/usr/include/gc -I/usr/include/gc -o camperror.o -c camperror.cc In file included from common.h:35, from camperror.h:16, from camperror.cc:14: memory.h: In function 'void mem::compact(int)': memory.h:185:29: warning: 'GC_dont_expand' is deprecated [-Wdeprecated-declarations] 185 | inline void compact(int x) {GC_dont_expand=x;} | ^~~~~~~~~~~~~~ In file included from memory.h:50, from common.h:35, from camperror.h:16, from camperror.cc:14: /usr/include/gc/gc.h:255:31: note: declared here 255 | GC_API GC_ATTR_DEPRECATED int GC_dont_expand; | ^~~~~~~~~~~~~~ x86_64-pld-linux-g++ -Wall -DHAVE_CONFIG_H -D_FILE_OFFSET_BITS=64 -DUSEGC -pthread -DFFTWPP_SINGLE_THREAD -O2 -fwrapv -pipe -Wformat -Werror=format-security -gdwarf-4 -fno-debug-types-section -fvar-tracking-assignments -g2 -Wp,-D_FORTIFY_SOURCE=2 -fstack-protector-strong --param=ssp-buffer-size=4 -Werror=trampolines -fPIC -march=x86-64 -gdwarf-4 -fno-debug-types-section -fvar-tracking-assignments -g2 -O2 -fwrapv -pipe -Wformat -Werror=format-security -gdwarf-4 -fno-debug-types-section -fvar-tracking-assignments -g2 -Wp,-D_FORTIFY_SOURCE=2 -fstack-protector-strong --param=ssp-buffer-size=4 -Werror=trampolines -fPIC -march=x86-64 -gdwarf-4 -fno-debug-types-section -fvar-tracking-assignments -g2 -fno-var-tracking -I. -I/usr/include/gc -I/usr/include/gc -o util.o -c util.cc In file included from common.h:35, from util.h:23, from util.cc:23: memory.h: In function 'void mem::compact(int)': memory.h:185:29: warning: 'GC_dont_expand' is deprecated [-Wdeprecated-declarations] 185 | inline void compact(int x) {GC_dont_expand=x;} | ^~~~~~~~~~~~~~ In file included from memory.h:50, from common.h:35, from util.h:23, from util.cc:23: /usr/include/gc/gc.h:255:31: note: declared here 255 | GC_API GC_ATTR_DEPRECATED int GC_dont_expand; | ^~~~~~~~~~~~~~ x86_64-pld-linux-g++ -Wall -DHAVE_CONFIG_H -D_FILE_OFFSET_BITS=64 -DUSEGC -pthread -DFFTWPP_SINGLE_THREAD -O2 -fwrapv -pipe -Wformat -Werror=format-security -gdwarf-4 -fno-debug-types-section -fvar-tracking-assignments -g2 -Wp,-D_FORTIFY_SOURCE=2 -fstack-protector-strong --param=ssp-buffer-size=4 -Werror=trampolines -fPIC -march=x86-64 -gdwarf-4 -fno-debug-types-section -fvar-tracking-assignments -g2 -O2 -fwrapv -pipe -Wformat -Werror=format-security -gdwarf-4 -fno-debug-types-section -fvar-tracking-assignments -g2 -Wp,-D_FORTIFY_SOURCE=2 -fstack-protector-strong --param=ssp-buffer-size=4 -Werror=trampolines -fPIC -march=x86-64 -gdwarf-4 -fno-debug-types-section -fvar-tracking-assignments -g2 -fno-var-tracking -I. -I/usr/include/gc -I/usr/include/gc -o guide.o -c guide.cc In file included from common.h:35, from mod.h:13, from knot.h:16, from guide.h:11, from guide.cc:7: memory.h: In function 'void mem::compact(int)': memory.h:185:29: warning: 'GC_dont_expand' is deprecated [-Wdeprecated-declarations] 185 | inline void compact(int x) {GC_dont_expand=x;} | ^~~~~~~~~~~~~~ In file included from memory.h:50, from common.h:35, from mod.h:13, from knot.h:16, from guide.h:11, from guide.cc:7: /usr/include/gc/gc.h:255:31: note: declared here 255 | GC_API GC_ATTR_DEPRECATED int GC_dont_expand; | ^~~~~~~~~~~~~~ x86_64-pld-linux-g++ -Wall -DHAVE_CONFIG_H -D_FILE_OFFSET_BITS=64 -DUSEGC -pthread -DFFTWPP_SINGLE_THREAD -O2 -fwrapv -pipe -Wformat -Werror=format-security -gdwarf-4 -fno-debug-types-section -fvar-tracking-assignments -g2 -Wp,-D_FORTIFY_SOURCE=2 -fstack-protector-strong --param=ssp-buffer-size=4 -Werror=trampolines -fPIC -march=x86-64 -gdwarf-4 -fno-debug-types-section -fvar-tracking-assignments -g2 -O2 -fwrapv -pipe -Wformat -Werror=format-security -gdwarf-4 -fno-debug-types-section -fvar-tracking-assignments -g2 -Wp,-D_FORTIFY_SOURCE=2 -fstack-protector-strong --param=ssp-buffer-size=4 -Werror=trampolines -fPIC -march=x86-64 -gdwarf-4 -fno-debug-types-section -fvar-tracking-assignments -g2 -fno-var-tracking -I. -I/usr/include/gc -I/usr/include/gc -o path.o -c path.cc In file included from common.h:35, from mod.h:13, from path.h:16, from path.cc:11: memory.h: In function 'void mem::compact(int)': memory.h:185:29: warning: 'GC_dont_expand' is deprecated [-Wdeprecated-declarations] 185 | inline void compact(int x) {GC_dont_expand=x;} | ^~~~~~~~~~~~~~ In file included from memory.h:50, from common.h:35, from mod.h:13, from path.h:16, from path.cc:11: /usr/include/gc/gc.h:255:31: note: declared here 255 | GC_API GC_ATTR_DEPRECATED int GC_dont_expand; | ^~~~~~~~~~~~~~ x86_64-pld-linux-g++ -Wall -DHAVE_CONFIG_H -D_FILE_OFFSET_BITS=64 -DUSEGC -pthread -DFFTWPP_SINGLE_THREAD -O2 -fwrapv -pipe -Wformat -Werror=format-security -gdwarf-4 -fno-debug-types-section -fvar-tracking-assignments -g2 -Wp,-D_FORTIFY_SOURCE=2 -fstack-protector-strong --param=ssp-buffer-size=4 -Werror=trampolines -fPIC -march=x86-64 -gdwarf-4 -fno-debug-types-section -fvar-tracking-assignments -g2 -O2 -fwrapv -pipe -Wformat -Werror=format-security -gdwarf-4 -fno-debug-types-section -fvar-tracking-assignments -g2 -Wp,-D_FORTIFY_SOURCE=2 -fstack-protector-strong --param=ssp-buffer-size=4 -Werror=trampolines -fPIC -march=x86-64 -gdwarf-4 -fno-debug-types-section -fvar-tracking-assignments -g2 -fno-var-tracking -I. -I/usr/include/gc -I/usr/include/gc -o flatguide.o -c flatguide.cc In file included from common.h:35, from mod.h:13, from knot.h:16, from flatguide.h:15, from flatguide.cc:10: memory.h: In function 'void mem::compact(int)': memory.h:185:29: warning: 'GC_dont_expand' is deprecated [-Wdeprecated-declarations] 185 | inline void compact(int x) {GC_dont_expand=x;} | ^~~~~~~~~~~~~~ In file included from memory.h:50, from common.h:35, from mod.h:13, from knot.h:16, from flatguide.h:15, from flatguide.cc:10: /usr/include/gc/gc.h:255:31: note: declared here 255 | GC_API GC_ATTR_DEPRECATED int GC_dont_expand; | ^~~~~~~~~~~~~~ x86_64-pld-linux-g++ -Wall -DHAVE_CONFIG_H -D_FILE_OFFSET_BITS=64 -DUSEGC -pthread -DFFTWPP_SINGLE_THREAD -O2 -fwrapv -pipe -Wformat -Werror=format-security -gdwarf-4 -fno-debug-types-section -fvar-tracking-assignments -g2 -Wp,-D_FORTIFY_SOURCE=2 -fstack-protector-strong --param=ssp-buffer-size=4 -Werror=trampolines -fPIC -march=x86-64 -gdwarf-4 -fno-debug-types-section -fvar-tracking-assignments -g2 -O2 -fwrapv -pipe -Wformat -Werror=format-security -gdwarf-4 -fno-debug-types-section -fvar-tracking-assignments -g2 -Wp,-D_FORTIFY_SOURCE=2 -fstack-protector-strong --param=ssp-buffer-size=4 -Werror=trampolines -fPIC -march=x86-64 -gdwarf-4 -fno-debug-types-section -fvar-tracking-assignments -g2 -fno-var-tracking -I. -I/usr/include/gc -I/usr/include/gc -o psfile.o -c psfile.cc In file included from common.h:35, from pair.h:20, from psfile.h:16, from psfile.cc:14: memory.h: In function 'void mem::compact(int)': memory.h:185:29: warning: 'GC_dont_expand' is deprecated [-Wdeprecated-declarations] 185 | inline void compact(int x) {GC_dont_expand=x;} | ^~~~~~~~~~~~~~ In file included from memory.h:50, from common.h:35, from pair.h:20, from psfile.h:16, from psfile.cc:14: /usr/include/gc/gc.h:255:31: note: declared here 255 | GC_API GC_ATTR_DEPRECATED int GC_dont_expand; | ^~~~~~~~~~~~~~ x86_64-pld-linux-g++ -Wall -DHAVE_CONFIG_H -D_FILE_OFFSET_BITS=64 -DUSEGC -pthread -DFFTWPP_SINGLE_THREAD -O2 -fwrapv -pipe -Wformat -Werror=format-security -gdwarf-4 -fno-debug-types-section -fvar-tracking-assignments -g2 -Wp,-D_FORTIFY_SOURCE=2 -fstack-protector-strong --param=ssp-buffer-size=4 -Werror=trampolines -fPIC -march=x86-64 -gdwarf-4 -fno-debug-types-section -fvar-tracking-assignments -g2 -O2 -fwrapv -pipe -Wformat -Werror=format-security -gdwarf-4 -fno-debug-types-section -fvar-tracking-assignments -g2 -Wp,-D_FORTIFY_SOURCE=2 -fstack-protector-strong --param=ssp-buffer-size=4 -Werror=trampolines -fPIC -march=x86-64 -gdwarf-4 -fno-debug-types-section -fvar-tracking-assignments -g2 -fno-var-tracking -I. -I/usr/include/gc -I/usr/include/gc -o drawpath.o -c drawpath.cc In file included from common.h:35, from drawelement.h:13, from drawpath.h:11, from drawpath.cc:12: memory.h: In function 'void mem::compact(int)': memory.h:185:29: warning: 'GC_dont_expand' is deprecated [-Wdeprecated-declarations] 185 | inline void compact(int x) {GC_dont_expand=x;} | ^~~~~~~~~~~~~~ In file included from memory.h:50, from common.h:35, from drawelement.h:13, from drawpath.h:11, from drawpath.cc:12: /usr/include/gc/gc.h:255:31: note: declared here 255 | GC_API GC_ATTR_DEPRECATED int GC_dont_expand; | ^~~~~~~~~~~~~~ x86_64-pld-linux-g++ -Wall -DHAVE_CONFIG_H -D_FILE_OFFSET_BITS=64 -DUSEGC -pthread -DFFTWPP_SINGLE_THREAD -O2 -fwrapv -pipe -Wformat -Werror=format-security -gdwarf-4 -fno-debug-types-section -fvar-tracking-assignments -g2 -Wp,-D_FORTIFY_SOURCE=2 -fstack-protector-strong --param=ssp-buffer-size=4 -Werror=trampolines -fPIC -march=x86-64 -gdwarf-4 -fno-debug-types-section -fvar-tracking-assignments -g2 -O2 -fwrapv -pipe -Wformat -Werror=format-security -gdwarf-4 -fno-debug-types-section -fvar-tracking-assignments -g2 -Wp,-D_FORTIFY_SOURCE=2 -fstack-protector-strong --param=ssp-buffer-size=4 -Werror=trampolines -fPIC -march=x86-64 -gdwarf-4 -fno-debug-types-section -fvar-tracking-assignments -g2 -fno-var-tracking -I. -I/usr/include/gc -I/usr/include/gc -o texfile.o -c texfile.cc In file included from common.h:35, from texfile.h:15, from texfile.cc:11: memory.h: In function 'void mem::compact(int)': memory.h:185:29: warning: 'GC_dont_expand' is deprecated [-Wdeprecated-declarations] 185 | inline void compact(int x) {GC_dont_expand=x;} | ^~~~~~~~~~~~~~ In file included from memory.h:50, from common.h:35, from texfile.h:15, from texfile.cc:11: /usr/include/gc/gc.h:255:31: note: declared here 255 | GC_API GC_ATTR_DEPRECATED int GC_dont_expand; | ^~~~~~~~~~~~~~ x86_64-pld-linux-g++ -Wall -DHAVE_CONFIG_H -D_FILE_OFFSET_BITS=64 -DUSEGC -pthread -DFFTWPP_SINGLE_THREAD -O2 -fwrapv -pipe -Wformat -Werror=format-security -gdwarf-4 -fno-debug-types-section -fvar-tracking-assignments -g2 -Wp,-D_FORTIFY_SOURCE=2 -fstack-protector-strong --param=ssp-buffer-size=4 -Werror=trampolines -fPIC -march=x86-64 -gdwarf-4 -fno-debug-types-section -fvar-tracking-assignments -g2 -O2 -fwrapv -pipe -Wformat -Werror=format-security -gdwarf-4 -fno-debug-types-section -fvar-tracking-assignments -g2 -Wp,-D_FORTIFY_SOURCE=2 -fstack-protector-strong --param=ssp-buffer-size=4 -Werror=trampolines -fPIC -march=x86-64 -gdwarf-4 -fno-debug-types-section -fvar-tracking-assignments -g2 -fno-var-tracking -I. -I/usr/include/gc -I/usr/include/gc -o drawlabel.o -c drawlabel.cc In file included from common.h:35, from drawelement.h:13, from drawlabel.h:11, from drawlabel.cc:10: memory.h: In function 'void mem::compact(int)': memory.h:185:29: warning: 'GC_dont_expand' is deprecated [-Wdeprecated-declarations] 185 | inline void compact(int x) {GC_dont_expand=x;} | ^~~~~~~~~~~~~~ In file included from memory.h:50, from common.h:35, from drawelement.h:13, from drawlabel.h:11, from drawlabel.cc:10: /usr/include/gc/gc.h:255:31: note: declared here 255 | GC_API GC_ATTR_DEPRECATED int GC_dont_expand; | ^~~~~~~~~~~~~~ x86_64-pld-linux-g++ -Wall -DHAVE_CONFIG_H -D_FILE_OFFSET_BITS=64 -DUSEGC -pthread -DFFTWPP_SINGLE_THREAD -O2 -fwrapv -pipe -Wformat -Werror=format-security -gdwarf-4 -fno-debug-types-section -fvar-tracking-assignments -g2 -Wp,-D_FORTIFY_SOURCE=2 -fstack-protector-strong --param=ssp-buffer-size=4 -Werror=trampolines -fPIC -march=x86-64 -gdwarf-4 -fno-debug-types-section -fvar-tracking-assignments -g2 -O2 -fwrapv -pipe -Wformat -Werror=format-security -gdwarf-4 -fno-debug-types-section -fvar-tracking-assignments -g2 -Wp,-D_FORTIFY_SOURCE=2 -fstack-protector-strong --param=ssp-buffer-size=4 -Werror=trampolines -fPIC -march=x86-64 -gdwarf-4 -fno-debug-types-section -fvar-tracking-assignments -g2 -fno-var-tracking -I. -I/usr/include/gc -I/usr/include/gc -o knot.o -c knot.cc In file included from common.h:35, from mod.h:13, from knot.h:16, from knot.cc:9: memory.h: In function 'void mem::compact(int)': memory.h:185:29: warning: 'GC_dont_expand' is deprecated [-Wdeprecated-declarations] 185 | inline void compact(int x) {GC_dont_expand=x;} | ^~~~~~~~~~~~~~ In file included from memory.h:50, from common.h:35, from mod.h:13, from knot.h:16, from knot.cc:9: /usr/include/gc/gc.h:255:31: note: declared here 255 | GC_API GC_ATTR_DEPRECATED int GC_dont_expand; | ^~~~~~~~~~~~~~ x86_64-pld-linux-g++ -Wall -DHAVE_CONFIG_H -D_FILE_OFFSET_BITS=64 -DUSEGC -pthread -DFFTWPP_SINGLE_THREAD -O2 -fwrapv -pipe -Wformat -Werror=format-security -gdwarf-4 -fno-debug-types-section -fvar-tracking-assignments -g2 -Wp,-D_FORTIFY_SOURCE=2 -fstack-protector-strong --param=ssp-buffer-size=4 -Werror=trampolines -fPIC -march=x86-64 -gdwarf-4 -fno-debug-types-section -fvar-tracking-assignments -g2 -O2 -fwrapv -pipe -Wformat -Werror=format-security -gdwarf-4 -fno-debug-types-section -fvar-tracking-assignments -g2 -Wp,-D_FORTIFY_SOURCE=2 -fstack-protector-strong --param=ssp-buffer-size=4 -Werror=trampolines -fPIC -march=x86-64 -gdwarf-4 -fno-debug-types-section -fvar-tracking-assignments -g2 -fno-var-tracking -I. -I/usr/include/gc -I/usr/include/gc -o beziercurve.o -c beziercurve.cc In file included from common.h:35, from drawelement.h:13, from beziercurve.h:11, from beziercurve.cc:8: memory.h: In function 'void mem::compact(int)': memory.h:185:29: warning: 'GC_dont_expand' is deprecated [-Wdeprecated-declarations] 185 | inline void compact(int x) {GC_dont_expand=x;} | ^~~~~~~~~~~~~~ In file included from memory.h:50, from common.h:35, from drawelement.h:13, from beziercurve.h:11, from beziercurve.cc:8: /usr/include/gc/gc.h:255:31: note: declared here 255 | GC_API GC_ATTR_DEPRECATED int GC_dont_expand; | ^~~~~~~~~~~~~~ x86_64-pld-linux-g++ -Wall -DHAVE_CONFIG_H -D_FILE_OFFSET_BITS=64 -DUSEGC -pthread -DFFTWPP_SINGLE_THREAD -O2 -fwrapv -pipe -Wformat -Werror=format-security -gdwarf-4 -fno-debug-types-section -fvar-tracking-assignments -g2 -Wp,-D_FORTIFY_SOURCE=2 -fstack-protector-strong --param=ssp-buffer-size=4 -Werror=trampolines -fPIC -march=x86-64 -gdwarf-4 -fno-debug-types-section -fvar-tracking-assignments -g2 -O2 -fwrapv -pipe -Wformat -Werror=format-security -gdwarf-4 -fno-debug-types-section -fvar-tracking-assignments -g2 -Wp,-D_FORTIFY_SOURCE=2 -fstack-protector-strong --param=ssp-buffer-size=4 -Werror=trampolines -fPIC -march=x86-64 -gdwarf-4 -fno-debug-types-section -fvar-tracking-assignments -g2 -fno-var-tracking -I. -I/usr/include/gc -I/usr/include/gc -o drawpath3.o -c drawpath3.cc In file included from common.h:35, from drawelement.h:13, from drawpath3.h:10, from drawpath3.cc:7: memory.h: In function 'void mem::compact(int)': memory.h:185:29: warning: 'GC_dont_expand' is deprecated [-Wdeprecated-declarations] 185 | inline void compact(int x) {GC_dont_expand=x;} | ^~~~~~~~~~~~~~ In file included from memory.h:50, from common.h:35, from drawelement.h:13, from drawpath3.h:10, from drawpath3.cc:7: /usr/include/gc/gc.h:255:31: note: declared here 255 | GC_API GC_ATTR_DEPRECATED int GC_dont_expand; | ^~~~~~~~~~~~~~ x86_64-pld-linux-g++ -Wall -DHAVE_CONFIG_H -D_FILE_OFFSET_BITS=64 -DUSEGC -pthread -DFFTWPP_SINGLE_THREAD -O2 -fwrapv -pipe -Wformat -Werror=format-security -gdwarf-4 -fno-debug-types-section -fvar-tracking-assignments -g2 -Wp,-D_FORTIFY_SOURCE=2 -fstack-protector-strong --param=ssp-buffer-size=4 -Werror=trampolines -fPIC -march=x86-64 -gdwarf-4 -fno-debug-types-section -fvar-tracking-assignments -g2 -O2 -fwrapv -pipe -Wformat -Werror=format-security -gdwarf-4 -fno-debug-types-section -fvar-tracking-assignments -g2 -Wp,-D_FORTIFY_SOURCE=2 -fstack-protector-strong --param=ssp-buffer-size=4 -Werror=trampolines -fPIC -march=x86-64 -gdwarf-4 -fno-debug-types-section -fvar-tracking-assignments -g2 -fno-var-tracking -I. -I/usr/include/gc -I/usr/include/gc -o path3.o -c path3.cc In file included from common.h:35, from mod.h:13, from path3.h:14, from path3.cc:10: memory.h: In function 'void mem::compact(int)': memory.h:185:29: warning: 'GC_dont_expand' is deprecated [-Wdeprecated-declarations] 185 | inline void compact(int x) {GC_dont_expand=x;} | ^~~~~~~~~~~~~~ In file included from memory.h:50, from common.h:35, from mod.h:13, from path3.h:14, from path3.cc:10: /usr/include/gc/gc.h:255:31: note: declared here 255 | GC_API GC_ATTR_DEPRECATED int GC_dont_expand; | ^~~~~~~~~~~~~~ x86_64-pld-linux-g++ -Wall -DHAVE_CONFIG_H -D_FILE_OFFSET_BITS=64 -DUSEGC -pthread -DFFTWPP_SINGLE_THREAD -O2 -fwrapv -pipe -Wformat -Werror=format-security -gdwarf-4 -fno-debug-types-section -fvar-tracking-assignments -g2 -Wp,-D_FORTIFY_SOURCE=2 -fstack-protector-strong --param=ssp-buffer-size=4 -Werror=trampolines -fPIC -march=x86-64 -gdwarf-4 -fno-debug-types-section -fvar-tracking-assignments -g2 -O2 -fwrapv -pipe -Wformat -Werror=format-security -gdwarf-4 -fno-debug-types-section -fvar-tracking-assignments -g2 -Wp,-D_FORTIFY_SOURCE=2 -fstack-protector-strong --param=ssp-buffer-size=4 -Werror=trampolines -fPIC -march=x86-64 -gdwarf-4 -fno-debug-types-section -fvar-tracking-assignments -g2 -fno-var-tracking -I. -I/usr/include/gc -I/usr/include/gc -o pen.o -c pen.cc In file included from common.h:35, from pair.h:20, from transform.h:17, from pen.h:12, from pen.cc:7: memory.h: In function 'void mem::compact(int)': memory.h:185:29: warning: 'GC_dont_expand' is deprecated [-Wdeprecated-declarations] 185 | inline void compact(int x) {GC_dont_expand=x;} | ^~~~~~~~~~~~~~ In file included from memory.h:50, from common.h:35, from pair.h:20, from transform.h:17, from pen.h:12, from pen.cc:7: /usr/include/gc/gc.h:255:31: note: declared here 255 | GC_API GC_ATTR_DEPRECATED int GC_dont_expand; | ^~~~~~~~~~~~~~ x86_64-pld-linux-g++ -Wall -DHAVE_CONFIG_H -D_FILE_OFFSET_BITS=64 -DUSEGC -pthread -DFFTWPP_SINGLE_THREAD -O2 -fwrapv -pipe -Wformat -Werror=format-security -gdwarf-4 -fno-debug-types-section -fvar-tracking-assignments -g2 -Wp,-D_FORTIFY_SOURCE=2 -fstack-protector-strong --param=ssp-buffer-size=4 -Werror=trampolines -fPIC -march=x86-64 -gdwarf-4 -fno-debug-types-section -fvar-tracking-assignments -g2 -O2 -fwrapv -pipe -Wformat -Werror=format-security -gdwarf-4 -fno-debug-types-section -fvar-tracking-assignments -g2 -Wp,-D_FORTIFY_SOURCE=2 -fstack-protector-strong --param=ssp-buffer-size=4 -Werror=trampolines -fPIC -march=x86-64 -gdwarf-4 -fno-debug-types-section -fvar-tracking-assignments -g2 -fno-var-tracking -I. -I/usr/include/gc -I/usr/include/gc -o pipestream.o -c pipestream.cc In file included from common.h:35, from pipestream.h:27, from pipestream.cc:25: memory.h: In function 'void mem::compact(int)': memory.h:185:29: warning: 'GC_dont_expand' is deprecated [-Wdeprecated-declarations] 185 | inline void compact(int x) {GC_dont_expand=x;} | ^~~~~~~~~~~~~~ In file included from memory.h:50, from common.h:35, from pipestream.h:27, from pipestream.cc:25: /usr/include/gc/gc.h:255:31: note: declared here 255 | GC_API GC_ATTR_DEPRECATED int GC_dont_expand; | ^~~~~~~~~~~~~~ x86_64-pld-linux-g++ -Wall -DHAVE_CONFIG_H -D_FILE_OFFSET_BITS=64 -DUSEGC -pthread -DFFTWPP_SINGLE_THREAD -O2 -fwrapv -pipe -Wformat -Werror=format-security -gdwarf-4 -fno-debug-types-section -fvar-tracking-assignments -g2 -Wp,-D_FORTIFY_SOURCE=2 -fstack-protector-strong --param=ssp-buffer-size=4 -Werror=trampolines -fPIC -march=x86-64 -gdwarf-4 -fno-debug-types-section -fvar-tracking-assignments -g2 -O2 -fwrapv -pipe -Wformat -Werror=format-security -gdwarf-4 -fno-debug-types-section -fvar-tracking-assignments -g2 -Wp,-D_FORTIFY_SOURCE=2 -fstack-protector-strong --param=ssp-buffer-size=4 -Werror=trampolines -fPIC -march=x86-64 -gdwarf-4 -fno-debug-types-section -fvar-tracking-assignments -g2 -fno-var-tracking -I. -I/usr/include/gc -I/usr/include/gc -o drawfill.o -c drawfill.cc In file included from common.h:35, from drawelement.h:13, from drawfill.h:11, from drawfill.cc:8: memory.h: In function 'void mem::compact(int)': memory.h:185:29: warning: 'GC_dont_expand' is deprecated [-Wdeprecated-declarations] 185 | inline void compact(int x) {GC_dont_expand=x;} | ^~~~~~~~~~~~~~ In file included from memory.h:50, from common.h:35, from drawelement.h:13, from drawfill.h:11, from drawfill.cc:8: /usr/include/gc/gc.h:255:31: note: declared here 255 | GC_API GC_ATTR_DEPRECATED int GC_dont_expand; | ^~~~~~~~~~~~~~ x86_64-pld-linux-g++ -Wall -DHAVE_CONFIG_H -D_FILE_OFFSET_BITS=64 -DUSEGC -pthread -DFFTWPP_SINGLE_THREAD -O2 -fwrapv -pipe -Wformat -Werror=format-security -gdwarf-4 -fno-debug-types-section -fvar-tracking-assignments -g2 -Wp,-D_FORTIFY_SOURCE=2 -fstack-protector-strong --param=ssp-buffer-size=4 -Werror=trampolines -fPIC -march=x86-64 -gdwarf-4 -fno-debug-types-section -fvar-tracking-assignments -g2 -O2 -fwrapv -pipe -Wformat -Werror=format-security -gdwarf-4 -fno-debug-types-section -fvar-tracking-assignments -g2 -Wp,-D_FORTIFY_SOURCE=2 -fstack-protector-strong --param=ssp-buffer-size=4 -Werror=trampolines -fPIC -march=x86-64 -gdwarf-4 -fno-debug-types-section -fvar-tracking-assignments -g2 -fno-var-tracking -I. -I/usr/include/gc -I/usr/include/gc -o bezierpatch.o -c bezierpatch.cc In file included from common.h:35, from drawelement.h:13, from bezierpatch.h:11, from bezierpatch.cc:8: memory.h: In function 'void mem::compact(int)': memory.h:185:29: warning: 'GC_dont_expand' is deprecated [-Wdeprecated-declarations] 185 | inline void compact(int x) {GC_dont_expand=x;} | ^~~~~~~~~~~~~~ In file included from memory.h:50, from common.h:35, from drawelement.h:13, from bezierpatch.h:11, from bezierpatch.cc:8: /usr/include/gc/gc.h:255:31: note: declared here 255 | GC_API GC_ATTR_DEPRECATED int GC_dont_expand; | ^~~~~~~~~~~~~~ x86_64-pld-linux-g++ -Wall -DHAVE_CONFIG_H -D_FILE_OFFSET_BITS=64 -DUSEGC -pthread -DFFTWPP_SINGLE_THREAD -O2 -fwrapv -pipe -Wformat -Werror=format-security -gdwarf-4 -fno-debug-types-section -fvar-tracking-assignments -g2 -Wp,-D_FORTIFY_SOURCE=2 -fstack-protector-strong --param=ssp-buffer-size=4 -Werror=trampolines -fPIC -march=x86-64 -gdwarf-4 -fno-debug-types-section -fvar-tracking-assignments -g2 -O2 -fwrapv -pipe -Wformat -Werror=format-security -gdwarf-4 -fno-debug-types-section -fvar-tracking-assignments -g2 -Wp,-D_FORTIFY_SOURCE=2 -fstack-protector-strong --param=ssp-buffer-size=4 -Werror=trampolines -fPIC -march=x86-64 -gdwarf-4 -fno-debug-types-section -fvar-tracking-assignments -g2 -fno-var-tracking -I. -I/usr/include/gc -I/usr/include/gc -o types.o -c types.cc In file included from common.h:35, from entry.h:15, from types.cc:12: memory.h: In function 'void mem::compact(int)': memory.h:185:29: warning: 'GC_dont_expand' is deprecated [-Wdeprecated-declarations] 185 | inline void compact(int x) {GC_dont_expand=x;} | ^~~~~~~~~~~~~~ In file included from memory.h:50, from common.h:35, from entry.h:15, from types.cc:12: /usr/include/gc/gc.h:255:31: note: declared here 255 | GC_API GC_ATTR_DEPRECATED int GC_dont_expand; | ^~~~~~~~~~~~~~ x86_64-pld-linux-g++ -Wall -DHAVE_CONFIG_H -D_FILE_OFFSET_BITS=64 -DUSEGC -pthread -DFFTWPP_SINGLE_THREAD -O2 -fwrapv -pipe -Wformat -Werror=format-security -gdwarf-4 -fno-debug-types-section -fvar-tracking-assignments -g2 -Wp,-D_FORTIFY_SOURCE=2 -fstack-protector-strong --param=ssp-buffer-size=4 -Werror=trampolines -fPIC -march=x86-64 -gdwarf-4 -fno-debug-types-section -fvar-tracking-assignments -g2 -O2 -fwrapv -pipe -Wformat -Werror=format-security -gdwarf-4 -fno-debug-types-section -fvar-tracking-assignments -g2 -Wp,-D_FORTIFY_SOURCE=2 -fstack-protector-strong --param=ssp-buffer-size=4 -Werror=trampolines -fPIC -march=x86-64 -gdwarf-4 -fno-debug-types-section -fvar-tracking-assignments -g2 -fno-var-tracking -I. -I/usr/include/gc -I/usr/include/gc -o settings.o -c settings.cc In file included from common.h:35, from settings.cc:18: memory.h: In function 'void mem::compact(int)': memory.h:185:29: warning: 'GC_dont_expand' is deprecated [-Wdeprecated-declarations] 185 | inline void compact(int x) {GC_dont_expand=x;} | ^~~~~~~~~~~~~~ In file included from memory.h:50, from common.h:35, from settings.cc:18: /usr/include/gc/gc.h:255:31: note: declared here 255 | GC_API GC_ATTR_DEPRECATED int GC_dont_expand; | ^~~~~~~~~~~~~~ x86_64-pld-linux-g++ -Wall -DHAVE_CONFIG_H -D_FILE_OFFSET_BITS=64 -DUSEGC -pthread -DFFTWPP_SINGLE_THREAD -O2 -fwrapv -pipe -Wformat -Werror=format-security -gdwarf-4 -fno-debug-types-section -fvar-tracking-assignments -g2 -Wp,-D_FORTIFY_SOURCE=2 -fstack-protector-strong --param=ssp-buffer-size=4 -Werror=trampolines -fPIC -march=x86-64 -gdwarf-4 -fno-debug-types-section -fvar-tracking-assignments -g2 -O2 -fwrapv -pipe -Wformat -Werror=format-security -gdwarf-4 -fno-debug-types-section -fvar-tracking-assignments -g2 -Wp,-D_FORTIFY_SOURCE=2 -fstack-protector-strong --param=ssp-buffer-size=4 -Werror=trampolines -fPIC -march=x86-64 -gdwarf-4 -fno-debug-types-section -fvar-tracking-assignments -g2 -fno-var-tracking -I. -I/usr/include/gc -I/usr/include/gc -o runbacktrace.o -c runbacktrace.cc In file included from common.h:35, from errormsg.h:12, from stack.h:13, from runtimebase.in:1: memory.h: In function 'void mem::compact(int)': memory.h:185:29: warning: 'GC_dont_expand' is deprecated [-Wdeprecated-declarations] 185 | inline void compact(int x) {GC_dont_expand=x;} | ^~~~~~~~~~~~~~ In file included from memory.h:50, from common.h:35, from errormsg.h:12, from stack.h:13, from runtimebase.in:1: /usr/include/gc/gc.h:255:31: note: declared here 255 | GC_API GC_ATTR_DEPRECATED int GC_dont_expand; | ^~~~~~~~~~~~~~ x86_64-pld-linux-g++ -Wall -DHAVE_CONFIG_H -D_FILE_OFFSET_BITS=64 -DUSEGC -pthread -DFFTWPP_SINGLE_THREAD -O2 -fwrapv -pipe -Wformat -Werror=format-security -gdwarf-4 -fno-debug-types-section -fvar-tracking-assignments -g2 -Wp,-D_FORTIFY_SOURCE=2 -fstack-protector-strong --param=ssp-buffer-size=4 -Werror=trampolines -fPIC -march=x86-64 -gdwarf-4 -fno-debug-types-section -fvar-tracking-assignments -g2 -O2 -fwrapv -pipe -Wformat -Werror=format-security -gdwarf-4 -fno-debug-types-section -fvar-tracking-assignments -g2 -Wp,-D_FORTIFY_SOURCE=2 -fstack-protector-strong --param=ssp-buffer-size=4 -Werror=trampolines -fPIC -march=x86-64 -gdwarf-4 -fno-debug-types-section -fvar-tracking-assignments -g2 -fno-var-tracking -I. -I/usr/include/gc -I/usr/include/gc -o drawsurface.o -c drawsurface.cc In file included from common.h:35, from drawelement.h:13, from drawsurface.h:10, from drawsurface.cc:7: memory.h: In function 'void mem::compact(int)': memory.h:185:29: warning: 'GC_dont_expand' is deprecated [-Wdeprecated-declarations] 185 | inline void compact(int x) {GC_dont_expand=x;} | ^~~~~~~~~~~~~~ In file included from memory.h:50, from common.h:35, from drawelement.h:13, from drawsurface.h:10, from drawsurface.cc:7: /usr/include/gc/gc.h:255:31: note: declared here 255 | GC_API GC_ATTR_DEPRECATED int GC_dont_expand; | ^~~~~~~~~~~~~~ In file included from bbox3.h:11, from drawelement.h:15, from drawsurface.h:10, from drawsurface.cc:7: triple.h: In member function 'virtual void camp::drawBezierPatch::bounds(const double*, camp::bbox3&)': triple.h:39:7: warning: array subscript 3 is outside array bounds of 'camp::triple [3]' [-Warray-bounds] 39 | class triple : virtual public gc { | ^~~~~~ drawsurface.cc:115:12: note: while referencing 'Vertices' 115 | triple Vertices[3]; | ^~~~~~~~ In file included from bbox3.h:11, from drawelement.h:15, from drawsurface.h:10, from drawsurface.cc:7: triple.h:39:7: warning: array subscript 3 is outside array bounds of 'camp::triple [3]' [-Warray-bounds] 39 | class triple : virtual public gc { | ^~~~~~ drawsurface.cc:115:12: note: while referencing 'Vertices' 115 | triple Vertices[3]; | ^~~~~~~~ In file included from bbox3.h:11, from drawelement.h:15, from drawsurface.h:10, from drawsurface.cc:7: triple.h:39:7: warning: array subscript 3 is outside array bounds of 'camp::triple [3]' [-Warray-bounds] 39 | class triple : virtual public gc { | ^~~~~~ drawsurface.cc:115:12: note: while referencing 'Vertices' 115 | triple Vertices[3]; | ^~~~~~~~ In file included from bbox3.h:11, from drawelement.h:15, from drawsurface.h:10, from drawsurface.cc:7: triple.h:39:7: warning: array subscript 3 is outside array bounds of 'camp::triple [3]' [-Warray-bounds] 39 | class triple : virtual public gc { | ^~~~~~ drawsurface.cc:115:12: note: while referencing 'Vertices' 115 | triple Vertices[3]; | ^~~~~~~~ In file included from bbox3.h:11, from drawelement.h:15, from drawsurface.h:10, from drawsurface.cc:7: triple.h:39:7: warning: array subscript 3 is outside array bounds of 'camp::triple [3]' [-Warray-bounds] 39 | class triple : virtual public gc { | ^~~~~~ drawsurface.cc:115:12: note: while referencing 'Vertices' 115 | triple Vertices[3]; | ^~~~~~~~ In file included from bbox3.h:11, from drawelement.h:15, from drawsurface.h:10, from drawsurface.cc:7: triple.h:39:7: warning: array subscript 3 is outside array bounds of 'camp::triple [3]' [-Warray-bounds] 39 | class triple : virtual public gc { | ^~~~~~ drawsurface.cc:115:12: note: while referencing 'Vertices' 115 | triple Vertices[3]; | ^~~~~~~~ x86_64-pld-linux-g++ -Wall -DHAVE_CONFIG_H -D_FILE_OFFSET_BITS=64 -DUSEGC -pthread -DFFTWPP_SINGLE_THREAD -O2 -fwrapv -pipe -Wformat -Werror=format-security -gdwarf-4 -fno-debug-types-section -fvar-tracking-assignments -g2 -Wp,-D_FORTIFY_SOURCE=2 -fstack-protector-strong --param=ssp-buffer-size=4 -Werror=trampolines -fPIC -march=x86-64 -gdwarf-4 -fno-debug-types-section -fvar-tracking-assignments -g2 -O2 -fwrapv -pipe -Wformat -Werror=format-security -gdwarf-4 -fno-debug-types-section -fvar-tracking-assignments -g2 -Wp,-D_FORTIFY_SOURCE=2 -fstack-protector-strong --param=ssp-buffer-size=4 -Werror=trampolines -fPIC -march=x86-64 -gdwarf-4 -fno-debug-types-section -fvar-tracking-assignments -g2 -fno-var-tracking -I. -I/usr/include/gc -I/usr/include/gc -o picture.o -c picture.cc In file included from common.h:35, from errormsg.h:12, from picture.cc:9: memory.h: In function 'void mem::compact(int)': memory.h:185:29: warning: 'GC_dont_expand' is deprecated [-Wdeprecated-declarations] 185 | inline void compact(int x) {GC_dont_expand=x;} | ^~~~~~~~~~~~~~ In file included from memory.h:50, from common.h:35, from errormsg.h:12, from picture.cc:9: /usr/include/gc/gc.h:255:31: note: declared here 255 | GC_API GC_ATTR_DEPRECATED int GC_dont_expand; | ^~~~~~~~~~~~~~ x86_64-pld-linux-g++ -Wall -DHAVE_CONFIG_H -D_FILE_OFFSET_BITS=64 -DUSEGC -pthread -DFFTWPP_SINGLE_THREAD -O2 -fwrapv -pipe -Wformat -Werror=format-security -gdwarf-4 -fno-debug-types-section -fvar-tracking-assignments -g2 -Wp,-D_FORTIFY_SOURCE=2 -fstack-protector-strong --param=ssp-buffer-size=4 -Werror=trampolines -fPIC -march=x86-64 -gdwarf-4 -fno-debug-types-section -fvar-tracking-assignments -g2 -O2 -fwrapv -pipe -Wformat -Werror=format-security -gdwarf-4 -fno-debug-types-section -fvar-tracking-assignments -g2 -Wp,-D_FORTIFY_SOURCE=2 -fstack-protector-strong --param=ssp-buffer-size=4 -Werror=trampolines -fPIC -march=x86-64 -gdwarf-4 -fno-debug-types-section -fvar-tracking-assignments -g2 -fno-var-tracking -I. -I/usr/include/gc -I/usr/include/gc -o runhistory.o -c runhistory.cc In file included from common.h:35, from errormsg.h:12, from stack.h:13, from runtimebase.in:1: memory.h: In function 'void mem::compact(int)': memory.h:185:29: warning: 'GC_dont_expand' is deprecated [-Wdeprecated-declarations] 185 | inline void compact(int x) {GC_dont_expand=x;} | ^~~~~~~~~~~~~~ In file included from memory.h:50, from common.h:35, from errormsg.h:12, from stack.h:13, from runtimebase.in:1: /usr/include/gc/gc.h:255:31: note: declared here 255 | GC_API GC_ATTR_DEPRECATED int GC_dont_expand; | ^~~~~~~~~~~~~~ x86_64-pld-linux-g++ -Wall -DHAVE_CONFIG_H -D_FILE_OFFSET_BITS=64 -DUSEGC -pthread -DFFTWPP_SINGLE_THREAD -O2 -fwrapv -pipe -Wformat -Werror=format-security -gdwarf-4 -fno-debug-types-section -fvar-tracking-assignments -g2 -Wp,-D_FORTIFY_SOURCE=2 -fstack-protector-strong --param=ssp-buffer-size=4 -Werror=trampolines -fPIC -march=x86-64 -gdwarf-4 -fno-debug-types-section -fvar-tracking-assignments -g2 -O2 -fwrapv -pipe -Wformat -Werror=format-security -gdwarf-4 -fno-debug-types-section -fvar-tracking-assignments -g2 -Wp,-D_FORTIFY_SOURCE=2 -fstack-protector-strong --param=ssp-buffer-size=4 -Werror=trampolines -fPIC -march=x86-64 -gdwarf-4 -fno-debug-types-section -fvar-tracking-assignments -g2 -fno-var-tracking -I. -I/usr/include/gc -I/usr/include/gc -o runsystem.o -c runsystem.cc In file included from common.h:35, from errormsg.h:12, from stack.h:13, from runtimebase.in:1: memory.h: In function 'void mem::compact(int)': memory.h:185:29: warning: 'GC_dont_expand' is deprecated [-Wdeprecated-declarations] 185 | inline void compact(int x) {GC_dont_expand=x;} | ^~~~~~~~~~~~~~ In file included from memory.h:50, from common.h:35, from errormsg.h:12, from stack.h:13, from runtimebase.in:1: /usr/include/gc/gc.h:255:31: note: declared here 255 | GC_API GC_ATTR_DEPRECATED int GC_dont_expand; | ^~~~~~~~~~~~~~ x86_64-pld-linux-g++ -Wall -DHAVE_CONFIG_H -D_FILE_OFFSET_BITS=64 -DUSEGC -pthread -DFFTWPP_SINGLE_THREAD -O2 -fwrapv -pipe -Wformat -Werror=format-security -gdwarf-4 -fno-debug-types-section -fvar-tracking-assignments -g2 -Wp,-D_FORTIFY_SOURCE=2 -fstack-protector-strong --param=ssp-buffer-size=4 -Werror=trampolines -fPIC -march=x86-64 -gdwarf-4 -fno-debug-types-section -fvar-tracking-assignments -g2 -O2 -fwrapv -pipe -Wformat -Werror=format-security -gdwarf-4 -fno-debug-types-section -fvar-tracking-assignments -g2 -Wp,-D_FORTIFY_SOURCE=2 -fstack-protector-strong --param=ssp-buffer-size=4 -Werror=trampolines -fPIC -march=x86-64 -gdwarf-4 -fno-debug-types-section -fvar-tracking-assignments -g2 -fno-var-tracking -I. -I/usr/include/gc -I/usr/include/gc -o runpair.o -c runpair.cc In file included from common.h:35, from errormsg.h:12, from stack.h:13, from runtimebase.in:1: memory.h: In function 'void mem::compact(int)': memory.h:185:29: warning: 'GC_dont_expand' is deprecated [-Wdeprecated-declarations] 185 | inline void compact(int x) {GC_dont_expand=x;} | ^~~~~~~~~~~~~~ In file included from memory.h:50, from common.h:35, from errormsg.h:12, from stack.h:13, from runtimebase.in:1: /usr/include/gc/gc.h:255:31: note: declared here 255 | GC_API GC_ATTR_DEPRECATED int GC_dont_expand; | ^~~~~~~~~~~~~~ x86_64-pld-linux-g++ -Wall -DHAVE_CONFIG_H -D_FILE_OFFSET_BITS=64 -DUSEGC -pthread -DFFTWPP_SINGLE_THREAD -O2 -fwrapv -pipe -Wformat -Werror=format-security -gdwarf-4 -fno-debug-types-section -fvar-tracking-assignments -g2 -Wp,-D_FORTIFY_SOURCE=2 -fstack-protector-strong --param=ssp-buffer-size=4 -Werror=trampolines -fPIC -march=x86-64 -gdwarf-4 -fno-debug-types-section -fvar-tracking-assignments -g2 -O2 -fwrapv -pipe -Wformat -Werror=format-security -gdwarf-4 -fno-debug-types-section -fvar-tracking-assignments -g2 -Wp,-D_FORTIFY_SOURCE=2 -fstack-protector-strong --param=ssp-buffer-size=4 -Werror=trampolines -fPIC -march=x86-64 -gdwarf-4 -fno-debug-types-section -fvar-tracking-assignments -g2 -fno-var-tracking -I. -I/usr/include/gc -I/usr/include/gc -o runfile.o -c runfile.cc In file included from common.h:35, from errormsg.h:12, from stack.h:13, from runtimebase.in:1: memory.h: In function 'void mem::compact(int)': memory.h:185:29: warning: 'GC_dont_expand' is deprecated [-Wdeprecated-declarations] 185 | inline void compact(int x) {GC_dont_expand=x;} | ^~~~~~~~~~~~~~ In file included from memory.h:50, from common.h:35, from errormsg.h:12, from stack.h:13, from runtimebase.in:1: /usr/include/gc/gc.h:255:31: note: declared here 255 | GC_API GC_ATTR_DEPRECATED int GC_dont_expand; | ^~~~~~~~~~~~~~ x86_64-pld-linux-g++ -Wall -DHAVE_CONFIG_H -D_FILE_OFFSET_BITS=64 -DUSEGC -pthread -DFFTWPP_SINGLE_THREAD -O2 -fwrapv -pipe -Wformat -Werror=format-security -gdwarf-4 -fno-debug-types-section -fvar-tracking-assignments -g2 -Wp,-D_FORTIFY_SOURCE=2 -fstack-protector-strong --param=ssp-buffer-size=4 -Werror=trampolines -fPIC -march=x86-64 -gdwarf-4 -fno-debug-types-section -fvar-tracking-assignments -g2 -O2 -fwrapv -pipe -Wformat -Werror=format-security -gdwarf-4 -fno-debug-types-section -fvar-tracking-assignments -g2 -Wp,-D_FORTIFY_SOURCE=2 -fstack-protector-strong --param=ssp-buffer-size=4 -Werror=trampolines -fPIC -march=x86-64 -gdwarf-4 -fno-debug-types-section -fvar-tracking-assignments -g2 -fno-var-tracking -I. -I/usr/include/gc -I/usr/include/gc -o runarray.o -c runarray.cc In file included from common.h:35, from errormsg.h:12, from stack.h:13, from runtimebase.in:1: memory.h: In function 'void mem::compact(int)': memory.h:185:29: warning: 'GC_dont_expand' is deprecated [-Wdeprecated-declarations] 185 | inline void compact(int x) {GC_dont_expand=x;} | ^~~~~~~~~~~~~~ In file included from memory.h:50, from common.h:35, from errormsg.h:12, from stack.h:13, from runtimebase.in:1: /usr/include/gc/gc.h:255:31: note: declared here 255 | GC_API GC_ATTR_DEPRECATED int GC_dont_expand; | ^~~~~~~~~~~~~~ x86_64-pld-linux-g++ -Wall -DHAVE_CONFIG_H -D_FILE_OFFSET_BITS=64 -DUSEGC -pthread -DFFTWPP_SINGLE_THREAD -O2 -fwrapv -pipe -Wformat -Werror=format-security -gdwarf-4 -fno-debug-types-section -fvar-tracking-assignments -g2 -Wp,-D_FORTIFY_SOURCE=2 -fstack-protector-strong --param=ssp-buffer-size=4 -Werror=trampolines -fPIC -march=x86-64 -gdwarf-4 -fno-debug-types-section -fvar-tracking-assignments -g2 -O2 -fwrapv -pipe -Wformat -Werror=format-security -gdwarf-4 -fno-debug-types-section -fvar-tracking-assignments -g2 -Wp,-D_FORTIFY_SOURCE=2 -fstack-protector-strong --param=ssp-buffer-size=4 -Werror=trampolines -fPIC -march=x86-64 -gdwarf-4 -fno-debug-types-section -fvar-tracking-assignments -g2 -fno-var-tracking -I. -I/usr/include/gc -I/usr/include/gc -o gsl.o -c gsl.cc In file included from common.h:35, from errormsg.h:12, from vm.h:11, from gsl.cc:12: memory.h: In function 'void mem::compact(int)': memory.h:185:29: warning: 'GC_dont_expand' is deprecated [-Wdeprecated-declarations] 185 | inline void compact(int x) {GC_dont_expand=x;} | ^~~~~~~~~~~~~~ In file included from memory.h:50, from common.h:35, from errormsg.h:12, from vm.h:11, from gsl.cc:12: /usr/include/gc/gc.h:255:31: note: declared here 255 | GC_API GC_ATTR_DEPRECATED int GC_dont_expand; | ^~~~~~~~~~~~~~ x86_64-pld-linux-g++ -Wall -DHAVE_CONFIG_H -D_FILE_OFFSET_BITS=64 -DUSEGC -pthread -DFFTWPP_SINGLE_THREAD -O2 -fwrapv -pipe -Wformat -Werror=format-security -gdwarf-4 -fno-debug-types-section -fvar-tracking-assignments -g2 -Wp,-D_FORTIFY_SOURCE=2 -fstack-protector-strong --param=ssp-buffer-size=4 -Werror=trampolines -fPIC -march=x86-64 -gdwarf-4 -fno-debug-types-section -fvar-tracking-assignments -g2 -O2 -fwrapv -pipe -Wformat -Werror=format-security -gdwarf-4 -fno-debug-types-section -fvar-tracking-assignments -g2 -Wp,-D_FORTIFY_SOURCE=2 -fstack-protector-strong --param=ssp-buffer-size=4 -Werror=trampolines -fPIC -march=x86-64 -gdwarf-4 -fno-debug-types-section -fvar-tracking-assignments -g2 -fno-var-tracking -I. -I/usr/include/gc -I/usr/include/gc -o runtriple.o -c runtriple.cc In file included from common.h:35, from errormsg.h:12, from stack.h:13, from runtimebase.in:1: memory.h: In function 'void mem::compact(int)': memory.h:185:29: warning: 'GC_dont_expand' is deprecated [-Wdeprecated-declarations] 185 | inline void compact(int x) {GC_dont_expand=x;} | ^~~~~~~~~~~~~~ In file included from memory.h:50, from common.h:35, from errormsg.h:12, from stack.h:13, from runtimebase.in:1: /usr/include/gc/gc.h:255:31: note: declared here 255 | GC_API GC_ATTR_DEPRECATED int GC_dont_expand; | ^~~~~~~~~~~~~~ x86_64-pld-linux-g++ -Wall -DHAVE_CONFIG_H -D_FILE_OFFSET_BITS=64 -DUSEGC -pthread -DFFTWPP_SINGLE_THREAD -O2 -fwrapv -pipe -Wformat -Werror=format-security -gdwarf-4 -fno-debug-types-section -fvar-tracking-assignments -g2 -Wp,-D_FORTIFY_SOURCE=2 -fstack-protector-strong --param=ssp-buffer-size=4 -Werror=trampolines -fPIC -march=x86-64 -gdwarf-4 -fno-debug-types-section -fvar-tracking-assignments -g2 -O2 -fwrapv -pipe -Wformat -Werror=format-security -gdwarf-4 -fno-debug-types-section -fvar-tracking-assignments -g2 -Wp,-D_FORTIFY_SOURCE=2 -fstack-protector-strong --param=ssp-buffer-size=4 -Werror=trampolines -fPIC -march=x86-64 -gdwarf-4 -fno-debug-types-section -fvar-tracking-assignments -g2 -fno-var-tracking -I. -I/usr/include/gc -I/usr/include/gc -o runlabel.o -c runlabel.cc In file included from common.h:35, from errormsg.h:12, from stack.h:13, from runtimebase.in:1: memory.h: In function 'void mem::compact(int)': memory.h:185:29: warning: 'GC_dont_expand' is deprecated [-Wdeprecated-declarations] 185 | inline void compact(int x) {GC_dont_expand=x;} | ^~~~~~~~~~~~~~ In file included from memory.h:50, from common.h:35, from errormsg.h:12, from stack.h:13, from runtimebase.in:1: /usr/include/gc/gc.h:255:31: note: declared here 255 | GC_API GC_ATTR_DEPRECATED int GC_dont_expand; | ^~~~~~~~~~~~~~ x86_64-pld-linux-g++ -Wall -DHAVE_CONFIG_H -D_FILE_OFFSET_BITS=64 -DUSEGC -pthread -DFFTWPP_SINGLE_THREAD -O2 -fwrapv -pipe -Wformat -Werror=format-security -gdwarf-4 -fno-debug-types-section -fvar-tracking-assignments -g2 -Wp,-D_FORTIFY_SOURCE=2 -fstack-protector-strong --param=ssp-buffer-size=4 -Werror=trampolines -fPIC -march=x86-64 -gdwarf-4 -fno-debug-types-section -fvar-tracking-assignments -g2 -O2 -fwrapv -pipe -Wformat -Werror=format-security -gdwarf-4 -fno-debug-types-section -fvar-tracking-assignments -g2 -Wp,-D_FORTIFY_SOURCE=2 -fstack-protector-strong --param=ssp-buffer-size=4 -Werror=trampolines -fPIC -march=x86-64 -gdwarf-4 -fno-debug-types-section -fvar-tracking-assignments -g2 -fno-var-tracking -I. -I/usr/include/gc -I/usr/include/gc -o runtime.o -c runtime.cc In file included from common.h:35, from errormsg.h:12, from stack.h:13, from runtimebase.in:1: memory.h: In function 'void mem::compact(int)': memory.h:185:29: warning: 'GC_dont_expand' is deprecated [-Wdeprecated-declarations] 185 | inline void compact(int x) {GC_dont_expand=x;} | ^~~~~~~~~~~~~~ In file included from memory.h:50, from common.h:35, from errormsg.h:12, from stack.h:13, from runtimebase.in:1: /usr/include/gc/gc.h:255:31: note: declared here 255 | GC_API GC_ATTR_DEPRECATED int GC_dont_expand; | ^~~~~~~~~~~~~~ x86_64-pld-linux-g++ -Wall -DHAVE_CONFIG_H -D_FILE_OFFSET_BITS=64 -DUSEGC -pthread -DFFTWPP_SINGLE_THREAD -O2 -fwrapv -pipe -Wformat -Werror=format-security -gdwarf-4 -fno-debug-types-section -fvar-tracking-assignments -g2 -Wp,-D_FORTIFY_SOURCE=2 -fstack-protector-strong --param=ssp-buffer-size=4 -Werror=trampolines -fPIC -march=x86-64 -gdwarf-4 -fno-debug-types-section -fvar-tracking-assignments -g2 -O2 -fwrapv -pipe -Wformat -Werror=format-security -gdwarf-4 -fno-debug-types-section -fvar-tracking-assignments -g2 -Wp,-D_FORTIFY_SOURCE=2 -fstack-protector-strong --param=ssp-buffer-size=4 -Werror=trampolines -fPIC -march=x86-64 -gdwarf-4 -fno-debug-types-section -fvar-tracking-assignments -g2 -fno-var-tracking -I. -I/usr/include/gc -I/usr/include/gc -o runmath.o -c runmath.cc In file included from common.h:35, from errormsg.h:12, from stack.h:13, from runtimebase.in:1: memory.h: In function 'void mem::compact(int)': memory.h:185:29: warning: 'GC_dont_expand' is deprecated [-Wdeprecated-declarations] 185 | inline void compact(int x) {GC_dont_expand=x;} | ^~~~~~~~~~~~~~ In file included from memory.h:50, from common.h:35, from errormsg.h:12, from stack.h:13, from runtimebase.in:1: /usr/include/gc/gc.h:255:31: note: declared here 255 | GC_API GC_ATTR_DEPRECATED int GC_dont_expand; | ^~~~~~~~~~~~~~ x86_64-pld-linux-g++ -Wall -DHAVE_CONFIG_H -D_FILE_OFFSET_BITS=64 -DUSEGC -pthread -DFFTWPP_SINGLE_THREAD -O2 -fwrapv -pipe -Wformat -Werror=format-security -gdwarf-4 -fno-debug-types-section -fvar-tracking-assignments -g2 -Wp,-D_FORTIFY_SOURCE=2 -fstack-protector-strong --param=ssp-buffer-size=4 -Werror=trampolines -fPIC -march=x86-64 -gdwarf-4 -fno-debug-types-section -fvar-tracking-assignments -g2 -O2 -fwrapv -pipe -Wformat -Werror=format-security -gdwarf-4 -fno-debug-types-section -fvar-tracking-assignments -g2 -Wp,-D_FORTIFY_SOURCE=2 -fstack-protector-strong --param=ssp-buffer-size=4 -Werror=trampolines -fPIC -march=x86-64 -gdwarf-4 -fno-debug-types-section -fvar-tracking-assignments -g2 -fno-var-tracking -I. -I/usr/include/gc -I/usr/include/gc -o env.o -c env.cc In file included from common.h:35, from errormsg.h:12, from env.h:12, from env.cc:9: memory.h: In function 'void mem::compact(int)': memory.h:185:29: warning: 'GC_dont_expand' is deprecated [-Wdeprecated-declarations] 185 | inline void compact(int x) {GC_dont_expand=x;} | ^~~~~~~~~~~~~~ In file included from memory.h:50, from common.h:35, from errormsg.h:12, from env.h:12, from env.cc:9: /usr/include/gc/gc.h:255:31: note: declared here 255 | GC_API GC_ATTR_DEPRECATED int GC_dont_expand; | ^~~~~~~~~~~~~~ x86_64-pld-linux-g++ -Wall -DHAVE_CONFIG_H -D_FILE_OFFSET_BITS=64 -DUSEGC -pthread -DFFTWPP_SINGLE_THREAD -O2 -fwrapv -pipe -Wformat -Werror=format-security -gdwarf-4 -fno-debug-types-section -fvar-tracking-assignments -g2 -Wp,-D_FORTIFY_SOURCE=2 -fstack-protector-strong --param=ssp-buffer-size=4 -Werror=trampolines -fPIC -march=x86-64 -gdwarf-4 -fno-debug-types-section -fvar-tracking-assignments -g2 -O2 -fwrapv -pipe -Wformat -Werror=format-security -gdwarf-4 -fno-debug-types-section -fvar-tracking-assignments -g2 -Wp,-D_FORTIFY_SOURCE=2 -fstack-protector-strong --param=ssp-buffer-size=4 -Werror=trampolines -fPIC -march=x86-64 -gdwarf-4 -fno-debug-types-section -fvar-tracking-assignments -g2 -fno-var-tracking -I. -I/usr/include/gc -I/usr/include/gc -o runstring.o -c runstring.cc In file included from common.h:35, from errormsg.h:12, from stack.h:13, from runtimebase.in:1: memory.h: In function 'void mem::compact(int)': memory.h:185:29: warning: 'GC_dont_expand' is deprecated [-Wdeprecated-declarations] 185 | inline void compact(int x) {GC_dont_expand=x;} | ^~~~~~~~~~~~~~ In file included from memory.h:50, from common.h:35, from errormsg.h:12, from stack.h:13, from runtimebase.in:1: /usr/include/gc/gc.h:255:31: note: declared here 255 | GC_API GC_ATTR_DEPRECATED int GC_dont_expand; | ^~~~~~~~~~~~~~ x86_64-pld-linux-g++ -Wall -DHAVE_CONFIG_H -D_FILE_OFFSET_BITS=64 -DUSEGC -pthread -DFFTWPP_SINGLE_THREAD -O2 -fwrapv -pipe -Wformat -Werror=format-security -gdwarf-4 -fno-debug-types-section -fvar-tracking-assignments -g2 -Wp,-D_FORTIFY_SOURCE=2 -fstack-protector-strong --param=ssp-buffer-size=4 -Werror=trampolines -fPIC -march=x86-64 -gdwarf-4 -fno-debug-types-section -fvar-tracking-assignments -g2 -O2 -fwrapv -pipe -Wformat -Werror=format-security -gdwarf-4 -fno-debug-types-section -fvar-tracking-assignments -g2 -Wp,-D_FORTIFY_SOURCE=2 -fstack-protector-strong --param=ssp-buffer-size=4 -Werror=trampolines -fPIC -march=x86-64 -gdwarf-4 -fno-debug-types-section -fvar-tracking-assignments -g2 -fno-var-tracking -I. -I/usr/include/gc -I/usr/include/gc -o runpath.o -c runpath.cc In file included from common.h:35, from errormsg.h:12, from stack.h:13, from runtimebase.in:1: memory.h: In function 'void mem::compact(int)': memory.h:185:29: warning: 'GC_dont_expand' is deprecated [-Wdeprecated-declarations] 185 | inline void compact(int x) {GC_dont_expand=x;} | ^~~~~~~~~~~~~~ In file included from memory.h:50, from common.h:35, from errormsg.h:12, from stack.h:13, from runtimebase.in:1: /usr/include/gc/gc.h:255:31: note: declared here 255 | GC_API GC_ATTR_DEPRECATED int GC_dont_expand; | ^~~~~~~~~~~~~~ x86_64-pld-linux-g++ -Wall -DHAVE_CONFIG_H -D_FILE_OFFSET_BITS=64 -DUSEGC -pthread -DFFTWPP_SINGLE_THREAD -O2 -fwrapv -pipe -Wformat -Werror=format-security -gdwarf-4 -fno-debug-types-section -fvar-tracking-assignments -g2 -Wp,-D_FORTIFY_SOURCE=2 -fstack-protector-strong --param=ssp-buffer-size=4 -Werror=trampolines -fPIC -march=x86-64 -gdwarf-4 -fno-debug-types-section -fvar-tracking-assignments -g2 -O2 -fwrapv -pipe -Wformat -Werror=format-security -gdwarf-4 -fno-debug-types-section -fvar-tracking-assignments -g2 -Wp,-D_FORTIFY_SOURCE=2 -fstack-protector-strong --param=ssp-buffer-size=4 -Werror=trampolines -fPIC -march=x86-64 -gdwarf-4 -fno-debug-types-section -fvar-tracking-assignments -g2 -fno-var-tracking -I. -I/usr/include/gc -I/usr/include/gc -o genv.o -c genv.cc In file included from common.h:35, from genv.h:19, from genv.cc:20: memory.h: In function 'void mem::compact(int)': memory.h:185:29: warning: 'GC_dont_expand' is deprecated [-Wdeprecated-declarations] 185 | inline void compact(int x) {GC_dont_expand=x;} | ^~~~~~~~~~~~~~ In file included from memory.h:50, from common.h:35, from genv.h:19, from genv.cc:20: /usr/include/gc/gc.h:255:31: note: declared here 255 | GC_API GC_ATTR_DEPRECATED int GC_dont_expand; | ^~~~~~~~~~~~~~ x86_64-pld-linux-g++ -Wall -DHAVE_CONFIG_H -D_FILE_OFFSET_BITS=64 -DUSEGC -pthread -DFFTWPP_SINGLE_THREAD -O2 -fwrapv -pipe -Wformat -Werror=format-security -gdwarf-4 -fno-debug-types-section -fvar-tracking-assignments -g2 -Wp,-D_FORTIFY_SOURCE=2 -fstack-protector-strong --param=ssp-buffer-size=4 -Werror=trampolines -fPIC -march=x86-64 -gdwarf-4 -fno-debug-types-section -fvar-tracking-assignments -g2 -O2 -fwrapv -pipe -Wformat -Werror=format-security -gdwarf-4 -fno-debug-types-section -fvar-tracking-assignments -g2 -Wp,-D_FORTIFY_SOURCE=2 -fstack-protector-strong --param=ssp-buffer-size=4 -Werror=trampolines -fPIC -march=x86-64 -gdwarf-4 -fno-debug-types-section -fvar-tracking-assignments -g2 -fno-var-tracking -I. -I/usr/include/gc -I/usr/include/gc -o errormsg.o -c errormsg.cc In file included from common.h:35, from errormsg.h:12, from errormsg.cc:11: memory.h: In function 'void mem::compact(int)': memory.h:185:29: warning: 'GC_dont_expand' is deprecated [-Wdeprecated-declarations] 185 | inline void compact(int x) {GC_dont_expand=x;} | ^~~~~~~~~~~~~~ In file included from memory.h:50, from common.h:35, from errormsg.h:12, from errormsg.cc:11: /usr/include/gc/gc.h:255:31: note: declared here 255 | GC_API GC_ATTR_DEPRECATED int GC_dont_expand; | ^~~~~~~~~~~~~~ x86_64-pld-linux-g++ -Wall -DHAVE_CONFIG_H -D_FILE_OFFSET_BITS=64 -DUSEGC -pthread -DFFTWPP_SINGLE_THREAD -O2 -fwrapv -pipe -Wformat -Werror=format-security -gdwarf-4 -fno-debug-types-section -fvar-tracking-assignments -g2 -Wp,-D_FORTIFY_SOURCE=2 -fstack-protector-strong --param=ssp-buffer-size=4 -Werror=trampolines -fPIC -march=x86-64 -gdwarf-4 -fno-debug-types-section -fvar-tracking-assignments -g2 -O2 -fwrapv -pipe -Wformat -Werror=format-security -gdwarf-4 -fno-debug-types-section -fvar-tracking-assignments -g2 -Wp,-D_FORTIFY_SOURCE=2 -fstack-protector-strong --param=ssp-buffer-size=4 -Werror=trampolines -fPIC -march=x86-64 -gdwarf-4 -fno-debug-types-section -fvar-tracking-assignments -g2 -fno-var-tracking -I. -I/usr/include/gc -I/usr/include/gc -o runpicture.o -c runpicture.cc In file included from common.h:35, from errormsg.h:12, from stack.h:13, from runtimebase.in:1: memory.h: In function 'void mem::compact(int)': memory.h:185:29: warning: 'GC_dont_expand' is deprecated [-Wdeprecated-declarations] 185 | inline void compact(int x) {GC_dont_expand=x;} | ^~~~~~~~~~~~~~ In file included from memory.h:50, from common.h:35, from errormsg.h:12, from stack.h:13, from runtimebase.in:1: /usr/include/gc/gc.h:255:31: note: declared here 255 | GC_API GC_ATTR_DEPRECATED int GC_dont_expand; | ^~~~~~~~~~~~~~ x86_64-pld-linux-g++ -Wall -DHAVE_CONFIG_H -D_FILE_OFFSET_BITS=64 -DUSEGC -pthread -DFFTWPP_SINGLE_THREAD -O2 -fwrapv -pipe -Wformat -Werror=format-security -gdwarf-4 -fno-debug-types-section -fvar-tracking-assignments -g2 -Wp,-D_FORTIFY_SOURCE=2 -fstack-protector-strong --param=ssp-buffer-size=4 -Werror=trampolines -fPIC -march=x86-64 -gdwarf-4 -fno-debug-types-section -fvar-tracking-assignments -g2 -O2 -fwrapv -pipe -Wformat -Werror=format-security -gdwarf-4 -fno-debug-types-section -fvar-tracking-assignments -g2 -Wp,-D_FORTIFY_SOURCE=2 -fstack-protector-strong --param=ssp-buffer-size=4 -Werror=trampolines -fPIC -march=x86-64 -gdwarf-4 -fno-debug-types-section -fvar-tracking-assignments -g2 -fno-var-tracking -I. -I/usr/include/gc -I/usr/include/gc -o callable.o -c callable.cc In file included from common.h:35, from errormsg.h:12, from stack.h:13, from callable.cc:8: memory.h: In function 'void mem::compact(int)': memory.h:185:29: warning: 'GC_dont_expand' is deprecated [-Wdeprecated-declarations] 185 | inline void compact(int x) {GC_dont_expand=x;} | ^~~~~~~~~~~~~~ In file included from memory.h:50, from common.h:35, from errormsg.h:12, from stack.h:13, from callable.cc:8: /usr/include/gc/gc.h:255:31: note: declared here 255 | GC_API GC_ATTR_DEPRECATED int GC_dont_expand; | ^~~~~~~~~~~~~~ x86_64-pld-linux-g++ -Wall -DHAVE_CONFIG_H -D_FILE_OFFSET_BITS=64 -DUSEGC -pthread -DFFTWPP_SINGLE_THREAD -O2 -fwrapv -pipe -Wformat -Werror=format-security -gdwarf-4 -fno-debug-types-section -fvar-tracking-assignments -g2 -Wp,-D_FORTIFY_SOURCE=2 -fstack-protector-strong --param=ssp-buffer-size=4 -Werror=trampolines -fPIC -march=x86-64 -gdwarf-4 -fno-debug-types-section -fvar-tracking-assignments -g2 -O2 -fwrapv -pipe -Wformat -Werror=format-security -gdwarf-4 -fno-debug-types-section -fvar-tracking-assignments -g2 -Wp,-D_FORTIFY_SOURCE=2 -fstack-protector-strong --param=ssp-buffer-size=4 -Werror=trampolines -fPIC -march=x86-64 -gdwarf-4 -fno-debug-types-section -fvar-tracking-assignments -g2 -fno-var-tracking -I. -I/usr/include/gc -I/usr/include/gc -o stm.o -c stm.cc In file included from common.h:35, from errormsg.h:12, from stm.cc:12: memory.h: In function 'void mem::compact(int)': memory.h:185:29: warning: 'GC_dont_expand' is deprecated [-Wdeprecated-declarations] 185 | inline void compact(int x) {GC_dont_expand=x;} | ^~~~~~~~~~~~~~ In file included from memory.h:50, from common.h:35, from errormsg.h:12, from stm.cc:12: /usr/include/gc/gc.h:255:31: note: declared here 255 | GC_API GC_ATTR_DEPRECATED int GC_dont_expand; | ^~~~~~~~~~~~~~ x86_64-pld-linux-g++ -Wall -DHAVE_CONFIG_H -D_FILE_OFFSET_BITS=64 -DUSEGC -pthread -DFFTWPP_SINGLE_THREAD -O2 -fwrapv -pipe -Wformat -Werror=format-security -gdwarf-4 -fno-debug-types-section -fvar-tracking-assignments -g2 -Wp,-D_FORTIFY_SOURCE=2 -fstack-protector-strong --param=ssp-buffer-size=4 -Werror=trampolines -fPIC -march=x86-64 -gdwarf-4 -fno-debug-types-section -fvar-tracking-assignments -g2 -O2 -fwrapv -pipe -Wformat -Werror=format-security -gdwarf-4 -fno-debug-types-section -fvar-tracking-assignments -g2 -Wp,-D_FORTIFY_SOURCE=2 -fstack-protector-strong --param=ssp-buffer-size=4 -Werror=trampolines -fPIC -march=x86-64 -gdwarf-4 -fno-debug-types-section -fvar-tracking-assignments -g2 -fno-var-tracking -I. -I/usr/include/gc -I/usr/include/gc -o name.o -c name.cc In file included from common.h:35, from absyn.h:12, from name.h:14, from name.cc:11: memory.h: In function 'void mem::compact(int)': memory.h:185:29: warning: 'GC_dont_expand' is deprecated [-Wdeprecated-declarations] 185 | inline void compact(int x) {GC_dont_expand=x;} | ^~~~~~~~~~~~~~ In file included from memory.h:50, from common.h:35, from absyn.h:12, from name.h:14, from name.cc:11: /usr/include/gc/gc.h:255:31: note: declared here 255 | GC_API GC_ATTR_DEPRECATED int GC_dont_expand; | ^~~~~~~~~~~~~~ x86_64-pld-linux-g++ -Wall -DHAVE_CONFIG_H -D_FILE_OFFSET_BITS=64 -DUSEGC -pthread -DFFTWPP_SINGLE_THREAD -O2 -fwrapv -pipe -Wformat -Werror=format-security -gdwarf-4 -fno-debug-types-section -fvar-tracking-assignments -g2 -Wp,-D_FORTIFY_SOURCE=2 -fstack-protector-strong --param=ssp-buffer-size=4 -Werror=trampolines -fPIC -march=x86-64 -gdwarf-4 -fno-debug-types-section -fvar-tracking-assignments -g2 -O2 -fwrapv -pipe -Wformat -Werror=format-security -gdwarf-4 -fno-debug-types-section -fvar-tracking-assignments -g2 -Wp,-D_FORTIFY_SOURCE=2 -fstack-protector-strong --param=ssp-buffer-size=4 -Werror=trampolines -fPIC -march=x86-64 -gdwarf-4 -fno-debug-types-section -fvar-tracking-assignments -g2 -fno-var-tracking -I. -I/usr/include/gc -I/usr/include/gc -o runpath3d.o -c runpath3d.cc In file included from common.h:35, from errormsg.h:12, from stack.h:13, from runtimebase.in:1: memory.h: In function 'void mem::compact(int)': memory.h:185:29: warning: 'GC_dont_expand' is deprecated [-Wdeprecated-declarations] 185 | inline void compact(int x) {GC_dont_expand=x;} | ^~~~~~~~~~~~~~ In file included from memory.h:50, from common.h:35, from errormsg.h:12, from stack.h:13, from runtimebase.in:1: /usr/include/gc/gc.h:255:31: note: declared here 255 | GC_API GC_ATTR_DEPRECATED int GC_dont_expand; | ^~~~~~~~~~~~~~ x86_64-pld-linux-g++ -Wall -DHAVE_CONFIG_H -D_FILE_OFFSET_BITS=64 -DUSEGC -pthread -DFFTWPP_SINGLE_THREAD -O2 -fwrapv -pipe -Wformat -Werror=format-security -gdwarf-4 -fno-debug-types-section -fvar-tracking-assignments -g2 -Wp,-D_FORTIFY_SOURCE=2 -fstack-protector-strong --param=ssp-buffer-size=4 -Werror=trampolines -fPIC -march=x86-64 -gdwarf-4 -fno-debug-types-section -fvar-tracking-assignments -g2 -O2 -fwrapv -pipe -Wformat -Werror=format-security -gdwarf-4 -fno-debug-types-section -fvar-tracking-assignments -g2 -Wp,-D_FORTIFY_SOURCE=2 -fstack-protector-strong --param=ssp-buffer-size=4 -Werror=trampolines -fPIC -march=x86-64 -gdwarf-4 -fno-debug-types-section -fvar-tracking-assignments -g2 -fno-var-tracking -I. -I/usr/include/gc -I/usr/include/gc -o dec.o -c dec.cc In file included from common.h:35, from errormsg.h:12, from dec.cc:10: memory.h: In function 'void mem::compact(int)': memory.h:185:29: warning: 'GC_dont_expand' is deprecated [-Wdeprecated-declarations] 185 | inline void compact(int x) {GC_dont_expand=x;} | ^~~~~~~~~~~~~~ In file included from memory.h:50, from common.h:35, from errormsg.h:12, from dec.cc:10: /usr/include/gc/gc.h:255:31: note: declared here 255 | GC_API GC_ATTR_DEPRECATED int GC_dont_expand; | ^~~~~~~~~~~~~~ x86_64-pld-linux-g++ -Wall -DHAVE_CONFIG_H -D_FILE_OFFSET_BITS=64 -DUSEGC -pthread -DFFTWPP_SINGLE_THREAD -O2 -fwrapv -pipe -Wformat -Werror=format-security -gdwarf-4 -fno-debug-types-section -fvar-tracking-assignments -g2 -Wp,-D_FORTIFY_SOURCE=2 -fstack-protector-strong --param=ssp-buffer-size=4 -Werror=trampolines -fPIC -march=x86-64 -gdwarf-4 -fno-debug-types-section -fvar-tracking-assignments -g2 -O2 -fwrapv -pipe -Wformat -Werror=format-security -gdwarf-4 -fno-debug-types-section -fvar-tracking-assignments -g2 -Wp,-D_FORTIFY_SOURCE=2 -fstack-protector-strong --param=ssp-buffer-size=4 -Werror=trampolines -fPIC -march=x86-64 -gdwarf-4 -fno-debug-types-section -fvar-tracking-assignments -g2 -fno-var-tracking -I. -I/usr/include/gc -I/usr/include/gc -o entry.o -c entry.cc In file included from common.h:35, from entry.h:15, from entry.cc:15: memory.h: In function 'void mem::compact(int)': memory.h:185:29: warning: 'GC_dont_expand' is deprecated [-Wdeprecated-declarations] 185 | inline void compact(int x) {GC_dont_expand=x;} | ^~~~~~~~~~~~~~ In file included from memory.h:50, from common.h:35, from entry.h:15, from entry.cc:15: /usr/include/gc/gc.h:255:31: note: declared here 255 | GC_API GC_ATTR_DEPRECATED int GC_dont_expand; | ^~~~~~~~~~~~~~ x86_64-pld-linux-g++ -Wall -DHAVE_CONFIG_H -D_FILE_OFFSET_BITS=64 -DUSEGC -pthread -DFFTWPP_SINGLE_THREAD -O2 -fwrapv -pipe -Wformat -Werror=format-security -gdwarf-4 -fno-debug-types-section -fvar-tracking-assignments -g2 -Wp,-D_FORTIFY_SOURCE=2 -fstack-protector-strong --param=ssp-buffer-size=4 -Werror=trampolines -fPIC -march=x86-64 -gdwarf-4 -fno-debug-types-section -fvar-tracking-assignments -g2 -O2 -fwrapv -pipe -Wformat -Werror=format-security -gdwarf-4 -fno-debug-types-section -fvar-tracking-assignments -g2 -Wp,-D_FORTIFY_SOURCE=2 -fstack-protector-strong --param=ssp-buffer-size=4 -Werror=trampolines -fPIC -march=x86-64 -gdwarf-4 -fno-debug-types-section -fvar-tracking-assignments -g2 -fno-var-tracking -I. -I/usr/include/gc -I/usr/include/gc -o newexp.o -c newexp.cc In file included from common.h:35, from errormsg.h:12, from types.h:17, from exp.h:13, from newexp.h:12, from newexp.cc:9: memory.h: In function 'void mem::compact(int)': memory.h:185:29: warning: 'GC_dont_expand' is deprecated [-Wdeprecated-declarations] 185 | inline void compact(int x) {GC_dont_expand=x;} | ^~~~~~~~~~~~~~ In file included from memory.h:50, from common.h:35, from errormsg.h:12, from types.h:17, from exp.h:13, from newexp.h:12, from newexp.cc:9: /usr/include/gc/gc.h:255:31: note: declared here 255 | GC_API GC_ATTR_DEPRECATED int GC_dont_expand; | ^~~~~~~~~~~~~~ x86_64-pld-linux-g++ -Wall -DHAVE_CONFIG_H -D_FILE_OFFSET_BITS=64 -DUSEGC -pthread -DFFTWPP_SINGLE_THREAD -O2 -fwrapv -pipe -Wformat -Werror=format-security -gdwarf-4 -fno-debug-types-section -fvar-tracking-assignments -g2 -Wp,-D_FORTIFY_SOURCE=2 -fstack-protector-strong --param=ssp-buffer-size=4 -Werror=trampolines -fPIC -march=x86-64 -gdwarf-4 -fno-debug-types-section -fvar-tracking-assignments -g2 -O2 -fwrapv -pipe -Wformat -Werror=format-security -gdwarf-4 -fno-debug-types-section -fvar-tracking-assignments -g2 -Wp,-D_FORTIFY_SOURCE=2 -fstack-protector-strong --param=ssp-buffer-size=4 -Werror=trampolines -fPIC -march=x86-64 -gdwarf-4 -fno-debug-types-section -fvar-tracking-assignments -g2 -fno-var-tracking -I. -I/usr/include/gc -I/usr/include/gc -o stack.o -c stack.cc In file included from common.h:35, from errormsg.h:12, from stack.h:13, from stack.cc:11: memory.h: In function 'void mem::compact(int)': memory.h:185:29: warning: 'GC_dont_expand' is deprecated [-Wdeprecated-declarations] 185 | inline void compact(int x) {GC_dont_expand=x;} | ^~~~~~~~~~~~~~ In file included from memory.h:50, from common.h:35, from errormsg.h:12, from stack.h:13, from stack.cc:11: /usr/include/gc/gc.h:255:31: note: declared here 255 | GC_API GC_ATTR_DEPRECATED int GC_dont_expand; | ^~~~~~~~~~~~~~ x86_64-pld-linux-g++ -Wall -DHAVE_CONFIG_H -D_FILE_OFFSET_BITS=64 -DUSEGC -pthread -DFFTWPP_SINGLE_THREAD -O2 -fwrapv -pipe -Wformat -Werror=format-security -gdwarf-4 -fno-debug-types-section -fvar-tracking-assignments -g2 -Wp,-D_FORTIFY_SOURCE=2 -fstack-protector-strong --param=ssp-buffer-size=4 -Werror=trampolines -fPIC -march=x86-64 -gdwarf-4 -fno-debug-types-section -fvar-tracking-assignments -g2 -O2 -fwrapv -pipe -Wformat -Werror=format-security -gdwarf-4 -fno-debug-types-section -fvar-tracking-assignments -g2 -Wp,-D_FORTIFY_SOURCE=2 -fstack-protector-strong --param=ssp-buffer-size=4 -Werror=trampolines -fPIC -march=x86-64 -gdwarf-4 -fno-debug-types-section -fvar-tracking-assignments -g2 -fno-var-tracking -I. -I/usr/include/gc -I/usr/include/gc -o virtualfieldaccess.o -c virtualfieldaccess.cc In file included from common.h:35, from errormsg.h:12, from access.h:15, from virtualfieldaccess.h:8, from virtualfieldaccess.cc:8: memory.h: In function 'void mem::compact(int)': memory.h:185:29: warning: 'GC_dont_expand' is deprecated [-Wdeprecated-declarations] 185 | inline void compact(int x) {GC_dont_expand=x;} | ^~~~~~~~~~~~~~ In file included from memory.h:50, from common.h:35, from errormsg.h:12, from access.h:15, from virtualfieldaccess.h:8, from virtualfieldaccess.cc:8: /usr/include/gc/gc.h:255:31: note: declared here 255 | GC_API GC_ATTR_DEPRECATED int GC_dont_expand; | ^~~~~~~~~~~~~~ x86_64-pld-linux-g++ -Wall -DHAVE_CONFIG_H -D_FILE_OFFSET_BITS=64 -DUSEGC -pthread -DFFTWPP_SINGLE_THREAD -O2 -fwrapv -pipe -Wformat -Werror=format-security -gdwarf-4 -fno-debug-types-section -fvar-tracking-assignments -g2 -Wp,-D_FORTIFY_SOURCE=2 -fstack-protector-strong --param=ssp-buffer-size=4 -Werror=trampolines -fPIC -march=x86-64 -gdwarf-4 -fno-debug-types-section -fvar-tracking-assignments -g2 -O2 -fwrapv -pipe -Wformat -Werror=format-security -gdwarf-4 -fno-debug-types-section -fvar-tracking-assignments -g2 -Wp,-D_FORTIFY_SOURCE=2 -fstack-protector-strong --param=ssp-buffer-size=4 -Werror=trampolines -fPIC -march=x86-64 -gdwarf-4 -fno-debug-types-section -fvar-tracking-assignments -g2 -fno-var-tracking -I. -I/usr/include/gc -I/usr/include/gc -o absyn.o -c absyn.cc In file included from common.h:35, from absyn.h:12, from absyn.cc:8: memory.h: In function 'void mem::compact(int)': memory.h:185:29: warning: 'GC_dont_expand' is deprecated [-Wdeprecated-declarations] 185 | inline void compact(int x) {GC_dont_expand=x;} | ^~~~~~~~~~~~~~ In file included from memory.h:50, from common.h:35, from absyn.h:12, from absyn.cc:8: /usr/include/gc/gc.h:255:31: note: declared here 255 | GC_API GC_ATTR_DEPRECATED int GC_dont_expand; | ^~~~~~~~~~~~~~ x86_64-pld-linux-g++ -Wall -DHAVE_CONFIG_H -D_FILE_OFFSET_BITS=64 -DUSEGC -pthread -DFFTWPP_SINGLE_THREAD -O2 -fwrapv -pipe -Wformat -Werror=format-security -gdwarf-4 -fno-debug-types-section -fvar-tracking-assignments -g2 -Wp,-D_FORTIFY_SOURCE=2 -fstack-protector-strong --param=ssp-buffer-size=4 -Werror=trampolines -fPIC -march=x86-64 -gdwarf-4 -fno-debug-types-section -fvar-tracking-assignments -g2 -O2 -fwrapv -pipe -Wformat -Werror=format-security -gdwarf-4 -fno-debug-types-section -fvar-tracking-assignments -g2 -Wp,-D_FORTIFY_SOURCE=2 -fstack-protector-strong --param=ssp-buffer-size=4 -Werror=trampolines -fPIC -march=x86-64 -gdwarf-4 -fno-debug-types-section -fvar-tracking-assignments -g2 -fno-var-tracking -I. -I/usr/include/gc -I/usr/include/gc -o lex.yy.o -c lex.yy.cc In file included from common.h:35, from util.h:23, from camp.l:14: memory.h: In function 'void mem::compact(int)': memory.h:185:29: warning: 'GC_dont_expand' is deprecated [-Wdeprecated-declarations] 185 | inline void compact(int x) {GC_dont_expand=x;} | ^~~~~~~~~~~~~~ In file included from memory.h:50, from common.h:35, from util.h:23, from camp.l:14: /usr/include/gc/gc.h:255:31: note: declared here 255 | GC_API GC_ATTR_DEPRECATED int GC_dont_expand; | ^~~~~~~~~~~~~~ x86_64-pld-linux-g++ -Wall -DHAVE_CONFIG_H -D_FILE_OFFSET_BITS=64 -DUSEGC -pthread -DFFTWPP_SINGLE_THREAD -O2 -fwrapv -pipe -Wformat -Werror=format-security -gdwarf-4 -fno-debug-types-section -fvar-tracking-assignments -g2 -Wp,-D_FORTIFY_SOURCE=2 -fstack-protector-strong --param=ssp-buffer-size=4 -Werror=trampolines -fPIC -march=x86-64 -gdwarf-4 -fno-debug-types-section -fvar-tracking-assignments -g2 -O2 -fwrapv -pipe -Wformat -Werror=format-security -gdwarf-4 -fno-debug-types-section -fvar-tracking-assignments -g2 -Wp,-D_FORTIFY_SOURCE=2 -fstack-protector-strong --param=ssp-buffer-size=4 -Werror=trampolines -fPIC -march=x86-64 -gdwarf-4 -fno-debug-types-section -fvar-tracking-assignments -g2 -fno-var-tracking -I. -I/usr/include/gc -I/usr/include/gc -o builtin.o -c builtin.cc In file included from common.h:35, from errormsg.h:12, from vm.h:11, from builtin.h:10, from builtin.cc:10: memory.h: In function 'void mem::compact(int)': memory.h:185:29: warning: 'GC_dont_expand' is deprecated [-Wdeprecated-declarations] 185 | inline void compact(int x) {GC_dont_expand=x;} | ^~~~~~~~~~~~~~ In file included from memory.h:50, from common.h:35, from errormsg.h:12, from vm.h:11, from builtin.h:10, from builtin.cc:10: /usr/include/gc/gc.h:255:31: note: declared here 255 | GC_API GC_ATTR_DEPRECATED int GC_dont_expand; | ^~~~~~~~~~~~~~ x86_64-pld-linux-g++ -Wall -DHAVE_CONFIG_H -D_FILE_OFFSET_BITS=64 -DUSEGC -pthread -DFFTWPP_SINGLE_THREAD -O2 -fwrapv -pipe -Wformat -Werror=format-security -gdwarf-4 -fno-debug-types-section -fvar-tracking-assignments -g2 -Wp,-D_FORTIFY_SOURCE=2 -fstack-protector-strong --param=ssp-buffer-size=4 -Werror=trampolines -fPIC -march=x86-64 -gdwarf-4 -fno-debug-types-section -fvar-tracking-assignments -g2 -O2 -fwrapv -pipe -Wformat -Werror=format-security -gdwarf-4 -fno-debug-types-section -fvar-tracking-assignments -g2 -Wp,-D_FORTIFY_SOURCE=2 -fstack-protector-strong --param=ssp-buffer-size=4 -Werror=trampolines -fPIC -march=x86-64 -gdwarf-4 -fno-debug-types-section -fvar-tracking-assignments -g2 -fno-var-tracking -I. -I/usr/include/gc -I/usr/include/gc -o access.o -c access.cc In file included from common.h:35, from errormsg.h:12, from access.h:15, from access.cc:9: memory.h: In function 'void mem::compact(int)': memory.h:185:29: warning: 'GC_dont_expand' is deprecated [-Wdeprecated-declarations] 185 | inline void compact(int x) {GC_dont_expand=x;} | ^~~~~~~~~~~~~~ In file included from memory.h:50, from common.h:35, from errormsg.h:12, from access.h:15, from access.cc:9: /usr/include/gc/gc.h:255:31: note: declared here 255 | GC_API GC_ATTR_DEPRECATED int GC_dont_expand; | ^~~~~~~~~~~~~~ x86_64-pld-linux-g++ -Wall -DHAVE_CONFIG_H -D_FILE_OFFSET_BITS=64 -DUSEGC -pthread -DFFTWPP_SINGLE_THREAD -O2 -fwrapv -pipe -Wformat -Werror=format-security -gdwarf-4 -fno-debug-types-section -fvar-tracking-assignments -g2 -Wp,-D_FORTIFY_SOURCE=2 -fstack-protector-strong --param=ssp-buffer-size=4 -Werror=trampolines -fPIC -march=x86-64 -gdwarf-4 -fno-debug-types-section -fvar-tracking-assignments -g2 -O2 -fwrapv -pipe -Wformat -Werror=format-security -gdwarf-4 -fno-debug-types-section -fvar-tracking-assignments -g2 -Wp,-D_FORTIFY_SOURCE=2 -fstack-protector-strong --param=ssp-buffer-size=4 -Werror=trampolines -fPIC -march=x86-64 -gdwarf-4 -fno-debug-types-section -fvar-tracking-assignments -g2 -fno-var-tracking -I. -I/usr/include/gc -I/usr/include/gc -o simpson.o -c simpson.cc x86_64-pld-linux-g++ -Wall -DHAVE_CONFIG_H -D_FILE_OFFSET_BITS=64 -DUSEGC -pthread -DFFTWPP_SINGLE_THREAD -O2 -fwrapv -pipe -Wformat -Werror=format-security -gdwarf-4 -fno-debug-types-section -fvar-tracking-assignments -g2 -Wp,-D_FORTIFY_SOURCE=2 -fstack-protector-strong --param=ssp-buffer-size=4 -Werror=trampolines -fPIC -march=x86-64 -gdwarf-4 -fno-debug-types-section -fvar-tracking-assignments -g2 -O2 -fwrapv -pipe -Wformat -Werror=format-security -gdwarf-4 -fno-debug-types-section -fvar-tracking-assignments -g2 -Wp,-D_FORTIFY_SOURCE=2 -fstack-protector-strong --param=ssp-buffer-size=4 -Werror=trampolines -fPIC -march=x86-64 -gdwarf-4 -fno-debug-types-section -fvar-tracking-assignments -g2 -fno-var-tracking -I. -I/usr/include/gc -I/usr/include/gc -o exp.o -c exp.cc In file included from common.h:35, from errormsg.h:12, from types.h:17, from exp.h:13, from exp.cc:10: memory.h: In function 'void mem::compact(int)': memory.h:185:29: warning: 'GC_dont_expand' is deprecated [-Wdeprecated-declarations] 185 | inline void compact(int x) {GC_dont_expand=x;} | ^~~~~~~~~~~~~~ In file included from memory.h:50, from common.h:35, from errormsg.h:12, from types.h:17, from exp.h:13, from exp.cc:10: /usr/include/gc/gc.h:255:31: note: declared here 255 | GC_API GC_ATTR_DEPRECATED int GC_dont_expand; | ^~~~~~~~~~~~~~ x86_64-pld-linux-g++ -Wall -DHAVE_CONFIG_H -D_FILE_OFFSET_BITS=64 -DUSEGC -pthread -DFFTWPP_SINGLE_THREAD -O2 -fwrapv -pipe -Wformat -Werror=format-security -gdwarf-4 -fno-debug-types-section -fvar-tracking-assignments -g2 -Wp,-D_FORTIFY_SOURCE=2 -fstack-protector-strong --param=ssp-buffer-size=4 -Werror=trampolines -fPIC -march=x86-64 -gdwarf-4 -fno-debug-types-section -fvar-tracking-assignments -g2 -O2 -fwrapv -pipe -Wformat -Werror=format-security -gdwarf-4 -fno-debug-types-section -fvar-tracking-assignments -g2 -Wp,-D_FORTIFY_SOURCE=2 -fstack-protector-strong --param=ssp-buffer-size=4 -Werror=trampolines -fPIC -march=x86-64 -gdwarf-4 -fno-debug-types-section -fvar-tracking-assignments -g2 -fno-var-tracking -I. -I/usr/include/gc -I/usr/include/gc -o fftw++asy.o -c fftw++asy.cc x86_64-pld-linux-g++ -Wall -DHAVE_CONFIG_H -D_FILE_OFFSET_BITS=64 -DUSEGC -pthread -DFFTWPP_SINGLE_THREAD -O2 -fwrapv -pipe -Wformat -Werror=format-security -gdwarf-4 -fno-debug-types-section -fvar-tracking-assignments -g2 -Wp,-D_FORTIFY_SOURCE=2 -fstack-protector-strong --param=ssp-buffer-size=4 -Werror=trampolines -fPIC -march=x86-64 -gdwarf-4 -fno-debug-types-section -fvar-tracking-assignments -g2 -O2 -fwrapv -pipe -Wformat -Werror=format-security -gdwarf-4 -fno-debug-types-section -fvar-tracking-assignments -g2 -Wp,-D_FORTIFY_SOURCE=2 -fstack-protector-strong --param=ssp-buffer-size=4 -Werror=trampolines -fPIC -march=x86-64 -gdwarf-4 -fno-debug-types-section -fvar-tracking-assignments -g2 -fno-var-tracking -I. -I/usr/include/gc -I/usr/include/gc -o record.o -c record.cc In file included from common.h:35, from errormsg.h:12, from types.h:17, from record.h:11, from record.cc:8: memory.h: In function 'void mem::compact(int)': memory.h:185:29: warning: 'GC_dont_expand' is deprecated [-Wdeprecated-declarations] 185 | inline void compact(int x) {GC_dont_expand=x;} | ^~~~~~~~~~~~~~ In file included from memory.h:50, from common.h:35, from errormsg.h:12, from types.h:17, from record.h:11, from record.cc:8: /usr/include/gc/gc.h:255:31: note: declared here 255 | GC_API GC_ATTR_DEPRECATED int GC_dont_expand; | ^~~~~~~~~~~~~~ x86_64-pld-linux-g++ -Wall -DHAVE_CONFIG_H -D_FILE_OFFSET_BITS=64 -DUSEGC -pthread -DFFTWPP_SINGLE_THREAD -O2 -fwrapv -pipe -Wformat -Werror=format-security -gdwarf-4 -fno-debug-types-section -fvar-tracking-assignments -g2 -Wp,-D_FORTIFY_SOURCE=2 -fstack-protector-strong --param=ssp-buffer-size=4 -Werror=trampolines -fPIC -march=x86-64 -gdwarf-4 -fno-debug-types-section -fvar-tracking-assignments -g2 -O2 -fwrapv -pipe -Wformat -Werror=format-security -gdwarf-4 -fno-debug-types-section -fvar-tracking-assignments -g2 -Wp,-D_FORTIFY_SOURCE=2 -fstack-protector-strong --param=ssp-buffer-size=4 -Werror=trampolines -fPIC -march=x86-64 -gdwarf-4 -fno-debug-types-section -fvar-tracking-assignments -g2 -fno-var-tracking -I. -I/usr/include/gc -I/usr/include/gc -o interact.o -c interact.cc In file included from common.h:35, from interact.h:10, from interact.cc:18: memory.h: In function 'void mem::compact(int)': memory.h:185:29: warning: 'GC_dont_expand' is deprecated [-Wdeprecated-declarations] 185 | inline void compact(int x) {GC_dont_expand=x;} | ^~~~~~~~~~~~~~ In file included from memory.h:50, from common.h:35, from interact.h:10, from interact.cc:18: /usr/include/gc/gc.h:255:31: note: declared here 255 | GC_API GC_ATTR_DEPRECATED int GC_dont_expand; | ^~~~~~~~~~~~~~ x86_64-pld-linux-g++ -Wall -DHAVE_CONFIG_H -D_FILE_OFFSET_BITS=64 -DUSEGC -pthread -DFFTWPP_SINGLE_THREAD -O2 -fwrapv -pipe -Wformat -Werror=format-security -gdwarf-4 -fno-debug-types-section -fvar-tracking-assignments -g2 -Wp,-D_FORTIFY_SOURCE=2 -fstack-protector-strong --param=ssp-buffer-size=4 -Werror=trampolines -fPIC -march=x86-64 -gdwarf-4 -fno-debug-types-section -fvar-tracking-assignments -g2 -O2 -fwrapv -pipe -Wformat -Werror=format-security -gdwarf-4 -fno-debug-types-section -fvar-tracking-assignments -g2 -Wp,-D_FORTIFY_SOURCE=2 -fstack-protector-strong --param=ssp-buffer-size=4 -Werror=trampolines -fPIC -march=x86-64 -gdwarf-4 -fno-debug-types-section -fvar-tracking-assignments -g2 -fno-var-tracking -I. -I/usr/include/gc -I/usr/include/gc -o coenv.o -c coenv.cc In file included from common.h:35, from errormsg.h:12, from env.h:12, from coenv.h:13, from coenv.cc:10: memory.h: In function 'void mem::compact(int)': memory.h:185:29: warning: 'GC_dont_expand' is deprecated [-Wdeprecated-declarations] 185 | inline void compact(int x) {GC_dont_expand=x;} | ^~~~~~~~~~~~~~ In file included from memory.h:50, from common.h:35, from errormsg.h:12, from env.h:12, from coenv.h:13, from coenv.cc:10: /usr/include/gc/gc.h:255:31: note: declared here 255 | GC_API GC_ATTR_DEPRECATED int GC_dont_expand; | ^~~~~~~~~~~~~~ x86_64-pld-linux-g++ -Wall -DHAVE_CONFIG_H -D_FILE_OFFSET_BITS=64 -DUSEGC -pthread -DFFTWPP_SINGLE_THREAD -O2 -fwrapv -pipe -Wformat -Werror=format-security -gdwarf-4 -fno-debug-types-section -fvar-tracking-assignments -g2 -Wp,-D_FORTIFY_SOURCE=2 -fstack-protector-strong --param=ssp-buffer-size=4 -Werror=trampolines -fPIC -march=x86-64 -gdwarf-4 -fno-debug-types-section -fvar-tracking-assignments -g2 -O2 -fwrapv -pipe -Wformat -Werror=format-security -gdwarf-4 -fno-debug-types-section -fvar-tracking-assignments -g2 -Wp,-D_FORTIFY_SOURCE=2 -fstack-protector-strong --param=ssp-buffer-size=4 -Werror=trampolines -fPIC -march=x86-64 -gdwarf-4 -fno-debug-types-section -fvar-tracking-assignments -g2 -fno-var-tracking -I. -I/usr/include/gc -I/usr/include/gc -o parser.o -c parser.cc In file included from common.h:35, from parser.cc:10: memory.h: In function 'void mem::compact(int)': memory.h:185:29: warning: 'GC_dont_expand' is deprecated [-Wdeprecated-declarations] 185 | inline void compact(int x) {GC_dont_expand=x;} | ^~~~~~~~~~~~~~ In file included from memory.h:50, from common.h:35, from parser.cc:10: /usr/include/gc/gc.h:255:31: note: declared here 255 | GC_API GC_ATTR_DEPRECATED int GC_dont_expand; | ^~~~~~~~~~~~~~ x86_64-pld-linux-g++ -Wall -DHAVE_CONFIG_H -D_FILE_OFFSET_BITS=64 -DUSEGC -pthread -DFFTWPP_SINGLE_THREAD -O2 -fwrapv -pipe -Wformat -Werror=format-security -gdwarf-4 -fno-debug-types-section -fvar-tracking-assignments -g2 -Wp,-D_FORTIFY_SOURCE=2 -fstack-protector-strong --param=ssp-buffer-size=4 -Werror=trampolines -fPIC -march=x86-64 -gdwarf-4 -fno-debug-types-section -fvar-tracking-assignments -g2 -O2 -fwrapv -pipe -Wformat -Werror=format-security -gdwarf-4 -fno-debug-types-section -fvar-tracking-assignments -g2 -Wp,-D_FORTIFY_SOURCE=2 -fstack-protector-strong --param=ssp-buffer-size=4 -Werror=trampolines -fPIC -march=x86-64 -gdwarf-4 -fno-debug-types-section -fvar-tracking-assignments -g2 -fno-var-tracking -I. -I/usr/include/gc -I/usr/include/gc -o locate.o -c locate.cc In file included from common.h:35, from settings.h:14, from locate.cc:10: memory.h: In function 'void mem::compact(int)': memory.h:185:29: warning: 'GC_dont_expand' is deprecated [-Wdeprecated-declarations] 185 | inline void compact(int x) {GC_dont_expand=x;} | ^~~~~~~~~~~~~~ In file included from memory.h:50, from common.h:35, from settings.h:14, from locate.cc:10: /usr/include/gc/gc.h:255:31: note: declared here 255 | GC_API GC_ATTR_DEPRECATED int GC_dont_expand; | ^~~~~~~~~~~~~~ x86_64-pld-linux-g++ -Wall -DHAVE_CONFIG_H -D_FILE_OFFSET_BITS=64 -DUSEGC -pthread -DFFTWPP_SINGLE_THREAD -O2 -fwrapv -pipe -Wformat -Werror=format-security -gdwarf-4 -fno-debug-types-section -fvar-tracking-assignments -g2 -Wp,-D_FORTIFY_SOURCE=2 -fstack-protector-strong --param=ssp-buffer-size=4 -Werror=trampolines -fPIC -march=x86-64 -gdwarf-4 -fno-debug-types-section -fvar-tracking-assignments -g2 -O2 -fwrapv -pipe -Wformat -Werror=format-security -gdwarf-4 -fno-debug-types-section -fvar-tracking-assignments -g2 -Wp,-D_FORTIFY_SOURCE=2 -fstack-protector-strong --param=ssp-buffer-size=4 -Werror=trampolines -fPIC -march=x86-64 -gdwarf-4 -fno-debug-types-section -fvar-tracking-assignments -g2 -fno-var-tracking -I. -I/usr/include/gc -I/usr/include/gc -o program.o -c program.cc In file included from common.h:35, from util.h:23, from program.cc:9: memory.h: In function 'void mem::compact(int)': memory.h:185:29: warning: 'GC_dont_expand' is deprecated [-Wdeprecated-declarations] 185 | inline void compact(int x) {GC_dont_expand=x;} | ^~~~~~~~~~~~~~ In file included from memory.h:50, from common.h:35, from util.h:23, from program.cc:9: /usr/include/gc/gc.h:255:31: note: declared here 255 | GC_API GC_ATTR_DEPRECATED int GC_dont_expand; | ^~~~~~~~~~~~~~ x86_64-pld-linux-g++ -Wall -DHAVE_CONFIG_H -D_FILE_OFFSET_BITS=64 -DUSEGC -pthread -DFFTWPP_SINGLE_THREAD -O2 -fwrapv -pipe -Wformat -Werror=format-security -gdwarf-4 -fno-debug-types-section -fvar-tracking-assignments -g2 -Wp,-D_FORTIFY_SOURCE=2 -fstack-protector-strong --param=ssp-buffer-size=4 -Werror=trampolines -fPIC -march=x86-64 -gdwarf-4 -fno-debug-types-section -fvar-tracking-assignments -g2 -O2 -fwrapv -pipe -Wformat -Werror=format-security -gdwarf-4 -fno-debug-types-section -fvar-tracking-assignments -g2 -Wp,-D_FORTIFY_SOURCE=2 -fstack-protector-strong --param=ssp-buffer-size=4 -Werror=trampolines -fPIC -march=x86-64 -gdwarf-4 -fno-debug-types-section -fvar-tracking-assignments -g2 -fno-var-tracking -I. -I/usr/include/gc -I/usr/include/gc -o fileio.o -c fileio.cc In file included from common.h:35, from fileio.h:15, from fileio.cc:8: memory.h: In function 'void mem::compact(int)': memory.h:185:29: warning: 'GC_dont_expand' is deprecated [-Wdeprecated-declarations] 185 | inline void compact(int x) {GC_dont_expand=x;} | ^~~~~~~~~~~~~~ In file included from memory.h:50, from common.h:35, from fileio.h:15, from fileio.cc:8: /usr/include/gc/gc.h:255:31: note: declared here 255 | GC_API GC_ATTR_DEPRECATED int GC_dont_expand; | ^~~~~~~~~~~~~~ x86_64-pld-linux-g++ -Wall -DHAVE_CONFIG_H -D_FILE_OFFSET_BITS=64 -DUSEGC -pthread -DFFTWPP_SINGLE_THREAD -O2 -fwrapv -pipe -Wformat -Werror=format-security -gdwarf-4 -fno-debug-types-section -fvar-tracking-assignments -g2 -Wp,-D_FORTIFY_SOURCE=2 -fstack-protector-strong --param=ssp-buffer-size=4 -Werror=trampolines -fPIC -march=x86-64 -gdwarf-4 -fno-debug-types-section -fvar-tracking-assignments -g2 -O2 -fwrapv -pipe -Wformat -Werror=format-security -gdwarf-4 -fno-debug-types-section -fvar-tracking-assignments -g2 -Wp,-D_FORTIFY_SOURCE=2 -fstack-protector-strong --param=ssp-buffer-size=4 -Werror=trampolines -fPIC -march=x86-64 -gdwarf-4 -fno-debug-types-section -fvar-tracking-assignments -g2 -fno-var-tracking -I. -I/usr/include/gc -I/usr/include/gc -o impdatum.o -c impdatum.cc In file included from common.h:35, from errormsg.h:12, from stack.h:13, from impdatum.cc:3: memory.h: In function 'void mem::compact(int)': memory.h:185:29: warning: 'GC_dont_expand' is deprecated [-Wdeprecated-declarations] 185 | inline void compact(int x) {GC_dont_expand=x;} | ^~~~~~~~~~~~~~ In file included from memory.h:50, from common.h:35, from errormsg.h:12, from stack.h:13, from impdatum.cc:3: /usr/include/gc/gc.h:255:31: note: declared here 255 | GC_API GC_ATTR_DEPRECATED int GC_dont_expand; | ^~~~~~~~~~~~~~ x86_64-pld-linux-g++ -Wall -DHAVE_CONFIG_H -D_FILE_OFFSET_BITS=64 -DUSEGC -pthread -DFFTWPP_SINGLE_THREAD -O2 -fwrapv -pipe -Wformat -Werror=format-security -gdwarf-4 -fno-debug-types-section -fvar-tracking-assignments -g2 -Wp,-D_FORTIFY_SOURCE=2 -fstack-protector-strong --param=ssp-buffer-size=4 -Werror=trampolines -fPIC -march=x86-64 -gdwarf-4 -fno-debug-types-section -fvar-tracking-assignments -g2 -O2 -fwrapv -pipe -Wformat -Werror=format-security -gdwarf-4 -fno-debug-types-section -fvar-tracking-assignments -g2 -Wp,-D_FORTIFY_SOURCE=2 -fstack-protector-strong --param=ssp-buffer-size=4 -Werror=trampolines -fPIC -march=x86-64 -gdwarf-4 -fno-debug-types-section -fvar-tracking-assignments -g2 -fno-var-tracking -I. -I/usr/include/gc -I/usr/include/gc -o coder.o -c coder.cc In file included from common.h:35, from errormsg.h:12, from coder.cc:12: memory.h: In function 'void mem::compact(int)': memory.h:185:29: warning: 'GC_dont_expand' is deprecated [-Wdeprecated-declarations] 185 | inline void compact(int x) {GC_dont_expand=x;} | ^~~~~~~~~~~~~~ In file included from memory.h:50, from common.h:35, from errormsg.h:12, from coder.cc:12: /usr/include/gc/gc.h:255:31: note: declared here 255 | GC_API GC_ATTR_DEPRECATED int GC_dont_expand; | ^~~~~~~~~~~~~~ x86_64-pld-linux-g++ -Wall -DHAVE_CONFIG_H -D_FILE_OFFSET_BITS=64 -DUSEGC -pthread -DFFTWPP_SINGLE_THREAD -O2 -fwrapv -pipe -Wformat -Werror=format-security -gdwarf-4 -fno-debug-types-section -fvar-tracking-assignments -g2 -Wp,-D_FORTIFY_SOURCE=2 -fstack-protector-strong --param=ssp-buffer-size=4 -Werror=trampolines -fPIC -march=x86-64 -gdwarf-4 -fno-debug-types-section -fvar-tracking-assignments -g2 -O2 -fwrapv -pipe -Wformat -Werror=format-security -gdwarf-4 -fno-debug-types-section -fvar-tracking-assignments -g2 -Wp,-D_FORTIFY_SOURCE=2 -fstack-protector-strong --param=ssp-buffer-size=4 -Werror=trampolines -fPIC -march=x86-64 -gdwarf-4 -fno-debug-types-section -fvar-tracking-assignments -g2 -fno-var-tracking -I. -I/usr/include/gc -I/usr/include/gc -o camp.tab.o -c camp.tab.cc In file included from common.h:35, from errormsg.h:12, from camp.y:9: memory.h: In function 'void mem::compact(int)': memory.h:185:29: warning: 'GC_dont_expand' is deprecated [-Wdeprecated-declarations] 185 | inline void compact(int x) {GC_dont_expand=x;} | ^~~~~~~~~~~~~~ In file included from memory.h:50, from common.h:35, from errormsg.h:12, from camp.y:9: /usr/include/gc/gc.h:255:31: note: declared here 255 | GC_API GC_ATTR_DEPRECATED int GC_dont_expand; | ^~~~~~~~~~~~~~ x86_64-pld-linux-g++ -Wall -DHAVE_CONFIG_H -D_FILE_OFFSET_BITS=64 -DUSEGC -pthread -DFFTWPP_SINGLE_THREAD -O2 -fwrapv -pipe -Wformat -Werror=format-security -gdwarf-4 -fno-debug-types-section -fvar-tracking-assignments -g2 -Wp,-D_FORTIFY_SOURCE=2 -fstack-protector-strong --param=ssp-buffer-size=4 -Werror=trampolines -fPIC -march=x86-64 -gdwarf-4 -fno-debug-types-section -fvar-tracking-assignments -g2 -O2 -fwrapv -pipe -Wformat -Werror=format-security -gdwarf-4 -fno-debug-types-section -fvar-tracking-assignments -g2 -Wp,-D_FORTIFY_SOURCE=2 -fstack-protector-strong --param=ssp-buffer-size=4 -Werror=trampolines -fPIC -march=x86-64 -gdwarf-4 -fno-debug-types-section -fvar-tracking-assignments -g2 -fno-var-tracking -I. -I/usr/include/gc -I/usr/include/gc -o refaccess.o -c refaccess.cc In file included from common.h:35, from errormsg.h:12, from access.h:15, from refaccess.h:11, from refaccess.cc:8: memory.h: In function 'void mem::compact(int)': memory.h:185:29: warning: 'GC_dont_expand' is deprecated [-Wdeprecated-declarations] 185 | inline void compact(int x) {GC_dont_expand=x;} | ^~~~~~~~~~~~~~ In file included from memory.h:50, from common.h:35, from errormsg.h:12, from access.h:15, from refaccess.h:11, from refaccess.cc:8: /usr/include/gc/gc.h:255:31: note: declared here 255 | GC_API GC_ATTR_DEPRECATED int GC_dont_expand; | ^~~~~~~~~~~~~~ x86_64-pld-linux-g++ -Wall -DHAVE_CONFIG_H -D_FILE_OFFSET_BITS=64 -DUSEGC -pthread -DFFTWPP_SINGLE_THREAD -O2 -fwrapv -pipe -Wformat -Werror=format-security -gdwarf-4 -fno-debug-types-section -fvar-tracking-assignments -g2 -Wp,-D_FORTIFY_SOURCE=2 -fstack-protector-strong --param=ssp-buffer-size=4 -Werror=trampolines -fPIC -march=x86-64 -gdwarf-4 -fno-debug-types-section -fvar-tracking-assignments -g2 -O2 -fwrapv -pipe -Wformat -Werror=format-security -gdwarf-4 -fno-debug-types-section -fvar-tracking-assignments -g2 -Wp,-D_FORTIFY_SOURCE=2 -fstack-protector-strong --param=ssp-buffer-size=4 -Werror=trampolines -fPIC -march=x86-64 -gdwarf-4 -fno-debug-types-section -fvar-tracking-assignments -g2 -fno-var-tracking -I. -I/usr/include/gc -I/usr/include/gc -o varinit.o -c varinit.cc In file included from common.h:35, from errormsg.h:12, from types.h:17, from varinit.h:15, from varinit.cc:12: memory.h: In function 'void mem::compact(int)': memory.h:185:29: warning: 'GC_dont_expand' is deprecated [-Wdeprecated-declarations] 185 | inline void compact(int x) {GC_dont_expand=x;} | ^~~~~~~~~~~~~~ In file included from memory.h:50, from common.h:35, from errormsg.h:12, from types.h:17, from varinit.h:15, from varinit.cc:12: /usr/include/gc/gc.h:255:31: note: declared here 255 | GC_API GC_ATTR_DEPRECATED int GC_dont_expand; | ^~~~~~~~~~~~~~ x86_64-pld-linux-g++ -Wall -DHAVE_CONFIG_H -D_FILE_OFFSET_BITS=64 -DUSEGC -pthread -DFFTWPP_SINGLE_THREAD -O2 -fwrapv -pipe -Wformat -Werror=format-security -gdwarf-4 -fno-debug-types-section -fvar-tracking-assignments -g2 -Wp,-D_FORTIFY_SOURCE=2 -fstack-protector-strong --param=ssp-buffer-size=4 -Werror=trampolines -fPIC -march=x86-64 -gdwarf-4 -fno-debug-types-section -fvar-tracking-assignments -g2 -O2 -fwrapv -pipe -Wformat -Werror=format-security -gdwarf-4 -fno-debug-types-section -fvar-tracking-assignments -g2 -Wp,-D_FORTIFY_SOURCE=2 -fstack-protector-strong --param=ssp-buffer-size=4 -Werror=trampolines -fPIC -march=x86-64 -gdwarf-4 -fno-debug-types-section -fvar-tracking-assignments -g2 -fno-var-tracking -I. -I/usr/include/gc -I/usr/include/gc -o application.o -c application.cc In file included from common.h:35, from application.h:14, from application.cc:11: memory.h: In function 'void mem::compact(int)': memory.h:185:29: warning: 'GC_dont_expand' is deprecated [-Wdeprecated-declarations] 185 | inline void compact(int x) {GC_dont_expand=x;} | ^~~~~~~~~~~~~~ In file included from memory.h:50, from common.h:35, from application.h:14, from application.cc:11: /usr/include/gc/gc.h:255:31: note: declared here 255 | GC_API GC_ATTR_DEPRECATED int GC_dont_expand; | ^~~~~~~~~~~~~~ x86_64-pld-linux-g++ -Wall -DHAVE_CONFIG_H -D_FILE_OFFSET_BITS=64 -DUSEGC -pthread -DFFTWPP_SINGLE_THREAD -O2 -fwrapv -pipe -Wformat -Werror=format-security -gdwarf-4 -fno-debug-types-section -fvar-tracking-assignments -g2 -Wp,-D_FORTIFY_SOURCE=2 -fstack-protector-strong --param=ssp-buffer-size=4 -Werror=trampolines -fPIC -march=x86-64 -gdwarf-4 -fno-debug-types-section -fvar-tracking-assignments -g2 -O2 -fwrapv -pipe -Wformat -Werror=format-security -gdwarf-4 -fno-debug-types-section -fvar-tracking-assignments -g2 -Wp,-D_FORTIFY_SOURCE=2 -fstack-protector-strong --param=ssp-buffer-size=4 -Werror=trampolines -fPIC -march=x86-64 -gdwarf-4 -fno-debug-types-section -fvar-tracking-assignments -g2 -fno-var-tracking -I. -I/usr/include/gc -I/usr/include/gc -o fundec.o -c fundec.cc In file included from common.h:35, from symbol.h:15, from dec.h:13, from fundec.h:12, from fundec.cc:9: memory.h: In function 'void mem::compact(int)': memory.h:185:29: warning: 'GC_dont_expand' is deprecated [-Wdeprecated-declarations] 185 | inline void compact(int x) {GC_dont_expand=x;} | ^~~~~~~~~~~~~~ In file included from memory.h:50, from common.h:35, from symbol.h:15, from dec.h:13, from fundec.h:12, from fundec.cc:9: /usr/include/gc/gc.h:255:31: note: declared here 255 | GC_API GC_ATTR_DEPRECATED int GC_dont_expand; | ^~~~~~~~~~~~~~ x86_64-pld-linux-g++ -Wall -DHAVE_CONFIG_H -D_FILE_OFFSET_BITS=64 -DUSEGC -pthread -DFFTWPP_SINGLE_THREAD -O2 -fwrapv -pipe -Wformat -Werror=format-security -gdwarf-4 -fno-debug-types-section -fvar-tracking-assignments -g2 -Wp,-D_FORTIFY_SOURCE=2 -fstack-protector-strong --param=ssp-buffer-size=4 -Werror=trampolines -fPIC -march=x86-64 -gdwarf-4 -fno-debug-types-section -fvar-tracking-assignments -g2 -O2 -fwrapv -pipe -Wformat -Werror=format-security -gdwarf-4 -fno-debug-types-section -fvar-tracking-assignments -g2 -Wp,-D_FORTIFY_SOURCE=2 -fstack-protector-strong --param=ssp-buffer-size=4 -Werror=trampolines -fPIC -march=x86-64 -gdwarf-4 -fno-debug-types-section -fvar-tracking-assignments -g2 -fno-var-tracking -I. -I/usr/include/gc -I/usr/include/gc -o PRCbitStream.o -c prc/PRCbitStream.cc x86_64-pld-linux-g++ -Wall -DHAVE_CONFIG_H -D_FILE_OFFSET_BITS=64 -DUSEGC -pthread -DFFTWPP_SINGLE_THREAD -O2 -fwrapv -pipe -Wformat -Werror=format-security -gdwarf-4 -fno-debug-types-section -fvar-tracking-assignments -g2 -Wp,-D_FORTIFY_SOURCE=2 -fstack-protector-strong --param=ssp-buffer-size=4 -Werror=trampolines -fPIC -march=x86-64 -gdwarf-4 -fno-debug-types-section -fvar-tracking-assignments -g2 -O2 -fwrapv -pipe -Wformat -Werror=format-security -gdwarf-4 -fno-debug-types-section -fvar-tracking-assignments -g2 -Wp,-D_FORTIFY_SOURCE=2 -fstack-protector-strong --param=ssp-buffer-size=4 -Werror=trampolines -fPIC -march=x86-64 -gdwarf-4 -fno-debug-types-section -fvar-tracking-assignments -g2 -fno-var-tracking -I. -I/usr/include/gc -I/usr/include/gc -o envcompleter.o -c envcompleter.cc In file included from common.h:35, from symbol.h:15, from table.h:14, from envcompleter.cc:11: memory.h: In function 'void mem::compact(int)': memory.h:185:29: warning: 'GC_dont_expand' is deprecated [-Wdeprecated-declarations] 185 | inline void compact(int x) {GC_dont_expand=x;} | ^~~~~~~~~~~~~~ In file included from memory.h:50, from common.h:35, from symbol.h:15, from table.h:14, from envcompleter.cc:11: /usr/include/gc/gc.h:255:31: note: declared here 255 | GC_API GC_ATTR_DEPRECATED int GC_dont_expand; | ^~~~~~~~~~~~~~ x86_64-pld-linux-g++ -Wall -DHAVE_CONFIG_H -D_FILE_OFFSET_BITS=64 -DUSEGC -pthread -DFFTWPP_SINGLE_THREAD -O2 -fwrapv -pipe -Wformat -Werror=format-security -gdwarf-4 -fno-debug-types-section -fvar-tracking-assignments -g2 -Wp,-D_FORTIFY_SOURCE=2 -fstack-protector-strong --param=ssp-buffer-size=4 -Werror=trampolines -fPIC -march=x86-64 -gdwarf-4 -fno-debug-types-section -fvar-tracking-assignments -g2 -O2 -fwrapv -pipe -Wformat -Werror=format-security -gdwarf-4 -fno-debug-types-section -fvar-tracking-assignments -g2 -Wp,-D_FORTIFY_SOURCE=2 -fstack-protector-strong --param=ssp-buffer-size=4 -Werror=trampolines -fPIC -march=x86-64 -gdwarf-4 -fno-debug-types-section -fvar-tracking-assignments -g2 -fno-var-tracking -I. -I/usr/include/gc -I/usr/include/gc -o Delaunay.o -c Delaunay.cc In file included from common.h:35, from Delaunay.h:9, from Delaunay.cc:8: memory.h: In function 'void mem::compact(int)': memory.h:185:29: warning: 'GC_dont_expand' is deprecated [-Wdeprecated-declarations] 185 | inline void compact(int x) {GC_dont_expand=x;} | ^~~~~~~~~~~~~~ In file included from memory.h:50, from common.h:35, from Delaunay.h:9, from Delaunay.cc:8: /usr/include/gc/gc.h:255:31: note: declared here 255 | GC_API GC_ATTR_DEPRECATED int GC_dont_expand; | ^~~~~~~~~~~~~~ x86_64-pld-linux-g++ -Wall -DHAVE_CONFIG_H -D_FILE_OFFSET_BITS=64 -DUSEGC -pthread -DFFTWPP_SINGLE_THREAD -O2 -fwrapv -pipe -Wformat -Werror=format-security -gdwarf-4 -fno-debug-types-section -fvar-tracking-assignments -g2 -Wp,-D_FORTIFY_SOURCE=2 -fstack-protector-strong --param=ssp-buffer-size=4 -Werror=trampolines -fPIC -march=x86-64 -gdwarf-4 -fno-debug-types-section -fvar-tracking-assignments -g2 -O2 -fwrapv -pipe -Wformat -Werror=format-security -gdwarf-4 -fno-debug-types-section -fvar-tracking-assignments -g2 -Wp,-D_FORTIFY_SOURCE=2 -fstack-protector-strong --param=ssp-buffer-size=4 -Werror=trampolines -fPIC -march=x86-64 -gdwarf-4 -fno-debug-types-section -fvar-tracking-assignments -g2 -fno-var-tracking -I. -I/usr/include/gc -I/usr/include/gc -o PRCdouble.o -c prc/PRCdouble.cc x86_64-pld-linux-g++ -Wall -DHAVE_CONFIG_H -D_FILE_OFFSET_BITS=64 -DUSEGC -pthread -DFFTWPP_SINGLE_THREAD -O2 -fwrapv -pipe -Wformat -Werror=format-security -gdwarf-4 -fno-debug-types-section -fvar-tracking-assignments -g2 -Wp,-D_FORTIFY_SOURCE=2 -fstack-protector-strong --param=ssp-buffer-size=4 -Werror=trampolines -fPIC -march=x86-64 -gdwarf-4 -fno-debug-types-section -fvar-tracking-assignments -g2 -O2 -fwrapv -pipe -Wformat -Werror=format-security -gdwarf-4 -fno-debug-types-section -fvar-tracking-assignments -g2 -Wp,-D_FORTIFY_SOURCE=2 -fstack-protector-strong --param=ssp-buffer-size=4 -Werror=trampolines -fPIC -march=x86-64 -gdwarf-4 -fno-debug-types-section -fvar-tracking-assignments -g2 -fno-var-tracking -I. -I/usr/include/gc -I/usr/include/gc -o array.o -c array.cc In file included from common.h:35, from errormsg.h:12, from vm.h:11, from array.h:11, from array.cc:8: memory.h: In function 'void mem::compact(int)': memory.h:185:29: warning: 'GC_dont_expand' is deprecated [-Wdeprecated-declarations] 185 | inline void compact(int x) {GC_dont_expand=x;} | ^~~~~~~~~~~~~~ In file included from memory.h:50, from common.h:35, from errormsg.h:12, from vm.h:11, from array.h:11, from array.cc:8: /usr/include/gc/gc.h:255:31: note: declared here 255 | GC_API GC_ATTR_DEPRECATED int GC_dont_expand; | ^~~~~~~~~~~~~~ x86_64-pld-linux-g++ -Wall -DHAVE_CONFIG_H -D_FILE_OFFSET_BITS=64 -DUSEGC -pthread -DFFTWPP_SINGLE_THREAD -O2 -fwrapv -pipe -Wformat -Werror=format-security -gdwarf-4 -fno-debug-types-section -fvar-tracking-assignments -g2 -Wp,-D_FORTIFY_SOURCE=2 -fstack-protector-strong --param=ssp-buffer-size=4 -Werror=trampolines -fPIC -march=x86-64 -gdwarf-4 -fno-debug-types-section -fvar-tracking-assignments -g2 -O2 -fwrapv -pipe -Wformat -Werror=format-security -gdwarf-4 -fno-debug-types-section -fvar-tracking-assignments -g2 -Wp,-D_FORTIFY_SOURCE=2 -fstack-protector-strong --param=ssp-buffer-size=4 -Werror=trampolines -fPIC -march=x86-64 -gdwarf-4 -fno-debug-types-section -fvar-tracking-assignments -g2 -fno-var-tracking -I. -I/usr/include/gc -I/usr/include/gc -o arcball.o -c arcball.cc x86_64-pld-linux-g++ -Wall -DHAVE_CONFIG_H -D_FILE_OFFSET_BITS=64 -DUSEGC -pthread -DFFTWPP_SINGLE_THREAD -O2 -fwrapv -pipe -Wformat -Werror=format-security -gdwarf-4 -fno-debug-types-section -fvar-tracking-assignments -g2 -Wp,-D_FORTIFY_SOURCE=2 -fstack-protector-strong --param=ssp-buffer-size=4 -Werror=trampolines -fPIC -march=x86-64 -gdwarf-4 -fno-debug-types-section -fvar-tracking-assignments -g2 -O2 -fwrapv -pipe -Wformat -Werror=format-security -gdwarf-4 -fno-debug-types-section -fvar-tracking-assignments -g2 -Wp,-D_FORTIFY_SOURCE=2 -fstack-protector-strong --param=ssp-buffer-size=4 -Werror=trampolines -fPIC -march=x86-64 -gdwarf-4 -fno-debug-types-section -fvar-tracking-assignments -g2 -fno-var-tracking -I. -I/usr/include/gc -I/usr/include/gc -o predicates.o -c predicates.cc x86_64-pld-linux-g++ -Wall -DHAVE_CONFIG_H -D_FILE_OFFSET_BITS=64 -DUSEGC -pthread -DFFTWPP_SINGLE_THREAD -O2 -fwrapv -pipe -Wformat -Werror=format-security -gdwarf-4 -fno-debug-types-section -fvar-tracking-assignments -g2 -Wp,-D_FORTIFY_SOURCE=2 -fstack-protector-strong --param=ssp-buffer-size=4 -Werror=trampolines -fPIC -march=x86-64 -gdwarf-4 -fno-debug-types-section -fvar-tracking-assignments -g2 -O2 -fwrapv -pipe -Wformat -Werror=format-security -gdwarf-4 -fno-debug-types-section -fvar-tracking-assignments -g2 -Wp,-D_FORTIFY_SOURCE=2 -fstack-protector-strong --param=ssp-buffer-size=4 -Werror=trampolines -fPIC -march=x86-64 -gdwarf-4 -fno-debug-types-section -fvar-tracking-assignments -g2 -fno-var-tracking -I. -I/usr/include/gc -I/usr/include/gc -o tr.o -c tr.cc In file included from common.h:35, from tr.cc:45: memory.h: In function 'void mem::compact(int)': memory.h:185:29: warning: 'GC_dont_expand' is deprecated [-Wdeprecated-declarations] 185 | inline void compact(int x) {GC_dont_expand=x;} | ^~~~~~~~~~~~~~ In file included from memory.h:50, from common.h:35, from tr.cc:45: /usr/include/gc/gc.h:255:31: note: declared here 255 | GC_API GC_ATTR_DEPRECATED int GC_dont_expand; | ^~~~~~~~~~~~~~ x86_64-pld-linux-g++ -Wall -DHAVE_CONFIG_H -D_FILE_OFFSET_BITS=64 -DUSEGC -pthread -DFFTWPP_SINGLE_THREAD -O2 -fwrapv -pipe -Wformat -Werror=format-security -gdwarf-4 -fno-debug-types-section -fvar-tracking-assignments -g2 -Wp,-D_FORTIFY_SOURCE=2 -fstack-protector-strong --param=ssp-buffer-size=4 -Werror=trampolines -fPIC -march=x86-64 -gdwarf-4 -fno-debug-types-section -fvar-tracking-assignments -g2 -O2 -fwrapv -pipe -Wformat -Werror=format-security -gdwarf-4 -fno-debug-types-section -fvar-tracking-assignments -g2 -Wp,-D_FORTIFY_SOURCE=2 -fstack-protector-strong --param=ssp-buffer-size=4 -Werror=trampolines -fPIC -march=x86-64 -gdwarf-4 -fno-debug-types-section -fvar-tracking-assignments -g2 -fno-var-tracking -I. -I/usr/include/gc -I/usr/include/gc -o quaternion.o -c quaternion.cc cd doc && /usr/bin/make asy-latex.pdf x86_64-pld-linux-g++ -Wall -DHAVE_CONFIG_H -D_FILE_OFFSET_BITS=64 -DUSEGC -pthread -DFFTWPP_SINGLE_THREAD -O2 -fwrapv -pipe -Wformat -Werror=format-security -gdwarf-4 -fno-debug-types-section -fvar-tracking-assignments -g2 -Wp,-D_FORTIFY_SOURCE=2 -fstack-protector-strong --param=ssp-buffer-size=4 -Werror=trampolines -fPIC -march=x86-64 -gdwarf-4 -fno-debug-types-section -fvar-tracking-assignments -g2 -O2 -fwrapv -pipe -Wformat -Werror=format-security -gdwarf-4 -fno-debug-types-section -fvar-tracking-assignments -g2 -Wp,-D_FORTIFY_SOURCE=2 -fstack-protector-strong --param=ssp-buffer-size=4 -Werror=trampolines -fPIC -march=x86-64 -gdwarf-4 -fno-debug-types-section -fvar-tracking-assignments -g2 -fno-var-tracking -I. -I/usr/include/gc -I/usr/include/gc -o constructor.o -c constructor.cc In file included from common.h:35, from errormsg.h:12, from stack.h:13, from constructor.cc:23: memory.h: In function 'void mem::compact(int)': memory.h:185:29: warning: 'GC_dont_expand' is deprecated [-Wdeprecated-declarations] 185 | inline void compact(int x) {GC_dont_expand=x;} | ^~~~~~~~~~~~~~ In file included from memory.h:50, from common.h:35, from errormsg.h:12, from stack.h:13, from constructor.cc:23: /usr/include/gc/gc.h:255:31: note: declared here 255 | GC_API GC_ATTR_DEPRECATED int GC_dont_expand; | ^~~~~~~~~~~~~~ make[1]: Entering directory '/tmp/B.jwtwCh/BUILD/asymptote-2.41/doc' pdflatex asy-latex.dtx This is pdfTeXk, Version 3.1415926-1.40.9 (Web2C 7.5.7) %&-line parsing enabled. entering extended mode (./asy-latex.dtx LaTeX2e <2005/12/01> Babel <v3.8l> and hyphenation patterns for english, usenglishmax, dumylang, noh yphenation, german-x-2008-06-18, ngerman-x-2008-06-18, ancientgreek, ibycus, ar abic, basque, bulgarian, catalan, pinyin, coptic, croatian, czech, danish, dutc h, esperanto, estonian, farsi, finnish, french, galician, german, ngerman, mono greek, greek, hungarian, icelandic, indonesian, interlingua, irish, italian, la tin, mongolian, mongolian2a, bokmal, nynorsk, polish, portuguese, romanian, rus sian, sanskrit, serbian, slovak, slovenian, spanish, swedish, turkish, ukenglis h, ukrainian, uppersorbian, welsh, loaded. (/usr/share/texmf-dist/tex/latex/base/docstrip.tex Utility: `docstrip' 2.5d <2005/07/29> English documentation <1999/03/31> ********************************************************** * This program converts documented macro-files into fast * * loadable files by stripping off (nearly) all comments! * ********************************************************** ******************************************************** * No Configuration file found, using default settings. * ******************************************************** ) Generating file(s) ./asymptote.sty Processing file asy-latex.dtx (pkg) -> asymptote.sty Lines processed: 715 Comments removed: 281 Comments passed: 0 Codelines passed: 418 Generating file(s) ./asy-latex.ins Processing file asy-latex.dtx (batchfile) -> asy-latex.ins Lines processed: 715 Comments removed: 281 Comments passed: 0 Codelines passed: 418 (/usr/share/texmf-dist/tex/latex/base/ltxdoc.cls Document Class: ltxdoc 1999/08/08 v2.0u Standard LaTeX documentation class (/usr/share/texmf-dist/tex/latex/base/article.cls Document Class: article 2005/09/16 v1.4f Standard LaTeX document class (/usr/share/texmf-dist/tex/latex/base/size10.clo)) (/usr/share/texmf-dist/tex/latex/base/doc.sty (/usr/share/texmf-dist/tex/latex/tools/multicol.sty))) Writing index file asy-latex.idx No file asy-latex.aux. (./asy-latex.dtx No file asy-latex.toc. [1{/usr/share/texmf/fonts/map/pdftex/updmap/pdftex.map}] [2] [3] [4] [5] [6] [7] Overfull \hbox (19.48749pt too wide) in paragraph at lines 540--540 [][] \OT1/cmtt/m/n/9 \immediate\write\AsyStream{size(0,\ASYheight,\asy@ex pand@keepAspect);}% Overfull \hbox (14.76254pt too wide) in paragraph at lines 540--540 [][] \OT1/cmtt/m/n/9 \immediate\write\AsyStream{size(\ASYwidth,0,\asy@exp and@keepAspect);}% Overfull \hbox (57.28705pt too wide) in paragraph at lines 540--540 [][] \OT1/cmtt/m/n/9 \immediate\write\AsyStream{size(\ASYwidth,\ASYheight ,\asy@expand@keepAspect);}% [8] Overfull \hbox (24.21243pt too wide) in paragraph at lines 594--594 [][] \OT1/cmtt/m/n/9 \setbox\ASYbox=\hbox{\includegraphics[hiresbb] {"\AsyFile+0".pdf}}% Overfull \hbox (14.76254pt too wide) in paragraph at lines 594--594 [][] \OT1/cmtt/m/n/9 \setbox\ASYbox=\hbox{\includegraphics[hiresbb] {"\AsyFile".pdf}}% Overfull \hbox (5.31265pt too wide) in paragraph at lines 594--594 [][] \OT1/cmtt/m/n/9 \setbox\ASYbox=\hbox{\includegraphics[hiresbb]{" \AsyFile.eps"}}% [9] [10]) [11] (./asy-latex.aux) ) (see the transcript file for additional information)</usr/share/texmf-dist/font s/type1/bluesky/cm/cmbx10.pfb></usr/share/texmf-dist/fonts/type1/bluesky/cm/cmb x12.pfb></usr/share/texmf-dist/fonts/type1/bluesky/cm/cmbx9.pfb></usr/share/tex mf-dist/fonts/type1/bluesky/cm/cmr10.pfb></usr/share/texmf-dist/fonts/type1/blu esky/cm/cmr12.pfb></usr/share/texmf-dist/fonts/type1/bluesky/cm/cmr17.pfb></usr /share/texmf-dist/fonts/type1/bluesky/cm/cmr6.pfb></usr/share/texmf-dist/fonts/ type1/bluesky/cm/cmr7.pfb></usr/share/texmf-dist/fonts/type1/bluesky/cm/cmr9.pf b></usr/share/texmf-dist/fonts/type1/bluesky/cm/cmss10.pfb></usr/share/texmf-di st/fonts/type1/bluesky/cm/cmss17.pfb></usr/share/texmf-dist/fonts/type1/bluesky /cm/cmsy10.pfb></usr/share/texmf-dist/fonts/type1/bluesky/cm/cmti10.pfb></usr/s hare/texmf-dist/fonts/type1/bluesky/cm/cmtt10.pfb></usr/share/texmf-dist/fonts/ type1/bluesky/cm/cmtt9.pfb> Output written on asy-latex.pdf (11 pages, 115878 bytes). Transcript written on asy-latex.log. make[1]: Leaving directory '/tmp/B.jwtwCh/BUILD/asymptote-2.41/doc' x86_64-pld-linux-g++ -Wall -DHAVE_CONFIG_H -D_FILE_OFFSET_BITS=64 -DUSEGC -pthread -DFFTWPP_SINGLE_THREAD -O2 -fwrapv -pipe -Wformat -Werror=format-security -gdwarf-4 -fno-debug-types-section -fvar-tracking-assignments -g2 -Wp,-D_FORTIFY_SOURCE=2 -fstack-protector-strong --param=ssp-buffer-size=4 -Werror=trampolines -fPIC -march=x86-64 -gdwarf-4 -fno-debug-types-section -fvar-tracking-assignments -g2 -O2 -fwrapv -pipe -Wformat -Werror=format-security -gdwarf-4 -fno-debug-types-section -fvar-tracking-assignments -g2 -Wp,-D_FORTIFY_SOURCE=2 -fstack-protector-strong --param=ssp-buffer-size=4 -Werror=trampolines -fPIC -march=x86-64 -gdwarf-4 -fno-debug-types-section -fvar-tracking-assignments -g2 -fno-var-tracking -I. -I/usr/include/gc -I/usr/include/gc -o algebra3.o -c algebra3.cc x86_64-pld-linux-g++ -Wall -DHAVE_CONFIG_H -D_FILE_OFFSET_BITS=64 -DUSEGC -pthread -DFFTWPP_SINGLE_THREAD -O2 -fwrapv -pipe -Wformat -Werror=format-security -gdwarf-4 -fno-debug-types-section -fvar-tracking-assignments -g2 -Wp,-D_FORTIFY_SOURCE=2 -fstack-protector-strong --param=ssp-buffer-size=4 -Werror=trampolines -fPIC -march=x86-64 -gdwarf-4 -fno-debug-types-section -fvar-tracking-assignments -g2 -O2 -fwrapv -pipe -Wformat -Werror=format-security -gdwarf-4 -fno-debug-types-section -fvar-tracking-assignments -g2 -Wp,-D_FORTIFY_SOURCE=2 -fstack-protector-strong --param=ssp-buffer-size=4 -Werror=trampolines -fPIC -march=x86-64 -gdwarf-4 -fno-debug-types-section -fvar-tracking-assignments -g2 -fno-var-tracking -I. -I/usr/include/gc -I/usr/include/gc -o symbol.o -c symbol.cc In file included from common.h:35, from settings.h:14, from symbol.cc:15: memory.h: In function 'void mem::compact(int)': memory.h:185:29: warning: 'GC_dont_expand' is deprecated [-Wdeprecated-declarations] 185 | inline void compact(int x) {GC_dont_expand=x;} | ^~~~~~~~~~~~~~ In file included from memory.h:50, from common.h:35, from settings.h:14, from symbol.cc:15: /usr/include/gc/gc.h:255:31: note: declared here 255 | GC_API GC_ATTR_DEPRECATED int GC_dont_expand; | ^~~~~~~~~~~~~~ x86_64-pld-linux-g++ -Wall -DHAVE_CONFIG_H -D_FILE_OFFSET_BITS=64 -DUSEGC -pthread -DFFTWPP_SINGLE_THREAD -O2 -fwrapv -pipe -Wformat -Werror=format-security -gdwarf-4 -fno-debug-types-section -fvar-tracking-assignments -g2 -Wp,-D_FORTIFY_SOURCE=2 -fstack-protector-strong --param=ssp-buffer-size=4 -Werror=trampolines -fPIC -march=x86-64 -gdwarf-4 -fno-debug-types-section -fvar-tracking-assignments -g2 -O2 -fwrapv -pipe -Wformat -Werror=format-security -gdwarf-4 -fno-debug-types-section -fvar-tracking-assignments -g2 -Wp,-D_FORTIFY_SOURCE=2 -fstack-protector-strong --param=ssp-buffer-size=4 -Werror=trampolines -fPIC -march=x86-64 -gdwarf-4 -fno-debug-types-section -fvar-tracking-assignments -g2 -fno-var-tracking -I. -I/usr/include/gc -I/usr/include/gc -o main.o -c main.cc In file included from common.h:35, from main.cc:28: memory.h: In function 'void mem::compact(int)': memory.h:185:29: warning: 'GC_dont_expand' is deprecated [-Wdeprecated-declarations] 185 | inline void compact(int x) {GC_dont_expand=x;} | ^~~~~~~~~~~~~~ In file included from memory.h:50, from common.h:35, from main.cc:28: /usr/include/gc/gc.h:255:31: note: declared here 255 | GC_API GC_ATTR_DEPRECATED int GC_dont_expand; | ^~~~~~~~~~~~~~ x86_64-pld-linux-g++ -Wall -DHAVE_CONFIG_H -D_FILE_OFFSET_BITS=64 -DUSEGC -pthread -DFFTWPP_SINGLE_THREAD -O2 -fwrapv -pipe -Wformat -Werror=format-security -gdwarf-4 -fno-debug-types-section -fvar-tracking-assignments -g2 -Wp,-D_FORTIFY_SOURCE=2 -fstack-protector-strong --param=ssp-buffer-size=4 -Werror=trampolines -fPIC -march=x86-64 -gdwarf-4 -fno-debug-types-section -fvar-tracking-assignments -g2 -O2 -fwrapv -pipe -Wformat -Werror=format-security -gdwarf-4 -fno-debug-types-section -fvar-tracking-assignments -g2 -Wp,-D_FORTIFY_SOURCE=2 -fstack-protector-strong --param=ssp-buffer-size=4 -Werror=trampolines -fPIC -march=x86-64 -gdwarf-4 -fno-debug-types-section -fvar-tracking-assignments -g2 -fno-var-tracking -I. -I/usr/include/gc -I/usr/include/gc -o writePRC.o -c prc/writePRC.cc x86_64-pld-linux-g++ -Wall -DHAVE_CONFIG_H -D_FILE_OFFSET_BITS=64 -DUSEGC -pthread -DFFTWPP_SINGLE_THREAD -O2 -fwrapv -pipe -Wformat -Werror=format-security -gdwarf-4 -fno-debug-types-section -fvar-tracking-assignments -g2 -Wp,-D_FORTIFY_SOURCE=2 -fstack-protector-strong --param=ssp-buffer-size=4 -Werror=trampolines -fPIC -march=x86-64 -gdwarf-4 -fno-debug-types-section -fvar-tracking-assignments -g2 -O2 -fwrapv -pipe -Wformat -Werror=format-security -gdwarf-4 -fno-debug-types-section -fvar-tracking-assignments -g2 -Wp,-D_FORTIFY_SOURCE=2 -fstack-protector-strong --param=ssp-buffer-size=4 -Werror=trampolines -fPIC -march=x86-64 -gdwarf-4 -fno-debug-types-section -fvar-tracking-assignments -g2 -fno-var-tracking -I. -I/usr/include/gc -I/usr/include/gc -o process.o -c process.cc In file included from common.h:35, from errormsg.h:12, from types.h:17, from process.cc:10: memory.h: In function 'void mem::compact(int)': memory.h:185:29: warning: 'GC_dont_expand' is deprecated [-Wdeprecated-declarations] 185 | inline void compact(int x) {GC_dont_expand=x;} | ^~~~~~~~~~~~~~ In file included from memory.h:50, from common.h:35, from errormsg.h:12, from types.h:17, from process.cc:10: /usr/include/gc/gc.h:255:31: note: declared here 255 | GC_API GC_ATTR_DEPRECATED int GC_dont_expand; | ^~~~~~~~~~~~~~ x86_64-pld-linux-g++ -Wall -DHAVE_CONFIG_H -D_FILE_OFFSET_BITS=64 -DUSEGC -pthread -DFFTWPP_SINGLE_THREAD -O2 -fwrapv -pipe -Wformat -Werror=format-security -gdwarf-4 -fno-debug-types-section -fvar-tracking-assignments -g2 -Wp,-D_FORTIFY_SOURCE=2 -fstack-protector-strong --param=ssp-buffer-size=4 -Werror=trampolines -fPIC -march=x86-64 -gdwarf-4 -fno-debug-types-section -fvar-tracking-assignments -g2 -O2 -fwrapv -pipe -Wformat -Werror=format-security -gdwarf-4 -fno-debug-types-section -fvar-tracking-assignments -g2 -Wp,-D_FORTIFY_SOURCE=2 -fstack-protector-strong --param=ssp-buffer-size=4 -Werror=trampolines -fPIC -march=x86-64 -gdwarf-4 -fno-debug-types-section -fvar-tracking-assignments -g2 -fno-var-tracking -I. -I/usr/include/gc -I/usr/include/gc -o glrender.o -c glrender.cc In file included from common.h:35, from glrender.cc:12: memory.h: In function 'void mem::compact(int)': memory.h:185:29: warning: 'GC_dont_expand' is deprecated [-Wdeprecated-declarations] 185 | inline void compact(int x) {GC_dont_expand=x;} | ^~~~~~~~~~~~~~ In file included from memory.h:50, from common.h:35, from glrender.cc:12: /usr/include/gc/gc.h:255:31: note: declared here 255 | GC_API GC_ATTR_DEPRECATED int GC_dont_expand; | ^~~~~~~~~~~~~~ x86_64-pld-linux-g++ -Wall -DHAVE_CONFIG_H -D_FILE_OFFSET_BITS=64 -DUSEGC -pthread -DFFTWPP_SINGLE_THREAD -O2 -fwrapv -pipe -Wformat -Werror=format-security -gdwarf-4 -fno-debug-types-section -fvar-tracking-assignments -g2 -Wp,-D_FORTIFY_SOURCE=2 -fstack-protector-strong --param=ssp-buffer-size=4 -Werror=trampolines -fPIC -march=x86-64 -gdwarf-4 -fno-debug-types-section -fvar-tracking-assignments -g2 -O2 -fwrapv -pipe -Wformat -Werror=format-security -gdwarf-4 -fno-debug-types-section -fvar-tracking-assignments -g2 -Wp,-D_FORTIFY_SOURCE=2 -fstack-protector-strong --param=ssp-buffer-size=4 -Werror=trampolines -fPIC -march=x86-64 -gdwarf-4 -fno-debug-types-section -fvar-tracking-assignments -g2 -fno-var-tracking -I. -I/usr/include/gc -I/usr/include/gc -o oPRCFile.o -c prc/oPRCFile.cc if test ! -s revision.cc -o "2.41" != "2.41"; then \ echo "const char *REVISION="\"2.41\"\; > revision.cc; \ fi x86_64-pld-linux-g++ -Wall -DHAVE_CONFIG_H -D_FILE_OFFSET_BITS=64 -DUSEGC -pthread -DFFTWPP_SINGLE_THREAD -O2 -fwrapv -pipe -Wformat -Werror=format-security -gdwarf-4 -fno-debug-types-section -fvar-tracking-assignments -g2 -Wp,-D_FORTIFY_SOURCE=2 -fstack-protector-strong --param=ssp-buffer-size=4 -Werror=trampolines -fPIC -march=x86-64 -gdwarf-4 -fno-debug-types-section -fvar-tracking-assignments -g2 -O2 -fwrapv -pipe -Wformat -Werror=format-security -gdwarf-4 -fno-debug-types-section -fvar-tracking-assignments -g2 -Wp,-D_FORTIFY_SOURCE=2 -fstack-protector-strong --param=ssp-buffer-size=4 -Werror=trampolines -fPIC -march=x86-64 -gdwarf-4 -fno-debug-types-section -fvar-tracking-assignments -g2 -fno-var-tracking -I. -I/usr/include/gc -I/usr/include/gc -o revision.o -c revision.cc; echo string VERSION=\"2.41\"\; > base/version.asy echo @set VERSION 2.41 > doc/version.texi echo @set Datadir /usr/share >> doc/version.texi echo "#!/usr/bin/env python" > GUI/xasyVersion.py echo xasyVersion = \"2.41\" >> GUI/xasyVersion.py if test -n ""; then \ cat asy.rc | sed -e "s/ASYMPTOTE_VERSION/2.41/" | \ windres -o asy.o; \ fi if test -n ""; then \ x86_64-pld-linux-g++ -Wall -DHAVE_CONFIG_H -D_FILE_OFFSET_BITS=64 -DUSEGC -pthread -DFFTWPP_SINGLE_THREAD -O2 -fwrapv -pipe -Wformat -Werror=format-security -gdwarf-4 -fno-debug-types-section -fvar-tracking-assignments -g2 -Wp,-D_FORTIFY_SOURCE=2 -fstack-protector-strong --param=ssp-buffer-size=4 -Werror=trampolines -fPIC -march=x86-64 -gdwarf-4 -fno-debug-types-section -fvar-tracking-assignments -g2 -O2 -fwrapv -pipe -Wformat -Werror=format-security -gdwarf-4 -fno-debug-types-section -fvar-tracking-assignments -g2 -Wp,-D_FORTIFY_SOURCE=2 -fstack-protector-strong --param=ssp-buffer-size=4 -Werror=trampolines -fPIC -march=x86-64 -gdwarf-4 -fno-debug-types-section -fvar-tracking-assignments -g2 -fno-var-tracking -o asy camperror.o path.o drawpath.o drawlabel.o picture.o psfile.o texfile.o util.o settings.o guide.o flatguide.o knot.o drawfill.o path3.o drawpath3.o drawsurface.o beziercurve.o bezierpatch.o pen.o pipestream.o types.o builtin.o gsl.o runtime.o runbacktrace.o runpicture.o runlabel.o runhistory.o runarray.o runfile.o runsystem.o runpair.o runtriple.o runpath.o runpath3d.o runstring.o runmath.o env.o genv.o stm.o dec.o errormsg.o callable.o name.o symbol.o entry.o exp.o newexp.o stack.o camp.tab.o lex.yy.o access.o virtualfieldaccess.o absyn.o record.o interact.o fileio.o fftw++asy.o simpson.o coder.o coenv.o impdatum.o locate.o parser.o program.o application.o varinit.o fundec.o refaccess.o envcompleter.o process.o constructor.o array.o Delaunay.o predicates.o PRCbitStream.o oPRCFile.o PRCdouble.o writePRC.o glrender.o tr.o arcball.o algebra3.o quaternion.o main.o revision.o asy.o -Wl,--as-needed -Wl,--no-copy-dt-needed-entries -Wl,-z,relro -Wl,-z,combreloc -lOSMesa -lglut -lGLU -lGL -lfftw3 -lreadline -lrt -lsigsegv -lz -lm -L/usr/lib -lgc -ltermcap -lgsl -lgslcblas -s -static; \ else \ ln -sf GUI/xasy.py xasy; \ x86_64-pld-linux-g++ -Wall -DHAVE_CONFIG_H -D_FILE_OFFSET_BITS=64 -DUSEGC -pthread -DFFTWPP_SINGLE_THREAD -O2 -fwrapv -pipe -Wformat -Werror=format-security -gdwarf-4 -fno-debug-types-section -fvar-tracking-assignments -g2 -Wp,-D_FORTIFY_SOURCE=2 -fstack-protector-strong --param=ssp-buffer-size=4 -Werror=trampolines -fPIC -march=x86-64 -gdwarf-4 -fno-debug-types-section -fvar-tracking-assignments -g2 -O2 -fwrapv -pipe -Wformat -Werror=format-security -gdwarf-4 -fno-debug-types-section -fvar-tracking-assignments -g2 -Wp,-D_FORTIFY_SOURCE=2 -fstack-protector-strong --param=ssp-buffer-size=4 -Werror=trampolines -fPIC -march=x86-64 -gdwarf-4 -fno-debug-types-section -fvar-tracking-assignments -g2 -fno-var-tracking -o asy camperror.o path.o drawpath.o drawlabel.o picture.o psfile.o texfile.o util.o settings.o guide.o flatguide.o knot.o drawfill.o path3.o drawpath3.o drawsurface.o beziercurve.o bezierpatch.o pen.o pipestream.o types.o builtin.o gsl.o runtime.o runbacktrace.o runpicture.o runlabel.o runhistory.o runarray.o runfile.o runsystem.o runpair.o runtriple.o runpath.o runpath3d.o runstring.o runmath.o env.o genv.o stm.o dec.o errormsg.o callable.o name.o symbol.o entry.o exp.o newexp.o stack.o camp.tab.o lex.yy.o access.o virtualfieldaccess.o absyn.o record.o interact.o fileio.o fftw++asy.o simpson.o coder.o coenv.o impdatum.o locate.o parser.o program.o application.o varinit.o fundec.o refaccess.o envcompleter.o process.o constructor.o array.o Delaunay.o predicates.o PRCbitStream.o oPRCFile.o PRCdouble.o writePRC.o glrender.o tr.o arcball.o algebra3.o quaternion.o main.o revision.o -Wl,--as-needed -Wl,--no-copy-dt-needed-entries -Wl,-z,relro -Wl,-z,combreloc -lOSMesa -lglut -lGLU -lGL -lfftw3 -lreadline -lrt -lsigsegv -lz -lm -L/usr/lib -lgc -lncurses -lgsl -lgslcblas ; \ fi /usr/bin/ld: skipping incompatible /usr/lib/librt.so when searching for -lrt /usr/bin/ld: skipping incompatible /usr/lib/libstdc++.so when searching for -lstdc++ /usr/bin/ld: skipping incompatible /usr/lib/libstdc++.a when searching for -lstdc++ /usr/bin/ld: skipping incompatible /usr/lib/libm.so when searching for -lm /usr/bin/ld: skipping incompatible /usr/lib/libpthread.so when searching for -lpthread /usr/bin/ld: skipping incompatible /usr/lib/libc.so when searching for -lc /usr/bin/ld: picture.o: in function `operator new(unsigned long, GCPlacement, void (*)(void*, void*), void*)': /usr/include/gc/gc_cpp.h:545: undefined reference to `GC_throw_bad_alloc()' /usr/bin/ld: settings.o: in function `gc::operator new(unsigned long)': /usr/include/gc/gc_cpp.h:410: undefined reference to `GC_throw_bad_alloc()' /usr/bin/ld: /usr/include/gc/gc_cpp.h:410: undefined reference to `GC_throw_bad_alloc()' /usr/bin/ld: /usr/include/gc/gc_cpp.h:410: undefined reference to `GC_throw_bad_alloc()' /usr/bin/ld: /usr/include/gc/gc_cpp.h:410: undefined reference to `GC_throw_bad_alloc()' /usr/bin/ld: settings.o:/usr/include/gc/gc_cpp.h:410: more undefined references to `GC_throw_bad_alloc()' follow collect2: error: ld returned 1 exit status make: *** [Makefile:109: asy] Error 1 error: Bad exit status from /tmp/B.jwtwCh/BUILD/tmp/rpm-tmp.12738 (%build) RPM build errors: Bad exit status from /tmp/B.jwtwCh/BUILD/tmp/rpm-tmp.12738 (%build) ended at: Sat Oct 19 14:24:29 2019, done in 0:01:05.014457 error: No files produced. + chmod -R u+rwX /tmp/B.jwtwCh/BUILD + rm -rf /tmp/B.jwtwCh/tmp /tmp/B.jwtwCh/BUILD + rm -rf /tmp/B.jwtwCh Begin-PLD-Builder-Info Build-Time: user:365.21s sys:22.60s real:67.86s (faults io:0 non-io:5659213) End-PLD-Builder-Info
[Back to list of logs] [View rpm -qa of builder]