FailedOk

th/SRPMS[OK]
th/x32[OK]
th/i686[OK]
th/x86_64[OK]

ac/SRPMS[OK]
ac/i386[OK]
ac/i586[OK]
ac/i686[OK]
ac/alpha[OK]
ac/amd64[OK]
ac/athlon[OK]
ac/ppc[OK]
ac/sparc[OK]
ac/sparc64[OK]

Advanced Search
main()
Powered by PLD Linux
(c) 2002-2018 PLD Team
$Revision: 1.37 $
Powered by achelon.
Your IP: 54.198.126.110

bind 0471cb62-0d8e-489d-9de0-095c2972cff9

Status:Failed
Source URL:ftp://buildlogs.pld-linux.org/th/x86_64/FAIL/bind,0471cb62-0d8e-489d-9de0-095c2972cff9.bz2
text/plain URL:View!
full text:View!
rpm -qa of builder:View!
Date:2018/08/09 01:43:13
Runtime:0:02:41.032429

Toc:

  • error 1
  • make[3]: *** [parallel.mk:4: check_interfaces] Error 1
  • error 2
  • make[2]: *** [Makefile:512: test] Error 2
  • error 3
  • make[1]: *** [Makefile:483: test] Error 2
  • error 4
  • error: Bad exit status from /tmp/B.apxwPs/BUILD/tmp/rpm-tmp.51854 (%build)
  • error 5
  • RPM build errors:
  • error 6
  • error: No files produced.

Content:

touch touchfile
make[5]: Leaving directory '/tmp/B.apxwPs/BUILD/bind-9.12.2-P1/bin/tests/system/dyndb/driver'
make[4]: Entering directory '/tmp/B.apxwPs/BUILD/bind-9.12.2-P1/bin/tests/system/dyndb'
touch touchfile
make[4]: Leaving directory '/tmp/B.apxwPs/BUILD/bind-9.12.2-P1/bin/tests/system/dyndb'
making all in /tmp/B.apxwPs/BUILD/bind-9.12.2-P1/bin/tests/system/pipelined
make[4]: Entering directory '/tmp/B.apxwPs/BUILD/bind-9.12.2-P1/bin/tests/system/pipelined'
touch touchfile
make[4]: Leaving directory '/tmp/B.apxwPs/BUILD/bind-9.12.2-P1/bin/tests/system/pipelined'
making all in /tmp/B.apxwPs/BUILD/bind-9.12.2-P1/bin/tests/system/rndc
make[4]: Entering directory '/tmp/B.apxwPs/BUILD/bind-9.12.2-P1/bin/tests/system/rndc'
touch touchfile
make[4]: Leaving directory '/tmp/B.apxwPs/BUILD/bind-9.12.2-P1/bin/tests/system/rndc'
making all in /tmp/B.apxwPs/BUILD/bind-9.12.2-P1/bin/tests/system/rpz
make[4]: Entering directory '/tmp/B.apxwPs/BUILD/bind-9.12.2-P1/bin/tests/system/rpz'
touch touchfile
make[4]: Leaving directory '/tmp/B.apxwPs/BUILD/bind-9.12.2-P1/bin/tests/system/rpz'
making all in /tmp/B.apxwPs/BUILD/bind-9.12.2-P1/bin/tests/system/rsabigexponent
make[4]: Entering directory '/tmp/B.apxwPs/BUILD/bind-9.12.2-P1/bin/tests/system/rsabigexponent'
touch touchfile
make[4]: Leaving directory '/tmp/B.apxwPs/BUILD/bind-9.12.2-P1/bin/tests/system/rsabigexponent'
making all in /tmp/B.apxwPs/BUILD/bind-9.12.2-P1/bin/tests/system/tkey
make[4]: Entering directory '/tmp/B.apxwPs/BUILD/bind-9.12.2-P1/bin/tests/system/tkey'
touch touchfile
make[4]: Leaving directory '/tmp/B.apxwPs/BUILD/bind-9.12.2-P1/bin/tests/system/tkey'
make[3]: Entering directory '/tmp/B.apxwPs/BUILD/bind-9.12.2-P1/bin/tests/system'
touch touchfile
make[3]: Leaving directory '/tmp/B.apxwPs/BUILD/bind-9.12.2-P1/bin/tests/system'
make[1]: Entering directory '/tmp/B.apxwPs/BUILD/bind-9.12.2-P1/bin'
touch touchfile
make[1]: Leaving directory '/tmp/B.apxwPs/BUILD/bind-9.12.2-P1/bin'
making all in /tmp/B.apxwPs/BUILD/bind-9.12.2-P1/doc
making all in /tmp/B.apxwPs/BUILD/bind-9.12.2-P1/doc/arm
make[2]: Entering directory '/tmp/B.apxwPs/BUILD/bind-9.12.2-P1/doc/arm'
touch touchfile
make[2]: Leaving directory '/tmp/B.apxwPs/BUILD/bind-9.12.2-P1/doc/arm'
making all in /tmp/B.apxwPs/BUILD/bind-9.12.2-P1/doc/misc
make[2]: Entering directory '/tmp/B.apxwPs/BUILD/bind-9.12.2-P1/doc/misc'
touch touchfile
make[2]: Leaving directory '/tmp/B.apxwPs/BUILD/bind-9.12.2-P1/doc/misc'
making all in /tmp/B.apxwPs/BUILD/bind-9.12.2-P1/doc/xsl
make[2]: Entering directory '/tmp/B.apxwPs/BUILD/bind-9.12.2-P1/doc/xsl'
touch touchfile
make[2]: Leaving directory '/tmp/B.apxwPs/BUILD/bind-9.12.2-P1/doc/xsl'
making all in /tmp/B.apxwPs/BUILD/bind-9.12.2-P1/doc/doxygen
make[2]: Entering directory '/tmp/B.apxwPs/BUILD/bind-9.12.2-P1/doc/doxygen'
touch touchfile
make[2]: Leaving directory '/tmp/B.apxwPs/BUILD/bind-9.12.2-P1/doc/doxygen'
making all in /tmp/B.apxwPs/BUILD/bind-9.12.2-P1/doc/tex
make[2]: Entering directory '/tmp/B.apxwPs/BUILD/bind-9.12.2-P1/doc/tex'
touch touchfile
make[2]: Leaving directory '/tmp/B.apxwPs/BUILD/bind-9.12.2-P1/doc/tex'
make[1]: Entering directory '/tmp/B.apxwPs/BUILD/bind-9.12.2-P1/doc'
touch touchfile
make[1]: Leaving directory '/tmp/B.apxwPs/BUILD/bind-9.12.2-P1/doc'
touch touchfile
+ /usr/bin/make -Otarget -j9 test-force
status=0; \
(cd bin/tests && /usr/bin/make  test) || status=1; \
(test -f /tmp/B.apxwPs/BUILD/bind-9.12.2-P1/unit/unittest.sh && \
	/bin/sh /tmp/B.apxwPs/BUILD/bind-9.12.2-P1/unit/unittest.sh) || status=1; \
exit $status
making all in /tmp/B.apxwPs/BUILD/bind-9.12.2-P1/bin/tests/system/dlzexternal
make[3]: Entering directory '/tmp/B.apxwPs/BUILD/bind-9.12.2-P1/bin/tests/system/dlzexternal'
touch touchfile
make[3]: Leaving directory '/tmp/B.apxwPs/BUILD/bind-9.12.2-P1/bin/tests/system/dlzexternal'
making all in /tmp/B.apxwPs/BUILD/bind-9.12.2-P1/bin/tests/system/dyndb
making all in /tmp/B.apxwPs/BUILD/bind-9.12.2-P1/bin/tests/system/dyndb/driver
make[4]: Entering directory '/tmp/B.apxwPs/BUILD/bind-9.12.2-P1/bin/tests/system/dyndb/driver'
touch touchfile
make[4]: Leaving directory '/tmp/B.apxwPs/BUILD/bind-9.12.2-P1/bin/tests/system/dyndb/driver'
make[3]: Entering directory '/tmp/B.apxwPs/BUILD/bind-9.12.2-P1/bin/tests/system/dyndb'
touch touchfile
make[3]: Leaving directory '/tmp/B.apxwPs/BUILD/bind-9.12.2-P1/bin/tests/system/dyndb'
making all in /tmp/B.apxwPs/BUILD/bind-9.12.2-P1/bin/tests/system/pipelined
make[3]: Entering directory '/tmp/B.apxwPs/BUILD/bind-9.12.2-P1/bin/tests/system/pipelined'
touch touchfile
make[3]: Leaving directory '/tmp/B.apxwPs/BUILD/bind-9.12.2-P1/bin/tests/system/pipelined'
making all in /tmp/B.apxwPs/BUILD/bind-9.12.2-P1/bin/tests/system/rndc
make[3]: Entering directory '/tmp/B.apxwPs/BUILD/bind-9.12.2-P1/bin/tests/system/rndc'
touch touchfile
make[3]: Leaving directory '/tmp/B.apxwPs/BUILD/bind-9.12.2-P1/bin/tests/system/rndc'
making all in /tmp/B.apxwPs/BUILD/bind-9.12.2-P1/bin/tests/system/rpz
make[3]: Entering directory '/tmp/B.apxwPs/BUILD/bind-9.12.2-P1/bin/tests/system/rpz'
touch touchfile
make[3]: Leaving directory '/tmp/B.apxwPs/BUILD/bind-9.12.2-P1/bin/tests/system/rpz'
making all in /tmp/B.apxwPs/BUILD/bind-9.12.2-P1/bin/tests/system/rsabigexponent
make[3]: Entering directory '/tmp/B.apxwPs/BUILD/bind-9.12.2-P1/bin/tests/system/rsabigexponent'
touch touchfile
make[3]: Leaving directory '/tmp/B.apxwPs/BUILD/bind-9.12.2-P1/bin/tests/system/rsabigexponent'
making all in /tmp/B.apxwPs/BUILD/bind-9.12.2-P1/bin/tests/system/tkey
make[3]: Entering directory '/tmp/B.apxwPs/BUILD/bind-9.12.2-P1/bin/tests/system/tkey'
touch touchfile
make[3]: Leaving directory '/tmp/B.apxwPs/BUILD/bind-9.12.2-P1/bin/tests/system/tkey'
make[3]: Entering directory '/tmp/B.apxwPs/BUILD/bind-9.12.2-P1/bin/tests/system'
I:NOTE: System tests were skipped because they require that the
I:      IP addresses 10.53.0.1 through 10.53.0.8 be configured
I:      as alias addresses on the loopback interface.  Please run
I:      bin/tests/system/ifconfig.sh up as root to configure them.
make[3]: *** [parallel.mk:4: check_interfaces] Error 1
make[3]: Leaving directory '/tmp/B.apxwPs/BUILD/bind-9.12.2-P1/bin/tests/system'
make[2]: *** [Makefile:512: test] Error 2
make[1]: *** [Makefile:483: test] Error 2
make: *** [Makefile:451: test-force] Error 1
error: Bad exit status from /tmp/B.apxwPs/BUILD/tmp/rpm-tmp.51854 (%build)


RPM build errors:
    Bad exit status from /tmp/B.apxwPs/BUILD/tmp/rpm-tmp.51854 (%build)
ended at: Thu Aug  9 01:43:12 2018, done in 0:02:41.032429
error: No files produced.
mesg: ttyname failed: Inappropriate ioctl for device
+ chmod -R u+rwX /tmp/B.apxwPs/BUILD
+ rm -rf /tmp/B.apxwPs/tmp /tmp/B.apxwPs/BUILD
mesg: ttyname failed: Inappropriate ioctl for device
+ rm -rf /tmp/B.apxwPs
Begin-PLD-Builder-Info
Build-Time: user:129.01s sys:46.13s real:166.56s (faults io:23 non-io:18519928)

End-PLD-Builder-Info
[Back to list of logs] [View rpm -qa of builder]