FailedOk

th/SRPMS[OK]
th/x32[OK]
th/i686[OK]
th/x86_64[OK]

ac/SRPMS[OK]
ac/i386[OK]
ac/i586[OK]
ac/i686[OK]
ac/alpha[OK]
ac/amd64[OK]
ac/athlon[OK]
ac/ppc[OK]
ac/sparc[OK]
ac/sparc64[OK]

Advanced Search
main()
Powered by PLD Linux
(c) 2002-2019 PLD Team
$Revision: 1.37 $
Powered by /dev/zero.
Your IP: 35.171.146.16

camwire f9260de5-6ebc-47c7-b395-e1b361b100b4

Status:Failed
Source URL:ftp://buildlogs.pld-linux.org/th/x86_64/FAIL/camwire,f9260de5-6ebc-47c7-b395-e1b361b100b4.bz2
text/plain URL:View!
rpm -qa of builder:View!
Date:2019/08/07 21:37:46
Runtime:0:00:02.206126

Toc:

  • prep
  • Executing(%prep): /bin/sh -e /tmp/B.oGO0Yo/BUILD/tmp/rpm-tmp.77611
  • build
  • Executing(%build): /bin/sh -e /tmp/B.oGO0Yo/BUILD/tmp/rpm-tmp.77611
  • error 1
  • /tmp/B.oGO0Yo/BUILD/camwire2-1.9.5-Source/camwire/camwire_handle.h:81:20: error: inline function 'camwire_bus_get_userdata' declared but never defined [-Werror]
  • error 2
  • /tmp/B.oGO0Yo/BUILD/camwire2-1.9.5-Source/camwire/camwire_handle.h:77:22: error: inline function 'camwire_handle_get_camera' declared but never defined [-Werror]
  • error 3
  • make[2]: *** [camwire/CMakeFiles/camwire_static.dir/build.make:79: camwire/CMakeFiles/camwire_static.dir/camwire.c.o] Error 1
  • error 4
  • make[1]: *** [CMakeFiles/Makefile2:96: camwire/CMakeFiles/camwire_static.dir/all] Error 2
  • error 5
  • error: Bad exit status from /tmp/B.oGO0Yo/BUILD/tmp/rpm-tmp.77611 (%build)
  • error 6
  • RPM build errors:
  • error 7
  • error: No files produced.

Content:

request from: qboosh
checking if we should skip the build
started at: Wed Aug  7 21:37:41 2019
killing old processes on a builder
sending signal 9 to pid -1
Killed
cleaning up /tmp
fetching https://srcbuilder.pld-linux.org/th//srpms/f9260de5-6ebc-47c7-b395-e1b361b100b4/camwire-1.9.5-1.src.rpm
fetched 163567 bytes, 330.1 K/s
installing srpm: camwire-1.9.5-1.src.rpm
+ install -d /tmp/B.oGO0Yo/BUILD /tmp/B.oGO0Yo/RPMS
+ LC_ALL=en_US.UTF-8
+ rpm -qp --changelog camwire-1.9.5-1.src.rpm
* Wed Aug 07 2019 PLD Linux Team <feedback@pld-linux.org>
- For complete changelog see: http://git.pld-linux.org/?p=packages/camwire.git;a=log;h=master
+ rpm -Uhv --nodeps --define '_topdir /tmp/B.oGO0Yo' --define '_specdir %{_topdir}' --define '_sourcedir %{_specdir}' --define '_rpmdir %{_topdir}/RPMS' --define '_builddir %{_topdir}/BUILD' camwire-1.9.5-1.src.rpm Preparing... ################################################## camwire ################################################## + rm -f camwire-1.9.5-1.src.rpm + install -m 700 -d /tmp/B.oGO0Yo/BUILD/tmp + TMPDIR=/tmp/B.oGO0Yo/BUILD/tmp + exec nice -n 0 rpmbuild -bp --short-circuit --nodeps --define '_topdir /tmp/B.oGO0Yo' --define '_specdir %{_topdir}' --define '_sourcedir %{_specdir}' --define '_rpmdir %{_topdir}/RPMS' --define '_builddir %{_topdir}/BUILD' --target x86_64-pld-linux --define 'prep exit 0' /tmp/B.oGO0Yo/camwire.spec Building target platforms: x86_64-pld-linux checking BuildConflict-ing packages no BuildConflicts found checking BR rpm: Building target platforms: x86_64-pld-linux no BR needed building RPM using: set -ex; : build-id: f9260de5-6ebc-47c7-b395-e1b361b100b4; TMPDIR=/tmp/B.oGO0Yo/BUILD/tmp exec nice -n 0 rpmbuild -bb --define '_smp_mflags -j9' --define '_make_opts -Otarget' --define '_pld_builder 1' --define '_topdir /tmp/B.oGO0Yo' --define '_specdir %{_topdir}' --define '_sourcedir %{_specdir}' --define '_rpmdir %{_topdir}/RPMS' --define '_builddir %{_topdir}/BUILD' --target x86_64-pld-linux /tmp/B.oGO0Yo/camwire.spec + : build-id: f9260de5-6ebc-47c7-b395-e1b361b100b4 + TMPDIR=/tmp/B.oGO0Yo/BUILD/tmp + exec nice -n 0 rpmbuild -bb --define '_smp_mflags -j9' --define '_make_opts -Otarget' --define '_pld_builder 1' --define '_topdir /tmp/B.oGO0Yo' --define '_specdir %{_topdir}' --define '_sourcedir %{_specdir}' --define '_rpmdir %{_topdir}/RPMS' --define '_builddir %{_topdir}/BUILD' --target x86_64-pld-linux /tmp/B.oGO0Yo/camwire.spec Building target platforms: x86_64-pld-linux Executing(%prep): /bin/sh -e /tmp/B.oGO0Yo/BUILD/tmp/rpm-tmp.77611 + umask 022 + cd /tmp/B.oGO0Yo/BUILD + cd /tmp/B.oGO0Yo/BUILD + rm -rf camwire2-1.9.5-Source + /usr/bin/gzip -dc /tmp/B.oGO0Yo/camwire2-1.9.5-Source.tar.gz + /bin/tar -xf - + STATUS=0 + '[' 0 -ne 0 ']' + cd camwire2-1.9.5-Source + /bin/id -u + '[' 1000 '=' 0 ']' + /bin/id -u + '[' 1000 '=' 0 ']' + /bin/chmod -Rf a+rX,u+w,g-w,o-w . + echo 'Patch #0 (camwire-link.patch):' Patch #0 (camwire-link.patch): + '[' -f /tmp/B.oGO0Yo/camwire-link.patch ']' + /bin/cat /tmp/B.oGO0Yo/camwire-link.patch + /usr/bin/patch -s -p1 + echo 'Patch #1 (camwire-etc.patch):' Patch #1 (camwire-etc.patch): + '[' -f /tmp/B.oGO0Yo/camwire-etc.patch ']' + /bin/cat /tmp/B.oGO0Yo/camwire-etc.patch + /usr/bin/patch -s -p1 + echo 'Patch #2 (camwire-lib.patch):' Patch #2 (camwire-lib.patch): + '[' -f /tmp/B.oGO0Yo/camwire-lib.patch ']' + /bin/cat /tmp/B.oGO0Yo/camwire-lib.patch + /usr/bin/patch -s -p1 + exit 0 Executing(%build): /bin/sh -e /tmp/B.oGO0Yo/BUILD/tmp/rpm-tmp.77611 TMP=/home/users/builder/tmp HOME=/home/users/builder PATH=/home/users/builder/GNUstep/Tools:/usr/local/bin:/usr/bin:/bin:/home/users/builder/bin TMPDIR=/tmp/B.oGO0Yo/BUILD/tmp + umask 022 + cd /tmp/B.oGO0Yo/BUILD + cd camwire2-1.9.5-Source + CFLAGS='-O2 -fwrapv -pipe -Wformat -Werror=format-security -gdwarf-4 -fno-debug-types-section -fvar-tracking-assignments -g2 -Wp,-D_FORTIFY_SOURCE=2 -fstack-protector-strong --param=ssp-buffer-size=4 -Werror=trampolines -fPIC -march=x86-64 -gdwarf-4 -fno-debug-types-section -fvar-tracking-assignments -g2 -Wno-unused-result' + CC=x86_64-pld-linux-gcc CXX=x86_64-pld-linux-g++ CPPFLAGS='' /usr/bin/cmake -Wno-dev '-DCMAKE_VERBOSE_MAKEFILE=ON' '-DCMAKE_BUILD_TYPE=PLD' '-DCMAKE_INSTALL_BINDIR:PATH=/usr/bin' '-DCMAKE_INSTALL_SBINDIR:PATH=/usr/sbin' '-DCMAKE_INSTALL_LIBEXECDIR:PATH=/usr/libexec' '-DCMAKE_INSTALL_SYSCONFDIR:PATH=/etc' '-DCMAKE_INSTALL_SHAREDSTATEDIRPATH:PATH=/var/lib' '-DCMAKE_INSTALL_LOCALSTATEDIRPATH:PATH=/var' '-DCMAKE_INSTALL_LIBDIR:PATH=/usr/lib64' '-DCMAKE_INSTALL_INCLUDEDIR:PATH=/usr/include' '-DCMAKE_INSTALL_OLDINCLUDEDIR:PATH=/usr/include' '-DCMAKE_INSTALL_DATAROOTDIR:PATH=/usr/share' '-DCMAKE_INSTALL_DATADIR:PATH=/usr/share' '-DCMAKE_INSTALL_INFODIR:PATH=/usr/share/info' '-DCMAKE_INSTALL_LOCALEDIR:PATH=/usr/share/locale' '-DCMAKE_INSTALL_MANDIR:PATH=/usr/share/man' '-DCMAKE_INSTALL_DOCDIR:PATH=/usr/share/doc' '-DCMAKE_INSTALL_PREFIX:PATH=/usr' '-DSYSCONF_INSTALL_DIR:PATH=/etc' '-DCMAKE_CXX_FLAGS_PLD=-O2 -fwrapv -pipe -Wformat -Werror=format-security -gdwarf-4 -fno-debug-types-section -fvar-tracking-assignments -g2 -Wp,-D_FORTIFY_SOURCE=2 -fstack-protector-strong --param=ssp-buffer-size=4 -Werror=trampolines -fPIC -march=x86-64 -gdwarf-4 -fno-debug-types-section -fvar-tracking-assignments -g2 -DNDEBUG -DQT_NO_DEBUG' '-DCMAKE_C_FLAGS_PLD=-O2 -fwrapv -pipe -Wformat -Werror=format-security -gdwarf-4 -fno-debug-types-section -fvar-tracking-assignments -g2 -Wp,-D_FORTIFY_SOURCE=2 -fstack-protector-strong --param=ssp-buffer-size=4 -Werror=trampolines -fPIC -march=x86-64 -gdwarf-4 -fno-debug-types-section -fvar-tracking-assignments -g2 -Wno-unused-result' '-DCMAKE_Fortran_FLAGS_PLD=-O2 -fwrapv -pipe -Wformat -Werror=format-security -gdwarf-4 -fno-debug-types-section -fvar-tracking-assignments -g2 -Wp,-D_FORTIFY_SOURCE=2 -fstack-protector-strong --param=ssp-buffer-size=4 -Werror=trampolines -fPIC -march=x86-64 -gdwarf-4 -fno-debug-types-section -fvar-tracking-assignments -g2 -Wno-unused-result' '-DCMAKE_EXE_LINKER_FLAGS_PLD=-Wl,--as-needed -Wl,--no-copy-dt-needed-entries -Wl,-z,relro -Wl,-z,combreloc ' '-DCMAKE_SHARED_LINKER_FLAGS_PLD=-Wl,--as-needed -Wl,--no-copy-dt-needed-entries -Wl,-z,relro -Wl,-z,combreloc ' '-DCMAKE_MODULE_LINKER_FLAGS_PLD=-Wl,--as-needed -Wl,--no-copy-dt-needed-entries -Wl,-z,relro -Wl,-z,combreloc ' '-DLIB_SUFFIX=64' '-DBUILD_SHARED_LIBS:BOOL=ON' CMake Warning: No source or binary directory provided. Both will be assumed to be the same as the current working directory, but note that this warning will become a fatal error in future CMake releases. -- The C compiler identification is GNU 8.3.0 -- Check for working C compiler: /usr/bin/x86_64-pld-linux-gcc -- Check for working C compiler: /usr/bin/x86_64-pld-linux-gcc -- works -- Detecting C compiler ABI info -- Detecting C compiler ABI info - done -- Detecting C compile features -- Detecting C compile features - done -- Configuring done -- Generating done CMake Warning: Manually-specified variables were not used by the project: CMAKE_CXX_FLAGS_PLD CMAKE_Fortran_FLAGS_PLD CMAKE_INSTALL_BINDIR CMAKE_INSTALL_DATADIR CMAKE_INSTALL_DATAROOTDIR CMAKE_INSTALL_DOCDIR CMAKE_INSTALL_INCLUDEDIR CMAKE_INSTALL_INFODIR CMAKE_INSTALL_LIBDIR CMAKE_INSTALL_LIBEXECDIR CMAKE_INSTALL_LOCALEDIR CMAKE_INSTALL_LOCALSTATEDIRPATH CMAKE_INSTALL_MANDIR CMAKE_INSTALL_OLDINCLUDEDIR CMAKE_INSTALL_SBINDIR CMAKE_INSTALL_SHAREDSTATEDIRPATH CMAKE_INSTALL_SYSCONFDIR SYSCONF_INSTALL_DIR -- Build files have been written to: /tmp/B.oGO0Yo/BUILD/camwire2-1.9.5-Source + /usr/bin/make -Otarget -j9 -j1 /usr/bin/cmake -S/tmp/B.oGO0Yo/BUILD/camwire2-1.9.5-Source -B/tmp/B.oGO0Yo/BUILD/camwire2-1.9.5-Source --check-build-system CMakeFiles/Makefile.cmake 0 /usr/bin/cmake -E cmake_progress_start /tmp/B.oGO0Yo/BUILD/camwire2-1.9.5-Source/CMakeFiles /tmp/B.oGO0Yo/BUILD/camwire2-1.9.5-Source/CMakeFiles/progress.marks /usr/bin/make -f CMakeFiles/Makefile2 all make[1]: Entering directory '/tmp/B.oGO0Yo/BUILD/camwire2-1.9.5-Source' /usr/bin/make -f camwire/CMakeFiles/camwire_static.dir/build.make camwire/CMakeFiles/camwire_static.dir/depend make[2]: Entering directory '/tmp/B.oGO0Yo/BUILD/camwire2-1.9.5-Source' cd /tmp/B.oGO0Yo/BUILD/camwire2-1.9.5-Source && /usr/bin/cmake -E cmake_depends "Unix Makefiles" /tmp/B.oGO0Yo/BUILD/camwire2-1.9.5-Source /tmp/B.oGO0Yo/BUILD/camwire2-1.9.5-Source/camwire /tmp/B.oGO0Yo/BUILD/camwire2-1.9.5-Source /tmp/B.oGO0Yo/BUILD/camwire2-1.9.5-Source/camwire /tmp/B.oGO0Yo/BUILD/camwire2-1.9.5-Source/camwire/CMakeFiles/camwire_static.dir/DependInfo.cmake --color= Scanning dependencies of target camwire_static make[2]: Leaving directory '/tmp/B.oGO0Yo/BUILD/camwire2-1.9.5-Source' /usr/bin/make -f camwire/CMakeFiles/camwire_static.dir/build.make camwire/CMakeFiles/camwire_static.dir/build make[2]: Entering directory '/tmp/B.oGO0Yo/BUILD/camwire2-1.9.5-Source' [ 5%] Building C object camwire/CMakeFiles/camwire_static.dir/camwirebus.c.o cd /tmp/B.oGO0Yo/BUILD/camwire2-1.9.5-Source/camwire && /usr/bin/x86_64-pld-linux-gcc -I/tmp/B.oGO0Yo/BUILD/camwire2-1.9.5-Source -Wall -Werror -O2 -fwrapv -pipe -Wformat -Werror=format-security -gdwarf-4 -fno-debug-types-section -fvar-tracking-assignments -g2 -Wp,-D_FORTIFY_SOURCE=2 -fstack-protector-strong --param=ssp-buffer-size=4 -Werror=trampolines -fPIC -march=x86-64 -gdwarf-4 -fno-debug-types-section -fvar-tracking-assignments -g2 -Wno-unused-result -o CMakeFiles/camwire_static.dir/camwirebus.c.o -c /tmp/B.oGO0Yo/BUILD/camwire2-1.9.5-Source/camwire/camwirebus.c [ 10%] Building C object camwire/CMakeFiles/camwire_static.dir/camwire.c.o cd /tmp/B.oGO0Yo/BUILD/camwire2-1.9.5-Source/camwire && /usr/bin/x86_64-pld-linux-gcc -I/tmp/B.oGO0Yo/BUILD/camwire2-1.9.5-Source -Wall -Werror -O2 -fwrapv -pipe -Wformat -Werror=format-security -gdwarf-4 -fno-debug-types-section -fvar-tracking-assignments -g2 -Wp,-D_FORTIFY_SOURCE=2 -fstack-protector-strong --param=ssp-buffer-size=4 -Werror=trampolines -fPIC -march=x86-64 -gdwarf-4 -fno-debug-types-section -fvar-tracking-assignments -g2 -Wno-unused-result -o CMakeFiles/camwire_static.dir/camwire.c.o -c /tmp/B.oGO0Yo/BUILD/camwire2-1.9.5-Source/camwire/camwire.c In file included from /tmp/B.oGO0Yo/BUILD/camwire2-1.9.5-Source/camwire/camwire.c:51: /tmp/B.oGO0Yo/BUILD/camwire2-1.9.5-Source/camwire/camwire_handle.h:81:20: error: inline function 'camwire_bus_get_userdata' declared but never defined [-Werror] inline User_handle camwire_bus_get_userdata(const Camwire_handle c_handle); ^~~~~~~~~~~~~~~~~~~~~~~~ /tmp/B.oGO0Yo/BUILD/camwire2-1.9.5-Source/camwire/camwire_handle.h:77:22: error: inline function 'camwire_handle_get_camera' declared but never defined [-Werror] inline Camera_handle camwire_handle_get_camera(const Camwire_handle c_handle); ^~~~~~~~~~~~~~~~~~~~~~~~~ cc1: all warnings being treated as errors make[2]: *** [camwire/CMakeFiles/camwire_static.dir/build.make:79: camwire/CMakeFiles/camwire_static.dir/camwire.c.o] Error 1 make[2]: Leaving directory '/tmp/B.oGO0Yo/BUILD/camwire2-1.9.5-Source' make[1]: *** [CMakeFiles/Makefile2:96: camwire/CMakeFiles/camwire_static.dir/all] Error 2 make[1]: Leaving directory '/tmp/B.oGO0Yo/BUILD/camwire2-1.9.5-Source' make: *** [Makefile:155: all] Error 2 error: Bad exit status from /tmp/B.oGO0Yo/BUILD/tmp/rpm-tmp.77611 (%build) RPM build errors: Bad exit status from /tmp/B.oGO0Yo/BUILD/tmp/rpm-tmp.77611 (%build) ended at: Wed Aug 7 21:37:45 2019, done in 0:00:02.206126 error: No files produced. + chmod -R u+rwX /tmp/B.oGO0Yo/BUILD + rm -rf /tmp/B.oGO0Yo/tmp /tmp/B.oGO0Yo/BUILD + rm -rf /tmp/B.oGO0Yo Begin-PLD-Builder-Info Build-Time: user:2.64s sys:0.38s real:4.55s (faults io:0 non-io:195600) End-PLD-Builder-Info
[Back to list of logs] [View rpm -qa of builder]