FailedOk

th/SRPMS[OK]
th/x32[OK]
th/i686[OK]
th/x86_64[OK]

ac/SRPMS[OK]
ac/i386[OK]
ac/i586[OK]
ac/i686[OK]
ac/alpha[OK]
ac/amd64[OK]
ac/athlon[OK]
ac/ppc[OK]
ac/sparc[OK]
ac/sparc64[OK]

Advanced Search
main()
Powered by PLD Linux
(c) 2002-2019 PLD Team
$Revision: 1.37 $
Powered by /dev/drzewo.
Your IP: 54.243.17.113

cdcat b21e100a-4111-44bd-a5ce-8df8a1e7082a

Status:Failed
Source URL:ftp://buildlogs.pld-linux.org/th/x86_64/FAIL/cdcat,b21e100a-4111-44bd-a5ce-8df8a1e7082a.bz2
text/plain URL:View!
rpm -qa of builder:View!
Date:2018/12/31 09:33:16
Runtime:0:00:23.090934

Toc:

  • prep
  • Executing(%prep): /bin/sh -e /tmp/B.QkLCUA/BUILD/tmp/rpm-tmp.60185
  • build
  • Executing(%build): /bin/sh -e /tmp/B.QkLCUA/BUILD/tmp/rpm-tmp.60185
  • error 1
  • wdbfile.h:34:8: error: 'byte' does not name a type; did you mean 'Byte'?
  • error 2
  • wdbfile.h:34:8: error: 'byte' does not name a type; did you mean 'Byte'?
  • error 3
  • wdbfile.h:34:8: error: 'byte' does not name a type; did you mean 'Byte'?
  • error 4
  • wdbfile.h:34:8: error: 'byte' does not name a type; did you mean 'Byte'?
  • error 5
  • error: Bad exit status from /tmp/B.QkLCUA/BUILD/tmp/rpm-tmp.60185 (%build)
  • error 6
  • RPM build errors:
  • error 7
  • error: No files produced.

Content:

request from: qboosh
checking if we should skip the build
started at: Mon Dec 31 09:32:50 2018
killing old processes on a builder
sending signal 9 to pid -1
Killed
cleaning up /tmp
fetching https://srcbuilder.pld-linux.org/th//srpms/b21e100a-4111-44bd-a5ce-8df8a1e7082a/cdcat-2.3.1-2.src.rpm
fetched 441124 bytes, 924.0 K/s
installing srpm: cdcat-2.3.1-2.src.rpm
+ install -d /tmp/B.QkLCUA/BUILD /tmp/B.QkLCUA/RPMS
+ LC_ALL=en_US.UTF-8
+ rpm -qp --changelog cdcat-2.3.1-2.src.rpm
* Mon Dec 31 2018 PLD Linux Team <feedback@pld-linux.org>
- For complete changelog see: http://git.pld-linux.org/?p=packages/cdcat.git;a=log;h=master
+ rpm -Uhv --nodeps --define '_topdir /tmp/B.QkLCUA' --define '_specdir %{_topdir}' --define '_sourcedir %{_specdir}' --define '_rpmdir %{_topdir}/RPMS' --define '_builddir %{_topdir}/BUILD' cdcat-2.3.1-2.src.rpm Preparing... ################################################## cdcat ################################################## + rm -f cdcat-2.3.1-2.src.rpm + install -m 700 -d /tmp/B.QkLCUA/BUILD/tmp + TMPDIR=/tmp/B.QkLCUA/BUILD/tmp + exec nice -n 0 rpmbuild -bp --short-circuit --nodeps --define '_topdir /tmp/B.QkLCUA' --define '_specdir %{_topdir}' --define '_sourcedir %{_specdir}' --define '_rpmdir %{_topdir}/RPMS' --define '_builddir %{_topdir}/BUILD' --target x86_64-pld-linux --define 'prep exit 0' /tmp/B.QkLCUA/cdcat.spec Building target platforms: x86_64-pld-linux checking BuildConflict-ing packages no BuildConflicts found checking BR rpm: Building target platforms: x86_64-pld-linux no BR needed building RPM using: set -ex; : build-id: b21e100a-4111-44bd-a5ce-8df8a1e7082a; TMPDIR=/tmp/B.QkLCUA/BUILD/tmp exec nice -n 0 rpmbuild -bb --define '_smp_mflags -j9' --define '_make_opts -Otarget' --define '_pld_builder 1' --define '_topdir /tmp/B.QkLCUA' --define '_specdir %{_topdir}' --define '_sourcedir %{_specdir}' --define '_rpmdir %{_topdir}/RPMS' --define '_builddir %{_topdir}/BUILD' --target x86_64-pld-linux /tmp/B.QkLCUA/cdcat.spec + : build-id: b21e100a-4111-44bd-a5ce-8df8a1e7082a + TMPDIR=/tmp/B.QkLCUA/BUILD/tmp + exec nice -n 0 rpmbuild -bb --define '_smp_mflags -j9' --define '_make_opts -Otarget' --define '_pld_builder 1' --define '_topdir /tmp/B.QkLCUA' --define '_specdir %{_topdir}' --define '_sourcedir %{_specdir}' --define '_rpmdir %{_topdir}/RPMS' --define '_builddir %{_topdir}/BUILD' --target x86_64-pld-linux /tmp/B.QkLCUA/cdcat.spec Building target platforms: x86_64-pld-linux Executing(%prep): /bin/sh -e /tmp/B.QkLCUA/BUILD/tmp/rpm-tmp.60185 + umask 022 + cd /tmp/B.QkLCUA/BUILD + cd /tmp/B.QkLCUA/BUILD + rm -rf cdcat-2.3.1 + /usr/bin/bzip2 -dc /tmp/B.QkLCUA/cdcat-2.3.1.tar.bz2 + /bin/tar -xf - + STATUS=0 + '[' 0 -ne 0 ']' + cd cdcat-2.3.1 + /bin/id -u + '[' 1000 '=' 0 ']' + /bin/id -u + '[' 1000 '=' 0 ']' + /bin/chmod -Rf a+rX,u+w,g-w,o-w . + echo 'Patch #0 (cryptopp.patch):' Patch #0 (cryptopp.patch): + '[' -f /tmp/B.QkLCUA/cryptopp.patch ']' + /bin/cat /tmp/B.QkLCUA/cryptopp.patch + /usr/bin/patch -s -p1 + /bin/sed -i $'s,lrelease,lrelease-qt4,g ;\ts,/usr/local,/usr,g ;\ts,\\(distfiles.path =\\).*,\\1 /usr/share/doc/cdcat-2.3.1,' src/cdcat.pro + /bin/sed -i 's@\.\./COPYING@../README_IMPORT ../README_IMPORT.DE ../README_IMPORT.HU@' src/cdcat.pro + exit 0 Executing(%build): /bin/sh -e /tmp/B.QkLCUA/BUILD/tmp/rpm-tmp.60185 TMP=/home/users/builder/tmp HOME=/home/users/builder PATH=/home/users/builder/GNUstep/Tools:/usr/local/bin:/usr/bin:/bin:/home/users/builder/bin TMPDIR=/tmp/B.QkLCUA/BUILD/tmp + umask 022 + cd /tmp/B.QkLCUA/BUILD + cd cdcat-2.3.1 + cd src + export 'QTDIR=/usr' + qmake-qt4 'QMAKE_CXX=x86_64-pld-linux-g++' 'QMAKE_LINK=x86_64-pld-linux-g++' 'QMAKE_CXXFLAGS_RELEASE=-O2 -fwrapv -pipe -Wformat -Werror=format-security -gdwarf-4 -fno-debug-types-section -fvar-tracking-assignments -g2 -Wp,-D_FORTIFY_SOURCE=2 -fstack-protector-strong --param=ssp-buffer-size=4 -fPIC -march=x86-64 -gdwarf-4 -fno-debug-types-section -fvar-tracking-assignments -g2 ' cdcat.pro + /usr/bin/make -Otarget -j9 /usr/lib64/qt4/bin/uic help.ui -o ui_help.h x86_64-pld-linux-g++ -c -pipe -O2 -fwrapv -pipe -Wformat -Werror=format-security -gdwarf-4 -fno-debug-types-section -fvar-tracking-assignments -g2 -Wp,-D_FORTIFY_SOURCE=2 -fstack-protector-strong --param=ssp-buffer-size=4 -fPIC -march=x86-64 -gdwarf-4 -fno-debug-types-section -fvar-tracking-assignments -g2 -D_REENTRANT -Wall -W -DUSE_LIB7ZIP -DCATALOG_ENCRYPTION -DQT_NO_DEBUG -DQT_XML_LIB -DQT_GUI_LIB -DQT_CORE_LIB -I/usr/share/qt4/mkspecs/linux-g++ -I. -I/usr/include/qt4/QtCore -I/usr/include/qt4/QtGui -I/usr/include/qt4/QtXml -I/usr/include/qt4 -I. -Imoc_files -o obj_files/dirview.o dirview.cpp dirview.cpp: In member function 'void DirectoryView::setDir(const QString&)': dirview.cpp:310:29: warning: ignoring return value of 'QStringRef QString::leftRef(int) const', declared with attribute warn_unused_result [-Wunused-result] s.leftRef ( s.size() - 1 ); ^ In file included from /usr/include/qt4/QtCore/qdir.h:45, from dirview.cpp:10: /usr/include/qt4/QtCore/qstring.h:230:16: note: declared here QStringRef leftRef(int n) const Q_REQUIRED_RESULT; ^~~~~~~ In file included from dirview.cpp:29: cdcat.h: At global scope: cdcat.h:38:21: warning: 'translator' defined but not used [-Wunused-variable] static QTranslator *translator; ^~~~~~~~~~ In file included from cdcat.h:14, from dirview.cpp:29: config.h:280:14: warning: 'DEBUG_INFO_ENABLED' defined but not used [-Wunused-variable] static bool *DEBUG_INFO_ENABLED; ^~~~~~~~~~~~~~~~~~ x86_64-pld-linux-g++ -c -pipe -O2 -fwrapv -pipe -Wformat -Werror=format-security -gdwarf-4 -fno-debug-types-section -fvar-tracking-assignments -g2 -Wp,-D_FORTIFY_SOURCE=2 -fstack-protector-strong --param=ssp-buffer-size=4 -fPIC -march=x86-64 -gdwarf-4 -fno-debug-types-section -fvar-tracking-assignments -g2 -D_REENTRANT -Wall -W -DUSE_LIB7ZIP -DCATALOG_ENCRYPTION -DQT_NO_DEBUG -DQT_XML_LIB -DQT_GUI_LIB -DQT_CORE_LIB -I/usr/share/qt4/mkspecs/linux-g++ -I. -I/usr/include/qt4/QtCore -I/usr/include/qt4/QtGui -I/usr/include/qt4/QtXml -I/usr/include/qt4 -I. -Imoc_files -o obj_files/cdcat.o cdcat.cpp x86_64-pld-linux-g++ -c -pipe -O2 -fwrapv -pipe -Wformat -Werror=format-security -gdwarf-4 -fno-debug-types-section -fvar-tracking-assignments -g2 -Wp,-D_FORTIFY_SOURCE=2 -fstack-protector-strong --param=ssp-buffer-size=4 -fPIC -march=x86-64 -gdwarf-4 -fno-debug-types-section -fvar-tracking-assignments -g2 -D_REENTRANT -Wall -W -DUSE_LIB7ZIP -DCATALOG_ENCRYPTION -DQT_NO_DEBUG -DQT_XML_LIB -DQT_GUI_LIB -DQT_CORE_LIB -I/usr/share/qt4/mkspecs/linux-g++ -I. -I/usr/include/qt4/QtCore -I/usr/include/qt4/QtGui -I/usr/include/qt4/QtXml -I/usr/include/qt4 -I. -Imoc_files -o obj_files/dbase.o dbase.cpp In file included from dbase.cpp:32: wdbfile.h:34:8: error: 'byte' does not name a type; did you mean 'Byte'? static byte iv[CryptoPP::Blowfish::BLOCKSIZE]; ^~~~ Byte dbase.cpp:1570:70: warning: cast between incompatible function types from 'int (*)(gzFile)' {aka 'int (*)(gzFile_s*)'} to 'closefunc_t' {aka 'int (*)(int)'} [-Wcast-function-type] tartype_t gztype = { ( openfunc_t ) gzopen_frontend, ( closefunc_t ) gzclose, ( readfunc_t ) gzread, ( writefunc_t ) gzwrite}; ^~~~~~~ dbase.cpp:1570:94: warning: cast between incompatible function types from 'int (*)(gzFile, voidp, unsigned int)' {aka 'int (*)(gzFile_s*, void*, unsigned int)'} to 'readfunc_t' {aka 'long int (*)(int, void*, long unsigned int)'} [-Wcast-function-type] tartype_t gztype = { ( openfunc_t ) gzopen_frontend, ( closefunc_t ) gzclose, ( readfunc_t ) gzread, ( writefunc_t ) gzwrite}; ^~~~~~ dbase.cpp:1570:118: warning: cast between incompatible function types from 'int (*)(gzFile, voidpc, unsigned int)' {aka 'int (*)(gzFile_s*, const void*, unsigned int)'} to 'writefunc_t' {aka 'long int (*)(int, const void*, long unsigned int)'} [-Wcast-function-type] tartype_t gztype = { ( openfunc_t ) gzopen_frontend, ( closefunc_t ) gzclose, ( readfunc_t ) gzread, ( writefunc_t ) gzwrite}; ^~~~~~~ dbase.cpp:1571:71: warning: cast between incompatible function types from 'void (*)(BZFILE*)' {aka 'void (*)(void*)'} to 'closefunc_t' {aka 'int (*)(int)'} [-Wcast-function-type] tartype_t bztype = { ( openfunc_t ) bz2open_frontend, ( closefunc_t ) BZ2_bzclose, ( readfunc_t ) BZ2_bzread, ( writefunc_t ) BZ2_bzwrite}; ^~~~~~~~~~~ dbase.cpp:1571:99: warning: cast between incompatible function types from 'int (*)(BZFILE*, void*, int)' {aka 'int (*)(void*, void*, int)'} to 'readfunc_t' {aka 'long int (*)(int, void*, long unsigned int)'} [-Wcast-function-type] tartype_t bztype = { ( openfunc_t ) bz2open_frontend, ( closefunc_t ) BZ2_bzclose, ( readfunc_t ) BZ2_bzread, ( writefunc_t ) BZ2_bzwrite}; ^~~~~~~~~~ dbase.cpp:1571:127: warning: cast between incompatible function types from 'int (*)(BZFILE*, void*, int)' {aka 'int (*)(void*, void*, int)'} to 'writefunc_t' {aka 'long int (*)(int, const void*, long unsigned int)'} [-Wcast-function-type] tartype_t bztype = { ( openfunc_t ) bz2open_frontend, ( closefunc_t ) BZ2_bzclose, ( readfunc_t ) BZ2_bzread, ( writefunc_t ) BZ2_bzwrite}; ^~~~~~~~~~~ dbase.cpp: In member function 'QList<ArchiveFile> DataBase::scanArchive(QString, DataBase::ArchiveType)': dbase.cpp:1954:13: warning: zero-length gnu_printf format string [-Wformat-zero-length] printf ( "" ); // important!!! ^~ In file included from dbase.cpp:32: wdbfile.h: At global scope: wdbfile.h:57:13: warning: 'enc_hcf_header' defined but not used [-Wunused-variable] static char enc_hcf_header[] = "__ENCRYTED_HCF__"; ^~~~~~~~~~~~~~ In file included from dbase.cpp:30: cdcat.h:38:21: warning: 'translator' defined but not used [-Wunused-variable] static QTranslator *translator; ^~~~~~~~~~ make: *** [Makefile:419: obj_files/dbase.o] Error 1 make: *** Waiting for unfinished jobs.... x86_64-pld-linux-g++ -c -pipe -O2 -fwrapv -pipe -Wformat -Werror=format-security -gdwarf-4 -fno-debug-types-section -fvar-tracking-assignments -g2 -Wp,-D_FORTIFY_SOURCE=2 -fstack-protector-strong --param=ssp-buffer-size=4 -fPIC -march=x86-64 -gdwarf-4 -fno-debug-types-section -fvar-tracking-assignments -g2 -D_REENTRANT -Wall -W -DUSE_LIB7ZIP -DCATALOG_ENCRYPTION -DQT_NO_DEBUG -DQT_XML_LIB -DQT_GUI_LIB -DQT_CORE_LIB -I/usr/share/qt4/mkspecs/linux-g++ -I. -I/usr/include/qt4/QtCore -I/usr/include/qt4/QtGui -I/usr/include/qt4/QtXml -I/usr/include/qt4 -I. -Imoc_files -o obj_files/find.o find.cpp In file included from find.cpp:53: wdbfile.h:34:8: error: 'byte' does not name a type; did you mean 'Byte'? static byte iv[CryptoPP::Blowfish::BLOCKSIZE]; ^~~~ Byte In file included from find.cpp:57: cdcat.h:38:21: warning: 'translator' defined but not used [-Wunused-variable] static QTranslator *translator; ^~~~~~~~~~ In file included from find.cpp:53: wdbfile.h:57:13: warning: 'enc_hcf_header' defined but not used [-Wunused-variable] static char enc_hcf_header[] = "__ENCRYTED_HCF__"; ^~~~~~~~~~~~~~ make: *** [Makefile:438: obj_files/find.o] Error 1 x86_64-pld-linux-g++ -c -pipe -O2 -fwrapv -pipe -Wformat -Werror=format-security -gdwarf-4 -fno-debug-types-section -fvar-tracking-assignments -g2 -Wp,-D_FORTIFY_SOURCE=2 -fstack-protector-strong --param=ssp-buffer-size=4 -fPIC -march=x86-64 -gdwarf-4 -fno-debug-types-section -fvar-tracking-assignments -g2 -D_REENTRANT -Wall -W -DUSE_LIB7ZIP -DCATALOG_ENCRYPTION -DQT_NO_DEBUG -DQT_XML_LIB -DQT_GUI_LIB -DQT_CORE_LIB -I/usr/share/qt4/mkspecs/linux-g++ -I. -I/usr/include/qt4/QtCore -I/usr/include/qt4/QtGui -I/usr/include/qt4/QtXml -I/usr/include/qt4 -I. -Imoc_files -o obj_files/commwidget.o commwidget.cpp In file included from commwidget.cpp:36: wdbfile.h:34:8: error: 'byte' does not name a type; did you mean 'Byte'? static byte iv[CryptoPP::Blowfish::BLOCKSIZE]; ^~~~ Byte wdbfile.h:57:13: warning: 'enc_hcf_header' defined but not used [-Wunused-variable] static char enc_hcf_header[] = "__ENCRYTED_HCF__"; ^~~~~~~~~~~~~~ In file included from commwidget.cpp:35: cdcat.h:38:21: warning: 'translator' defined but not used [-Wunused-variable] static QTranslator *translator; ^~~~~~~~~~ In file included from commwidget.h:27, from commwidget.cpp:10: config.h:280:14: warning: 'DEBUG_INFO_ENABLED' defined but not used [-Wunused-variable] static bool *DEBUG_INFO_ENABLED; ^~~~~~~~~~~~~~~~~~ make: *** [Makefile:398: obj_files/commwidget.o] Error 1 x86_64-pld-linux-g++ -c -pipe -O2 -fwrapv -pipe -Wformat -Werror=format-security -gdwarf-4 -fno-debug-types-section -fvar-tracking-assignments -g2 -Wp,-D_FORTIFY_SOURCE=2 -fstack-protector-strong --param=ssp-buffer-size=4 -fPIC -march=x86-64 -gdwarf-4 -fno-debug-types-section -fvar-tracking-assignments -g2 -D_REENTRANT -Wall -W -DUSE_LIB7ZIP -DCATALOG_ENCRYPTION -DQT_NO_DEBUG -DQT_XML_LIB -DQT_GUI_LIB -DQT_CORE_LIB -I/usr/share/qt4/mkspecs/linux-g++ -I. -I/usr/include/qt4/QtCore -I/usr/include/qt4/QtGui -I/usr/include/qt4/QtXml -I/usr/include/qt4 -I. -Imoc_files -o obj_files/hdirview.o hdirview.cpp hdirview.cpp: In constructor 'LNode::LNode(LNode*, LNode*, Node*, const QString&)': hdirview.cpp:62:38: warning: unused parameter 'after' [-Wunused-parameter] LNode::LNode ( LNode * parent,LNode *after,Node* dbnodep, const QString &col2 ) ~~~~~~~^~~~~ hdirview.cpp: In constructor 'HDirectoryView::HDirectoryView(DataBase**, QWidget*, const char*)': hdirview.cpp:294:79: warning: unused parameter 'name' [-Wunused-parameter] HDirectoryView::HDirectoryView ( DataBase **dbp, QWidget *parent, const char *name ) ~~~~~~~~~~~~^~~~ hdirview.cpp: In member function 'void HDirectoryView::slotFolderSelected(QTreeWidgetItem*, int)': hdirview.cpp:341:67: warning: unused parameter 'col' [-Wunused-parameter] void HDirectoryView::slotFolderSelected ( QTreeWidgetItem *i, int col ) { ~~~~^~~ hdirview.cpp: In member function 'void HDirectoryView::slotFolderSelectedR(QTreeWidgetItem*, int)': hdirview.cpp:353:68: warning: unused parameter 'col' [-Wunused-parameter] void HDirectoryView::slotFolderSelectedR ( QTreeWidgetItem *i, int col ) { ~~~~^~~ hdirview.cpp: In member function 'void HDirectoryView::contentsMousePressEvent(QMouseEvent*)': hdirview.cpp:412:61: warning: unused parameter 'e' [-Wunused-parameter] void HDirectoryView::contentsMousePressEvent ( QMouseEvent *e ) { ~~~~~~~~~~~~~^ In file included from hdirview.cpp:38: cdcat.h: At global scope: cdcat.h:38:21: warning: 'translator' defined but not used [-Wunused-variable] static QTranslator *translator; ^~~~~~~~~~ x86_64-pld-linux-g++ -c -pipe -O2 -fwrapv -pipe -Wformat -Werror=format-security -gdwarf-4 -fno-debug-types-section -fvar-tracking-assignments -g2 -Wp,-D_FORTIFY_SOURCE=2 -fstack-protector-strong --param=ssp-buffer-size=4 -fPIC -march=x86-64 -gdwarf-4 -fno-debug-types-section -fvar-tracking-assignments -g2 -D_REENTRANT -Wall -W -DUSE_LIB7ZIP -DCATALOG_ENCRYPTION -DQT_NO_DEBUG -DQT_XML_LIB -DQT_GUI_LIB -DQT_CORE_LIB -I/usr/share/qt4/mkspecs/linux-g++ -I. -I/usr/include/qt4/QtCore -I/usr/include/qt4/QtGui -I/usr/include/qt4/QtXml -I/usr/include/qt4 -I. -Imoc_files -o obj_files/guibase.o guibase.cpp In file included from guibase.cpp:50: wdbfile.h:34:8: error: 'byte' does not name a type; did you mean 'Byte'? static byte iv[CryptoPP::Blowfish::BLOCKSIZE]; ^~~~ Byte guibase.cpp: In member function 'void GuiSlave::currentItemChanged(QTreeWidgetItem*, QTreeWidgetItem*)': guibase.cpp:884:52: warning: unused parameter 'current' [-Wunused-parameter] void GuiSlave::currentItemChanged(QTreeWidgetItem* current,QTreeWidgetItem*before) { ~~~~~~~~~~~~~~~~~^~~~~~~ guibase.cpp:884:76: warning: unused parameter 'before' [-Wunused-parameter] void GuiSlave::currentItemChanged(QTreeWidgetItem* current,QTreeWidgetItem*before) { ~~~~~~~~~~~~~~~~^~~~~~ In file included from guibase.cpp:50: wdbfile.h: At global scope: wdbfile.h:57:13: warning: 'enc_hcf_header' defined but not used [-Wunused-variable] static char enc_hcf_header[] = "__ENCRYTED_HCF__"; ^~~~~~~~~~~~~~ In file included from guibase.cpp:43: cdcat.h:38:21: warning: 'translator' defined but not used [-Wunused-variable] static QTranslator *translator; ^~~~~~~~~~ make: *** [Makefile:462: obj_files/guibase.o] Error 1 x86_64-pld-linux-g++ -c -pipe -O2 -fwrapv -pipe -Wformat -Werror=format-security -gdwarf-4 -fno-debug-types-section -fvar-tracking-assignments -g2 -Wp,-D_FORTIFY_SOURCE=2 -fstack-protector-strong --param=ssp-buffer-size=4 -fPIC -march=x86-64 -gdwarf-4 -fno-debug-types-section -fvar-tracking-assignments -g2 -D_REENTRANT -Wall -W -DUSE_LIB7ZIP -DCATALOG_ENCRYPTION -DQT_NO_DEBUG -DQT_XML_LIB -DQT_GUI_LIB -DQT_CORE_LIB -I/usr/share/qt4/mkspecs/linux-g++ -I. -I/usr/include/qt4/QtCore -I/usr/include/qt4/QtGui -I/usr/include/qt4/QtXml -I/usr/include/qt4 -I. -Imoc_files -o obj_files/adddialog.o adddialog.cpp In file included from adddialog.cpp:48: config.h:280:14: warning: 'DEBUG_INFO_ENABLED' defined but not used [-Wunused-variable] static bool *DEBUG_INFO_ENABLED; ^~~~~~~~~~~~~~~~~~ x86_64-pld-linux-g++ -c -pipe -O2 -fwrapv -pipe -Wformat -Werror=format-security -gdwarf-4 -fno-debug-types-section -fvar-tracking-assignments -g2 -Wp,-D_FORTIFY_SOURCE=2 -fstack-protector-strong --param=ssp-buffer-size=4 -fPIC -march=x86-64 -gdwarf-4 -fno-debug-types-section -fvar-tracking-assignments -g2 -D_REENTRANT -Wall -W -DUSE_LIB7ZIP -DCATALOG_ENCRYPTION -DQT_NO_DEBUG -DQT_XML_LIB -DQT_GUI_LIB -DQT_CORE_LIB -I/usr/share/qt4/mkspecs/linux-g++ -I. -I/usr/include/qt4/QtCore -I/usr/include/qt4/QtGui -I/usr/include/qt4/QtXml -I/usr/include/qt4 -I. -Imoc_files -o obj_files/icons.o icons.cpp x86_64-pld-linux-g++ -c -pipe -O2 -fwrapv -pipe -Wformat -Werror=format-security -gdwarf-4 -fno-debug-types-section -fvar-tracking-assignments -g2 -Wp,-D_FORTIFY_SOURCE=2 -fstack-protector-strong --param=ssp-buffer-size=4 -fPIC -march=x86-64 -gdwarf-4 -fno-debug-types-section -fvar-tracking-assignments -g2 -D_REENTRANT -Wall -W -DUSE_LIB7ZIP -DCATALOG_ENCRYPTION -DQT_NO_DEBUG -DQT_XML_LIB -DQT_GUI_LIB -DQT_CORE_LIB -I/usr/share/qt4/mkspecs/linux-g++ -I. -I/usr/include/qt4/QtCore -I/usr/include/qt4/QtGui -I/usr/include/qt4/QtXml -I/usr/include/qt4 -I. -Imoc_files -o obj_files/config.o config.cpp In file included from config.cpp:10: config.h: In constructor 'CdCatConfig::CdCatConfig()': config.h:111:7: warning: 'CdCatConfig::commentWindowPos_y' will be initialized after [-Wreorder] int commentWindowPos_y; ^~~~~~~~~~~~~~~~~~ config.h:103:7: warning: 'int CdCatConfig::commentDockSize_width' [-Wreorder] int commentDockSize_width; ^~~~~~~~~~~~~~~~~~~~~ config.cpp:58:1: warning: when initialized here [-Wreorder] CdCatConfig::CdCatConfig ( void ) : ^~~~~~~~~~~ In file included from config.cpp:10: config.h:109:7: warning: 'CdCatConfig::contentWindowSize_width' will be initialized after [-Wreorder] int contentWindowSize_width; ^~~~~~~~~~~~~~~~~~~~~~~ config.h:108:7: warning: 'int CdCatConfig::contentWindowSize_height' [-Wreorder] int contentWindowSize_height; ^~~~~~~~~~~~~~~~~~~~~~~~ config.cpp:58:1: warning: when initialized here [-Wreorder] CdCatConfig::CdCatConfig ( void ) : ^~~~~~~~~~~ In file included from config.cpp:10: config.h:113:7: warning: 'CdCatConfig::commentWindowSize_width' will be initialized after [-Wreorder] int commentWindowSize_width; ^~~~~~~~~~~~~~~~~~~~~~~ config.h:112:7: warning: 'int CdCatConfig::commentWindowSize_height' [-Wreorder] int commentWindowSize_height; ^~~~~~~~~~~~~~~~~~~~~~~~ config.cpp:58:1: warning: when initialized here [-Wreorder] CdCatConfig::CdCatConfig ( void ) : ^~~~~~~~~~~ config.cpp: In member function 'int CdCatConfig::readConfig()': config.cpp:631:6: warning: this 'else' clause does not guard... [-Wmisleading-indentation] else ^~~~ config.cpp:633:7: note: ...this statement, but the latter is misleadingly indented as if it were guarded by the 'else' continue; ^~~~~~~~ config.cpp:671:6: warning: this 'if' clause does not guard... [-Wmisleading-indentation] if ( !val.isEmpty() ) ^~ config.cpp:673:7: note: ...this statement, but the latter is misleadingly indented as if it were guarded by the 'if' continue; ^~~~~~~~ In file included from config.cpp:45: cdcat.h: At global scope: cdcat.h:38:21: warning: 'translator' defined but not used [-Wunused-variable] static QTranslator *translator; ^~~~~~~~~~ x86_64-pld-linux-g++ -c -pipe -O2 -fwrapv -pipe -Wformat -Werror=format-security -gdwarf-4 -fno-debug-types-section -fvar-tracking-assignments -g2 -Wp,-D_FORTIFY_SOURCE=2 -fstack-protector-strong --param=ssp-buffer-size=4 -fPIC -march=x86-64 -gdwarf-4 -fno-debug-types-section -fvar-tracking-assignments -g2 -D_REENTRANT -Wall -W -DUSE_LIB7ZIP -DCATALOG_ENCRYPTION -DQT_NO_DEBUG -DQT_XML_LIB -DQT_GUI_LIB -DQT_CORE_LIB -I/usr/share/qt4/mkspecs/linux-g++ -I. -I/usr/include/qt4/QtCore -I/usr/include/qt4/QtGui -I/usr/include/qt4/QtXml -I/usr/include/qt4 -I. -Imoc_files -o obj_files/import.o import.cpp import.cpp: In member function 'virtual bool importWhereIsItXml::endElement(const QString&, const QString&, const QString&)': import.cpp:2181:26: warning: ignoring return value of 'QString QString::trimmed() const', declared with attribute warn_unused_result [-Wunused-result] currentText.trimmed(); ^ In file included from /usr/include/qt4/QtCore/qobject.h:48, from /usr/include/qt4/QtGui/qwidget.h:47, from /usr/include/qt4/QtGui/qdialog.h:45, from /usr/include/qt4/QtGui/qmessagebox.h:45, from import.cpp:10: /usr/include/qt4/QtCore/qstring.h:250:13: note: declared here QString trimmed() const Q_REQUIRED_RESULT; ^~~~~~~ import.cpp:2408:21: warning: variable 'env' set but not used [-Wunused-but-set-variable] Node *env, *curr; ^~~ import.cpp:2408:27: warning: variable 'curr' set but not used [-Wunused-but-set-variable] Node *env, *curr; ^~~~ In file included from import.cpp:33: cdcat.h: At global scope: cdcat.h:38:21: warning: 'translator' defined but not used [-Wunused-variable] static QTranslator *translator; ^~~~~~~~~~ error: Bad exit status from /tmp/B.QkLCUA/BUILD/tmp/rpm-tmp.60185 (%build) RPM build errors: Bad exit status from /tmp/B.QkLCUA/BUILD/tmp/rpm-tmp.60185 (%build) ended at: Mon Dec 31 09:33:16 2018, done in 0:00:23.090934 error: No files produced. + chmod -R u+rwX /tmp/B.QkLCUA/BUILD + rm -rf /tmp/B.QkLCUA/tmp /tmp/B.QkLCUA/BUILD + rm -rf /tmp/B.QkLCUA Begin-PLD-Builder-Info Build-Time: user:41.89s sys:2.72s real:25.56s (faults io:21 non-io:736493) End-PLD-Builder-Info
[Back to list of logs] [View rpm -qa of builder]