FailedOk

th/SRPMS[OK]
th/x32[OK]
th/i686[OK]
th/x86_64[OK]

ac/SRPMS[OK]
ac/i386[OK]
ac/i586[OK]
ac/i686[OK]
ac/alpha[OK]
ac/amd64[OK]
ac/athlon[OK]
ac/ppc[OK]
ac/sparc[OK]
ac/sparc64[OK]

Advanced Search
main()
Powered by PLD Linux
(c) 2002-2022 PLD Team
$Revision: 1.37 $
Powered by vim.
Your IP: 44.197.198.214

ceph d4bf5147-47e9-4d5d-89b0-f937873d4b0c

Status:Failed
Source URL:https://buildlogs.pld-linux.org/pld/th/x86_64/FAIL/ceph,d4bf5147-47e9-4d5d-89b0-f937873d4b0c.bz2
text/plain URL:View!
rpm -qa of builder:View!
Date:2022/09/15 01:48:50
Runtime:0:11:52.830736

Toc:

  • prep
  • Executing(%prep): /bin/sh -e /tmp/B.9grlomhr/BUILD/tmp/rpm-tmp.ia6OWV
  • build
  • Executing(%build): /bin/sh -e /tmp/B.9grlomhr/BUILD/tmp/rpm-tmp.egPAG8
  • error 1
  • /tmp/B.9grlomhr/BUILD/ceph-17.2.3/src/common/dout.h:185:56: error: call to non-'constexpr' function 'ceph::dout::dynamic_marker_t<T> ceph::dout::need_dynamic(T&&) [with T = unsigned int]'
  • error 2
  • /tmp/B.9grlomhr/BUILD/ceph-17.2.3/src/common/dout.h:185:56: error: call to non-'constexpr' function 'ceph::dout::dynamic_marker_t<T> ceph::dout::need_dynamic(T&&) [with T = unsigned int]'
  • error 3
  • /tmp/B.9grlomhr/BUILD/ceph-17.2.3/src/common/dout.h:185:56: error: call to non-'constexpr' function 'ceph::dout::dynamic_marker_t<T> ceph::dout::need_dynamic(T&&) [with T = unsigned int]'
  • error 4
  • /tmp/B.9grlomhr/BUILD/ceph-17.2.3/src/common/dout.h:185:56: error: call to non-'constexpr' function 'ceph::dout::dynamic_marker_t<T> ceph::dout::need_dynamic(T&&) [with T = unsigned int]'
  • error 5
  • /tmp/B.9grlomhr/BUILD/ceph-17.2.3/src/common/dout.h:185:56: error: call to non-'constexpr' function 'ceph::dout::dynamic_marker_t<T> ceph::dout::need_dynamic(T&&) [with T = unsigned int]'
  • error 6
  • /tmp/B.9grlomhr/BUILD/ceph-17.2.3/src/common/dout.h:185:56: error: call to non-'constexpr' function 'ceph::dout::dynamic_marker_t<T> ceph::dout::need_dynamic(T&&) [with T = unsigned int]'
  • error 7
  • /tmp/B.9grlomhr/BUILD/ceph-17.2.3/src/common/dout.h:185:56: error: call to non-'constexpr' function 'ceph::dout::dynamic_marker_t<T> ceph::dout::need_dynamic(T&&) [with T = unsigned int]'
  • error 8
  • make[2]: *** [src/crush/CMakeFiles/crush_objs.dir/build.make:135: src/crush/CMakeFiles/crush_objs.dir/CrushWrapper.cc.o] Error 1
  • error 9
  • /tmp/B.9grlomhr/BUILD/ceph-17.2.3/src/include/rados/buffer.h:98:52: error: expected template-name before '<' token
  • error 10
  • /tmp/B.9grlomhr/BUILD/ceph-17.2.3/src/include/rados/buffer.h:98:52: error: expected '{' before '<' token
  • error 11
  • /tmp/B.9grlomhr/BUILD/ceph-17.2.3/src/include/rados/buffer.h:374:17: error: 'unique_ptr' in namespace 'std' does not name a template type
  • error 12
  • /tmp/B.9grlomhr/BUILD/ceph-17.2.3/src/include/rados/buffer.h:378:17: error: 'unique_ptr' in namespace 'std' does not name a template type
  • error 13
  • /tmp/B.9grlomhr/BUILD/ceph-17.2.3/src/include/rados/buffer.h:383:17: error: 'unique_ptr' in namespace 'std' does not name a template type
  • error 14
  • /tmp/B.9grlomhr/BUILD/ceph-17.2.3/src/include/rados/buffer.h:407:17: error: 'unique_ptr' in namespace 'std' does not name a template type
  • error 15
  • /tmp/B.9grlomhr/BUILD/ceph-17.2.3/src/include/rados/buffer.h:1050:20: error: 'std::unique_ptr' has not been declared
  • error 16
  • /tmp/B.9grlomhr/BUILD/ceph-17.2.3/src/include/rados/buffer.h:1050:35: error: expected ',' or '...' before '<' token
  • error 17
  • /tmp/B.9grlomhr/BUILD/ceph-17.2.3/src/include/rados/buffer.h:1069:18: error: 'std::unique_ptr' has not been declared
  • error 18
  • /tmp/B.9grlomhr/BUILD/ceph-17.2.3/src/include/rados/buffer.h:1069:33: error: expected ',' or '...' before '<' token
  • error 19
  • /tmp/B.9grlomhr/BUILD/ceph-17.2.3/src/include/rados/buffer.h:1035:37: error: 'create' is not a member of 'ceph::buffer::v15_2_0::ptr_node'
  • error 20
  • /tmp/B.9grlomhr/BUILD/ceph-17.2.3/src/include/rados/buffer.h:1044:37: error: 'create' is not a member of 'ceph::buffer::v15_2_0::ptr_node'
  • error 21
  • /tmp/B.9grlomhr/BUILD/ceph-17.2.3/src/include/rados/buffer.h:1051:19: error: 'bp' was not declared in this scope
  • error 22
  • /tmp/B.9grlomhr/BUILD/ceph-17.2.3/src/include/rados/buffer.h:1057:51: error: 'r' has incomplete type
  • error 23
  • /tmp/B.9grlomhr/BUILD/ceph-17.2.3/src/include/rados/buffer.h:1058:37: error: 'create' is not a member of 'ceph::buffer::v15_2_0::ptr_node'
  • error 24
  • /tmp/B.9grlomhr/BUILD/ceph-17.2.3/src/include/rados/buffer.h:1094:41: error: 'create' is not a member of 'ceph::buffer::v15_2_0::ptr_node'
  • error 25
  • /tmp/B.9grlomhr/BUILD/ceph-17.2.3/src/include/denc.h:823:31: error: invalid use of incomplete type 'struct ceph::unique_leakable_ptr<ceph::buffer::v15_2_0::raw>'
  • error 26
  • /tmp/B.9grlomhr/BUILD/ceph-17.2.3/src/include/encoding.h:273:24: error: invalid use of incomplete type 'struct ceph::unique_leakable_ptr<ceph::buffer::v15_2_0::raw>'
  • error 27
  • /tmp/B.9grlomhr/BUILD/ceph-17.2.3/src/include/rados/buffer.h:203:30: error: invalid use of incomplete type 'struct ceph::unique_leakable_ptr<ceph::buffer::v15_2_0::raw>'
  • error 28
  • make[2]: *** [src/CMakeFiles/rados_snap_set_diff_obj.dir/build.make:79: src/CMakeFiles/rados_snap_set_diff_obj.dir/librados/snap_set_diff.cc.o] Error 1
  • error 29
  • make[1]: *** [CMakeFiles/Makefile2:2130: src/CMakeFiles/rados_snap_set_diff_obj.dir/all] Error 2
  • error 30
  • make[1]: *** [CMakeFiles/Makefile2:3067: src/crush/CMakeFiles/crush_objs.dir/all] Error 2
  • error 31
  • /tmp/B.9grlomhr/BUILD/ceph-17.2.3/src/common/dout.h:185:56: error: call to non-'constexpr' function 'ceph::dout::dynamic_marker_t<T> ceph::dout::need_dynamic(T&&) [with T = unsigned int]'
  • error 32
  • /tmp/B.9grlomhr/BUILD/ceph-17.2.3/src/common/dout.h:185:56: error: call to non-'constexpr' function 'ceph::dout::dynamic_marker_t<T> ceph::dout::need_dynamic(T&&) [with T = unsigned int]'
  • error 33
  • /tmp/B.9grlomhr/BUILD/ceph-17.2.3/src/common/dout.h:185:56: error: call to non-'constexpr' function 'ceph::dout::dynamic_marker_t<T> ceph::dout::need_dynamic(T&&) [with T = unsigned int]'
  • error 34
  • /tmp/B.9grlomhr/BUILD/ceph-17.2.3/src/common/dout.h:185:56: error: call to non-'constexpr' function 'ceph::dout::dynamic_marker_t<T> ceph::dout::need_dynamic(T&&) [with T = unsigned int]'
  • error 35
  • /tmp/B.9grlomhr/BUILD/ceph-17.2.3/src/common/dout.h:185:56: error: call to non-'constexpr' function 'ceph::dout::dynamic_marker_t<T> ceph::dout::need_dynamic(T&&) [with T = unsigned int]'
  • error 36
  • /tmp/B.9grlomhr/BUILD/ceph-17.2.3/src/common/dout.h:185:56: error: call to non-'constexpr' function 'ceph::dout::dynamic_marker_t<T> ceph::dout::need_dynamic(T&&) [with T = unsigned int]'
  • error 37
  • /tmp/B.9grlomhr/BUILD/ceph-17.2.3/src/common/dout.h:185:56: error: call to non-'constexpr' function 'ceph::dout::dynamic_marker_t<T> ceph::dout::need_dynamic(T&&) [with T = unsigned int]'
  • error 38
  • make[2]: *** [src/msg/CMakeFiles/common-msg-objs.dir/build.make:163: src/msg/CMakeFiles/common-msg-objs.dir/async/AsyncConnection.cc.o] Error 1
  • error 39
  • /tmp/B.9grlomhr/BUILD/ceph-17.2.3/src/common/dout.h:185:56: error: call to non-'constexpr' function 'ceph::dout::dynamic_marker_t<T> ceph::dout::need_dynamic(T&&) [with T = unsigned int]'
  • error 40
  • /tmp/B.9grlomhr/BUILD/ceph-17.2.3/src/common/dout.h:185:56: error: call to non-'constexpr' function 'ceph::dout::dynamic_marker_t<T> ceph::dout::need_dynamic(T&&) [with T = unsigned int]'
  • error 41
  • /tmp/B.9grlomhr/BUILD/ceph-17.2.3/src/common/dout.h:185:56: error: call to non-'constexpr' function 'ceph::dout::dynamic_marker_t<T> ceph::dout::need_dynamic(T&&) [with T = unsigned int]'
  • error 42
  • /tmp/B.9grlomhr/BUILD/ceph-17.2.3/src/common/dout.h:185:56: error: call to non-'constexpr' function 'ceph::dout::dynamic_marker_t<T> ceph::dout::need_dynamic(T&&) [with T = unsigned int]'
  • error 43
  • /tmp/B.9grlomhr/BUILD/ceph-17.2.3/src/common/dout.h:185:56: error: call to non-'constexpr' function 'ceph::dout::dynamic_marker_t<T> ceph::dout::need_dynamic(T&&) [with T = unsigned int]'
  • error 44
  • /tmp/B.9grlomhr/BUILD/ceph-17.2.3/src/common/dout.h:185:56: error: call to non-'constexpr' function 'ceph::dout::dynamic_marker_t<T> ceph::dout::need_dynamic(T&&) [with T = unsigned int]'
  • error 45
  • /tmp/B.9grlomhr/BUILD/ceph-17.2.3/src/common/dout.h:185:56: error: call to non-'constexpr' function 'ceph::dout::dynamic_marker_t<T> ceph::dout::need_dynamic(T&&) [with T = unsigned int]'
  • error 46
  • make[2]: *** [src/msg/CMakeFiles/common-msg-objs.dir/build.make:177: src/msg/CMakeFiles/common-msg-objs.dir/async/AsyncMessenger.cc.o] Error 1
  • error 47
  • /tmp/B.9grlomhr/BUILD/ceph-17.2.3/src/common/dout.h:185:56: error: call to non-'constexpr' function 'ceph::dout::dynamic_marker_t<T> ceph::dout::need_dynamic(T&&) [with T = unsigned int]'
  • error 48
  • /tmp/B.9grlomhr/BUILD/ceph-17.2.3/src/common/dout.h:185:56: error: call to non-'constexpr' function 'ceph::dout::dynamic_marker_t<T> ceph::dout::need_dynamic(T&&) [with T = unsigned int]'
  • error 49
  • /tmp/B.9grlomhr/BUILD/ceph-17.2.3/src/common/dout.h:185:56: error: call to non-'constexpr' function 'ceph::dout::dynamic_marker_t<T> ceph::dout::need_dynamic(T&&) [with T = unsigned int]'
  • error 50
  • /tmp/B.9grlomhr/BUILD/ceph-17.2.3/src/common/dout.h:185:56: error: call to non-'constexpr' function 'ceph::dout::dynamic_marker_t<T> ceph::dout::need_dynamic(T&&) [with T = unsigned int]'
  • error 51
  • /tmp/B.9grlomhr/BUILD/ceph-17.2.3/src/common/dout.h:185:56: error: call to non-'constexpr' function 'ceph::dout::dynamic_marker_t<T> ceph::dout::need_dynamic(T&&) [with T = unsigned int]'
  • error 52
  • /tmp/B.9grlomhr/BUILD/ceph-17.2.3/src/common/dout.h:185:56: error: call to non-'constexpr' function 'ceph::dout::dynamic_marker_t<T> ceph::dout::need_dynamic(T&&) [with T = unsigned int]'
  • error 53
  • /tmp/B.9grlomhr/BUILD/ceph-17.2.3/src/common/dout.h:185:56: error: call to non-'constexpr' function 'ceph::dout::dynamic_marker_t<T> ceph::dout::need_dynamic(T&&) [with T = unsigned int]'
  • error 54
  • /tmp/B.9grlomhr/BUILD/ceph-17.2.3/src/msg/Message.cc:971:42: error: call to non-'constexpr' function 'ceph::dout::dynamic_marker_t<T> ceph::dout::need_dynamic(T&&) [with T = long int&]'
  • error 55
  • make[2]: *** [src/msg/CMakeFiles/common-msg-objs.dir/build.make:93: src/msg/CMakeFiles/common-msg-objs.dir/Message.cc.o] Error 1
  • error 56
  • make[1]: *** [CMakeFiles/Makefile2:3093: src/msg/CMakeFiles/common-msg-objs.dir/all] Error 2
  • error 57
  • error: Bad exit status from /tmp/B.9grlomhr/BUILD/tmp/rpm-tmp.egPAG8 (%build)
  • error 58
  • RPM build errors:
  • error 59
  • error: No files produced.

Content:

request from: baggins
checking if we should skip the build
started at: Thu Sep 15 01:36:37 2022
killing old processes on a builder
sending signal 9 to pid -1
cleaning up /tmp
fetching https://srcbuilder.pld-linux.org/th//srpms/d4bf5147-47e9-4d5d-89b0-f937873d4b0c/ceph-17.2.3-1.src.rpm
fetched 167639462 bytes, 15161.1 K/s
installing srpm: ceph-17.2.3-1.src.rpm
+ install -d /tmp/B.9grlomhr/BUILD /tmp/B.9grlomhr/RPMS
+ LC_ALL=en_US.UTF-8
+ rpm -qp --changelog ceph-17.2.3-1.src.rpm
* Thu Sep 15 2022 PLD Linux Team <feedback@pld-linux.org>
- For complete changelog see: http://git.pld-linux.org/?p=packages/ceph.git;a=log;h=DEVEL-17
* Wed Sep 14 2022 Jakub Bogusz <qboosh@pld-linux.org> c5b31b0
- updated libfmt patch, added system-rocksdb patch (fix seastar build with system rocksdb) * Mon Sep 05 2022 Jakub Bogusz <qboosh@pld-linux.org> 434b741
- more libfmt fixes (WIP) * Sun Sep 04 2022 Jakub Bogusz <qboosh@pld-linux.org> cc053f7
- added glibc,libfmt patches - updated files with qat * Sun Sep 04 2022 Jan Rękorajski <baggins@pld-linux.org> 6d7dd22
- disable sestar by default to drop BR on broken dpdk package * Mon Aug 29 2022 Jakub Bogusz <qboosh@pld-linux.org> 32e4d0f
- trying more functionality (zbd, qat, qatlib; seastar is LP64 only) * Thu Aug 25 2022 Jakub Bogusz <qboosh@pld-linux.org> dc8b799
- up to 17.2.3 - updated fio,types patches * Sat Jul 30 2022 Jakub Bogusz <qboosh@pld-linux.org> f8f6a16
- started update to 17.2.2 (WIP, saving work) * Wed Jun 15 2022 Jakub Bogusz <qboosh@pld-linux.org> d932822
- Merge branch 'merge-16' * Tue Jun 14 2022 Jakub Bogusz <qboosh@pld-linux.org> 737284c
- Merged update to 16.2.9 from master * Mon Jun 13 2022 Jakub Bogusz <qboosh@pld-linux.org> 6b8625f
- updated to 15.2.16 - updated types,fio patches - python2 support dropped upstream, replaced by python3 binding * Sun Jun 12 2022 Jakub Bogusz <qboosh@pld-linux.org> 2b3ddb3
- updated to 16.2.9 - updated no-virtualenvs patch * Sun Jun 12 2022 Jakub Bogusz <qboosh@pld-linux.org> d8321c0
- up to 14.2.22 - updated boost,fcgi,fio,python,tcmalloc,types patches - removed obsolete includes,rocksdb patches * Thu Jun 09 2022 Jakub Bogusz <qboosh@pld-linux.org> 56f05d7
- updated dependencies * Thu Jun 09 2022 Jakub Bogusz <qboosh@pld-linux.org> c89c1ad
- versioned Obsoletes * Thu Jun 09 2022 Jakub Bogusz <qboosh@pld-linux.org> cda7a0c
- rediffed fio patch * Fri Jun 03 2022 Jan Palus <atler@pld-linux.org> 5cb0389
- boost+icu rebuild * Sun Apr 03 2022 Jan Rękorajski <baggins@pld-linux.org> 09b9dd0
- Release 4 (by relup.sh) * Sun Apr 03 2022 Jan Rękorajski <baggins@pld-linux.org> 2df85c6
- updated python packaging * Sun Apr 03 2022 Jan Rękorajski <baggins@pld-linux.org> 720615c
- correct pmdk dep and actually use that dep * Fri Mar 25 2022 Jan Rękorajski <baggins@pld-linux.org> ca05c08
- rebuild with python 3.10 + rpm -Uhv --nodeps --define '_topdir /tmp/B.9grlomhr' --define '_specdir %{_topdir}' --define '_sourcedir %{_specdir}' --define '_rpmdir %{_topdir}/RPMS' --define '_builddir %{_topdir}/BUILD' ceph-17.2.3-1.src.rpm Updating / installing... ceph-17.2.3-1 ######################################## + rm -f ceph-17.2.3-1.src.rpm + install -m 700 -d /tmp/B.9grlomhr/BUILD/tmp + TMPDIR=/tmp/B.9grlomhr/BUILD/tmp + exec nice -n 0 rpmbuild -bp --short-circuit --nodeps --define '_topdir /tmp/B.9grlomhr' --define '_specdir %{_topdir}' --define '_sourcedir %{_specdir}' --define '_rpmdir %{_topdir}/RPMS' --define '_builddir %{_topdir}/BUILD' --target x86_64-pld-linux --define 'prep exit 0' /tmp/B.9grlomhr/ceph.spec warning: Could not canonicalize hostname: ymir Building target platforms: x86_64-pld-linux Building for target x86_64-pld-linux RPM build warnings: Could not canonicalize hostname: ymir checking BuildConflict-ing packages rpm: warning: Could not canonicalize hostname: ymir rpm: Building target platforms: x86_64-pld-linux rpm: Building for target x86_64-pld-linux rpm: rpm: RPM build warnings: rpm: Could not canonicalize hostname: ymir no BuildConflicts found checking BR rpm: warning: Could not canonicalize hostname: ymir rpm: Building target platforms: x86_64-pld-linux rpm: Building for target x86_64-pld-linux rpm: rpm: RPM build warnings: rpm: Could not canonicalize hostname: ymir no BR needed building RPM using: set -ex; : build-id: d4bf5147-47e9-4d5d-89b0-f937873d4b0c; TMPDIR=/tmp/B.9grlomhr/BUILD/tmp exec nice -n 0 rpmbuild -bb --define '__jobs 9' --define '_smp_mflags -j9' --define '_make_opts -Otarget' --define '_pld_builder 1' --define '_topdir /tmp/B.9grlomhr' --define '_specdir %{_topdir}' --define '_sourcedir %{_specdir}' --define '_rpmdir %{_topdir}/RPMS' --define '_builddir %{_topdir}/BUILD' --target x86_64-pld-linux /tmp/B.9grlomhr/ceph.spec + : build-id: d4bf5147-47e9-4d5d-89b0-f937873d4b0c + TMPDIR=/tmp/B.9grlomhr/BUILD/tmp + exec nice -n 0 rpmbuild -bb --define '__jobs 9' --define '_smp_mflags -j9' --define '_make_opts -Otarget' --define '_pld_builder 1' --define '_topdir /tmp/B.9grlomhr' --define '_specdir %{_topdir}' --define '_sourcedir %{_specdir}' --define '_rpmdir %{_topdir}/RPMS' --define '_builddir %{_topdir}/BUILD' --target x86_64-pld-linux /tmp/B.9grlomhr/ceph.spec warning: Could not canonicalize hostname: ymir Building target platforms: x86_64-pld-linux Building for target x86_64-pld-linux Executing(%prep): /bin/sh -e /tmp/B.9grlomhr/BUILD/tmp/rpm-tmp.ia6OWV + umask 022 + cd /tmp/B.9grlomhr/BUILD + cd /tmp/B.9grlomhr/BUILD + rm -rf ceph-17.2.3 + /bin/gzip -dc /tmp/B.9grlomhr/ceph-17.2.3.tar.gz + /bin/tar -xof - + STATUS=0 + '[' 0 -ne 0 ']' + cd ceph-17.2.3 + /bin/chmod -Rf a+rX,u+w,g-w,o-w . + echo 'Patch #0 (ceph-python.patch):' Patch #0 (ceph-python.patch): + </tmp/B.9grlomhr/ceph-python.patch + /usr/bin/patch -s -f -p1 '--fuzz=0' + echo 'Patch #1 (ceph-fio.patch):' Patch #1 (ceph-fio.patch): + </tmp/B.9grlomhr/ceph-fio.patch + /usr/bin/patch -s -f -p1 '--fuzz=0' + echo 'Patch #2 (ceph-cmake-static.patch):' Patch #2 (ceph-cmake-static.patch): + </tmp/B.9grlomhr/ceph-cmake-static.patch + /usr/bin/patch -s -f -p1 '--fuzz=0' + echo 'Patch #3 (ceph-arrow-pld.patch):' Patch #3 (ceph-arrow-pld.patch): + </tmp/B.9grlomhr/ceph-arrow-pld.patch + /usr/bin/patch -s -f -p1 '--fuzz=0' + echo 'Patch #4 (no-virtualenvs.patch):' Patch #4 (no-virtualenvs.patch): + </tmp/B.9grlomhr/no-virtualenvs.patch + /usr/bin/patch -s -f -p1 '--fuzz=0' + echo 'Patch #5 (ceph-libdir.patch):' Patch #5 (ceph-libdir.patch): + </tmp/B.9grlomhr/ceph-libdir.patch + /usr/bin/patch -s -f -p1 '--fuzz=0' + echo 'Patch #6 (types.patch):' Patch #6 (types.patch): + </tmp/B.9grlomhr/types.patch + /usr/bin/patch -s -f -p1 '--fuzz=0' + echo 'Patch #7 (use-provided-cpu-flag-values.patch):' Patch #7 (use-provided-cpu-flag-values.patch): + </tmp/B.9grlomhr/use-provided-cpu-flag-values.patch + /usr/bin/patch -s -f -p1 '--fuzz=0' + echo 'Patch #8 (ix86-no-asm.patch):' Patch #8 (ix86-no-asm.patch): + </tmp/B.9grlomhr/ix86-no-asm.patch + /usr/bin/patch -s -f -p1 '--fuzz=0' + echo 'Patch #10 (ceph-qat.patch):' Patch #10 (ceph-qat.patch): + </tmp/B.9grlomhr/ceph-qat.patch + /usr/bin/patch -s -f -p1 '--fuzz=0' + echo 'Patch #11 (ceph-liburing.patch):' Patch #11 (ceph-liburing.patch): + </tmp/B.9grlomhr/ceph-liburing.patch + /usr/bin/patch -s -f -p1 '--fuzz=0' + echo 'Patch #12 (ceph-glibc.patch):' Patch #12 (ceph-glibc.patch): + </tmp/B.9grlomhr/ceph-glibc.patch + /usr/bin/patch -s -f -p1 '--fuzz=0' + echo 'Patch #13 (ceph-libfmt.patch):' Patch #13 (ceph-libfmt.patch): + </tmp/B.9grlomhr/ceph-libfmt.patch + /usr/bin/patch -s -f -p1 '--fuzz=0' + echo 'Patch #14 (ceph-system-rocksdb.patch):' Patch #14 (ceph-system-rocksdb.patch): + </tmp/B.9grlomhr/ceph-system-rocksdb.patch + /usr/bin/patch -s -f -p1 '--fuzz=0' + /bin/sed -i -e '1s,/usr/bin/env bash,/bin/bash,' src/ceph-post-file.in src/rbd-replay-many src/rbdmap src/rgw/rgw-gap-list src/rgw/rgw-orphan-list + /bin/sed -i -e 1s,/usr/bin/awk,/bin/awk, src/rgw/rgw-gap-list-comparator + RPM_EC=0 + jobs -p + exit 0 Executing(%build): /bin/sh -e /tmp/B.9grlomhr/BUILD/tmp/rpm-tmp.egPAG8 TMP=/home/users/builder/tmp HOME=/home/users/builder PATH=/home/users/builder/GNUstep/Tools:/bin:/usr/bin:/usr/local/bin:/home/users/builder/bin TMPDIR=/tmp/B.9grlomhr/BUILD/tmp + umask 022 + cd /tmp/B.9grlomhr/BUILD + cd ceph-17.2.3 + install -d build + cd build + CC=x86_64-pld-linux-gcc CXX=x86_64-pld-linux-g++ CPPFLAGS='' /usr/bin/cmake '-DCMAKE_VERBOSE_MAKEFILE:BOOL=ON' '-DCMAKE_BUILD_TYPE=PLD' '-DCMAKE_INSTALL_BINDIR:PATH=/usr/bin' '-DCMAKE_INSTALL_SBINDIR:PATH=/usr/sbin' '-DCMAKE_INSTALL_LIBEXECDIR:PATH=/usr/libexec' '-DCMAKE_INSTALL_SYSCONFDIR:PATH=/etc' '-DCMAKE_INSTALL_SHAREDSTATEDIRPATH:PATH=/var/lib' '-DCMAKE_INSTALL_LOCALSTATEDIRPATH:PATH=/var' '-DCMAKE_INSTALL_LIBDIR:PATH=/usr/lib64' '-DCMAKE_INSTALL_INCLUDEDIR:PATH=/usr/include' '-DCMAKE_INSTALL_OLDINCLUDEDIR:PATH=/usr/include' '-DCMAKE_INSTALL_DATAROOTDIR:PATH=/usr/share' '-DCMAKE_INSTALL_DATADIR:PATH=/usr/share' '-DCMAKE_INSTALL_INFODIR:PATH=/usr/share/info' '-DCMAKE_INSTALL_LOCALEDIR:PATH=/usr/share/locale' '-DCMAKE_INSTALL_MANDIR:PATH=/usr/share/man' '-DCMAKE_INSTALL_DOCDIR:PATH=/usr/share/doc' '-DCMAKE_INSTALL_PREFIX:PATH=/usr' '-DSYSCONF_INSTALL_DIR:PATH=/etc' '-DCMAKE_CXX_FLAGS_PLD=-O2 -fwrapv -pipe -Wformat -Werror=format-security -gdwarf-4 -fno-debug-types-section -fvar-tracking-assignments -g2 -Wp,-D_FORTIFY_SOURCE=2 -fstack-protector-strong --param=ssp-buffer-size=4 -Werror=trampolines -fPIC -march=x86-64 -mtune=generic -gdwarf-4 -fno-debug-types-section -fvar-tracking-assignments -g2 -DNDEBUG -DQT_NO_DEBUG' '-DCMAKE_C_FLAGS_PLD=-O2 -fwrapv -pipe -Wformat -Werror=format-security -gdwarf-4 -fno-debug-types-section -fvar-tracking-assignments -g2 -Wp,-D_FORTIFY_SOURCE=2 -fstack-protector-strong --param=ssp-buffer-size=4 -Werror=trampolines -fPIC -march=x86-64 -mtune=generic -gdwarf-4 -fno-debug-types-section -fvar-tracking-assignments -g2 -DNDEBUG -DQT_NO_DEBUG' '-DCMAKE_Fortran_FLAGS_PLD=-O2 -fwrapv -pipe -Wformat -Werror=format-security -gdwarf-4 -fno-debug-types-section -fvar-tracking-assignments -g2 -Wp,-D_FORTIFY_SOURCE=2 -fstack-protector-strong --param=ssp-buffer-size=4 -Werror=trampolines -fPIC -march=x86-64 -mtune=generic -gdwarf-4 -fno-debug-types-section -fvar-tracking-assignments -g2 -DNDEBUG -DQT_NO_DEBUG' '-DCMAKE_EXE_LINKER_FLAGS_PLD=-Wl,--as-needed -Wl,--no-copy-dt-needed-entries -Wl,-z,relro -Wl,-z,combreloc ' '-DCMAKE_SHARED_LINKER_FLAGS_PLD=-Wl,--as-needed -Wl,--no-copy-dt-needed-entries -Wl,-z,relro -Wl,-z,combreloc ' '-DCMAKE_MODULE_LINKER_FLAGS_PLD=-Wl,--as-needed -Wl,--no-copy-dt-needed-entries -Wl,-z,relro -Wl,-z,combreloc ' '-DLIB_SUFFIX=64' '-DBUILD_SHARED_LIBS:BOOL=ON' .. '-DHAVE_INTEL_SSE=1' '-DHAVE_INTEL_SSE2=1' '-DHAVE_INTEL_SSE3=1' '-DHAVE_INTEL_SSSE3=1' '-DHAVE_INTEL_PCLMUL=1' '-DHAVE_INTEL_SSE4_1=1' '-DHAVE_INTEL_SSE4_2=1' '-DALLOCATOR=tcmalloc' '-DFIO_INCLUDE_DIR=/usr/include/fio' '-DJAVA_HOME:PATH=/usr/lib64/jvm/java' '-DLUA_INCLUDE_DIR=/usr/include/lua' '-DPYTHON=/usr/bin/python3' '-DSPHINX_BUILD=/usr/bin/sphinx-build' '-DWITH_BLUEFS=ON' '-DWITH_BLUESTORE_PMEM=ON' '-DWITH_SYSTEM_PMDK:BOOL=ON' '-DWITH_CEPHFS_JAVA=ON' '-DWITH_LZ4=ON' '-DWITH_MGR_DASHBOARD_FRONTEND=OFF' '-DWITH_OCF=ON' '-DWITH_PYTHON3=3.10' '-DWITH_REENTRANT_STRSIGNAL=ON' '-DWITH_QAT=ON' '-DWITH_QATZIP=ON' '-DWITH_SYSTEM_BOOST=ON' '-DWITH_SYSTEM_LIBURING=ON' '-DWITH_SYSTEM_ROCKSDB=ON' '-DWITH_SYSTEM_ZSTD=ON' '-DWITH_SYSTEMD=ON' '-DWITH_TESTS=OFF' '-DWITH_ZBD=ON' -- The CXX compiler identification is GNU 12.2.0 -- The C compiler identification is GNU 12.2.0 -- The ASM compiler identification is GNU -- Found assembler: /usr/bin/x86_64-pld-linux-gcc -- Detecting CXX compiler ABI info -- Detecting CXX compiler ABI info - done -- Check for working CXX compiler: /usr/bin/x86_64-pld-linux-g++ - skipped -- Detecting CXX compile features -- Detecting CXX compile features - done -- Detecting C compiler ABI info -- Detecting C compiler ABI info - done -- Check for working C compiler: /usr/bin/x86_64-pld-linux-gcc - skipped -- Detecting C compile features -- Detecting C compile features - done -- Performing Test CMAKE_HAVE_LIBC_PTHREAD -- Performing Test CMAKE_HAVE_LIBC_PTHREAD - Success -- Found Threads: TRUE -- Looking for memset_s -- Looking for memset_s - not found -- Looking for fallocate -- Looking for fallocate - found -- Looking for posix_fadvise -- Looking for posix_fadvise - found -- Looking for posix_fallocate -- Looking for posix_fallocate - found -- Looking for syncfs -- Looking for syncfs - found -- Looking for sync_file_range -- Looking for sync_file_range - found -- Looking for pwritev -- Looking for pwritev - found -- Looking for splice -- Looking for splice - found -- Looking for getgrouplist -- Looking for getgrouplist - found -- Looking for fdatasync -- Looking for fdatasync - found -- Looking for strerror_r -- Looking for strerror_r - found -- Looking for name_to_handle_at -- Looking for name_to_handle_at - found -- Looking for pipe2 -- Looking for pipe2 - found -- Looking for accept4 -- Looking for accept4 - found -- Looking for sigdescr_np -- Looking for sigdescr_np - found -- Looking for pthread_spin_init -- Looking for pthread_spin_init - found -- Looking for pthread_set_name_np -- Looking for pthread_set_name_np - not found -- Looking for pthread_get_name_np -- Looking for pthread_get_name_np - not found -- Looking for pthread_setname_np -- Looking for pthread_setname_np - found -- Looking for pthread_getname_np -- Looking for pthread_getname_np - found -- Looking for pthread_rwlockattr_setkind_np -- Looking for pthread_rwlockattr_setkind_np - found -- Looking for eventfd -- Looking for eventfd - found -- Looking for getprogname -- Looking for getprogname - not found -- Looking for gettid -- Looking for gettid - found -- Looking for include file linux/types.h -- Looking for include file linux/types.h - found -- Looking for include file linux/version.h -- Looking for include file linux/version.h - found -- Looking for include file arpa/nameser_compat.h -- Looking for include file arpa/nameser_compat.h - found -- Looking for include file sys/mount.h -- Looking for include file sys/mount.h - found -- Looking for include file sys/param.h -- Looking for include file sys/param.h - found -- Looking for include file sys/types.h -- Looking for include file sys/types.h - found -- Looking for include file sys/vfs.h -- Looking for include file sys/vfs.h - found -- Looking for include file sys/prctl.h -- Looking for include file sys/prctl.h - found -- Looking for include file execinfo.h -- Looking for include file execinfo.h - found -- Looking for include file sched.h -- Looking for include file sched.h - found -- Looking for include file valgrind/helgrind.h -- Looking for include file valgrind/helgrind.h - found -- Looking for stdint.h -- Looking for stdint.h - found -- Looking for stddef.h -- Looking for stddef.h - found -- Check size of __u8 -- Check size of __u8 - done -- Check size of __u16 -- Check size of __u16 - done -- Check size of __u32 -- Check size of __u32 - done -- Check size of __u64 -- Check size of __u64 - done -- Check size of __s8 -- Check size of __s8 - done -- Check size of __s16 -- Check size of __s16 - done -- Check size of __s32 -- Check size of __s32 - done -- Check size of __s64 -- Check size of __s64 - done -- Check size of in_addr_t -- Check size of in_addr_t - done -- Looking for _POSIX_TIMERS -- Looking for _POSIX_TIMERS - found -- Looking for res_nquery -- Looking for res_nquery - found -- Looking for F_SETPIPE_SZ -- Looking for F_SETPIPE_SZ - found -- Looking for __func__ -- Looking for __func__ - found -- Looking for __PRETTY_FUNCTION__ -- Looking for __PRETTY_FUNCTION__ - found -- Looking for getentropy -- Looking for getentropy - found -- Performing Test STRERROR_R_CHAR_P -- Performing Test STRERROR_R_CHAR_P - Success -- Performing Test HAVE_STAT_ST_MTIM_TV_NSEC -- Performing Test HAVE_STAT_ST_MTIM_TV_NSEC - Success -- Performing Test HAVE_STAT_ST_MTIMESPEC_TV_NSEC -- Performing Test HAVE_STAT_ST_MTIMESPEC_TV_NSEC - Failed -- Performing Test HAVE_UNALIGNED_ACCESS -- Performing Test HAVE_UNALIGNED_ACCESS - Success -- Performing Test HAVE_ATTR_SYMVER -- Performing Test HAVE_ATTR_SYMVER - Success -- Performing Test HAVE_ASM_SYMVER -- Performing Test HAVE_ASM_SYMVER - Success -- Performing Test HAVE_CXX11_ATOMIC -- Performing Test HAVE_CXX11_ATOMIC - Success -- Found verbs: /usr/lib64/libibverbs.so -- Performing Test HAVE_IBV_EXP -- Performing Test HAVE_IBV_EXP - Failed -- Found rdmacm: /usr/lib64/librdmacm.so -- Looking for backtrace -- Looking for backtrace - found -- backtrace facility detected in default set of libraries -- Found Backtrace: /usr/include -- Found udev: /lib64/libudev.so -- Found blkid: /usr/lib64/libblkid.so -- Found keyutils: /usr/lib64/libkeyutils.so -- Found OpenLDAP: /usr/include -- Found FUSE: /usr/lib64/libfuse3.so (found version "3.12") -- Found xfs: /usr/lib64/libhandle.so -- Found aio: /usr/lib64/libaio.so -- Checking for one of the modules 'libcryptsetup' -- Found libcryptsetup: /usr/include (found suitable version "2.5.0", minimum required is "2.0.5") -- Found zbd: /usr/lib64/libzbd.so -- Found QatDrv: /usr/lib64/libqat.so;/usr/lib64/libusdm.so -- Found qatzip: /usr/lib64/libqatzip.so -- Found SQLite3: /usr/lib64/libsqlite3.so -- Found snappy: /usr/lib64/libsnappy.so -- Found LZ4: /usr/lib64/liblz4.so (found suitable version "1.9.4", minimum required is "1.7") -- Found gperftools: /usr/include (found suitable version "2.9.1", minimum required is "2.6.2") -- Found CURL: /usr/lib64/libcurl.so (found version "7.85.0") -- Looking for curl_multi_wait -- Looking for curl_multi_wait - found -- Found OpenSSL: /usr/lib64/libcrypto.so (found version "3.0.5") -- Found EXPAT: /usr/lib64/libexpat.so (found version "2.4.8") -- Found OATH: /usr/lib64/liboath.so -- ssl soname: libssl.so.3 -- crypto soname: libcrypto.so.3 -- Found Python3: /usr/bin/python3.10 (found suitable exact version "3.10.7") found components: Interpreter Development -- Found ZLIB: /usr/lib64/libz.so (found version "1.2.12") -- Found LTTngUST: /usr/lib64/liblttng-ust.so;dl (found version "2.3.2") -- Found babeltrace: /usr/include -- Found RocksDB: /usr/lib64/librocksdb.so (found suitable version "6.8.1", minimum required is "5.14") CMake Warning at cmake/modules/FindBoost.cmake:1353 (message): New Boost version may have incorrect or missing dependencies and imported targets Call Stack (most recent call first): cmake/modules/FindBoost.cmake:1475 (_Boost_COMPONENT_DEPENDENCIES) cmake/modules/FindBoost.cmake:2091 (_Boost_MISSING_DEPENDENCIES) CMakeLists.txt:617 (find_package) CMake Warning at cmake/modules/FindBoost.cmake:1353 (message): New Boost version may have incorrect or missing dependencies and imported targets Call Stack (most recent call first): cmake/modules/FindBoost.cmake:1475 (_Boost_COMPONENT_DEPENDENCIES) cmake/modules/FindBoost.cmake:2091 (_Boost_MISSING_DEPENDENCIES) CMakeLists.txt:617 (find_package) CMake Warning at cmake/modules/FindBoost.cmake:1353 (message): New Boost version may have incorrect or missing dependencies and imported targets Call Stack (most recent call first): cmake/modules/FindBoost.cmake:1475 (_Boost_COMPONENT_DEPENDENCIES) cmake/modules/FindBoost.cmake:2091 (_Boost_MISSING_DEPENDENCIES) CMakeLists.txt:617 (find_package) CMake Warning at cmake/modules/FindBoost.cmake:1353 (message): New Boost version may have incorrect or missing dependencies and imported targets Call Stack (most recent call first): cmake/modules/FindBoost.cmake:1475 (_Boost_COMPONENT_DEPENDENCIES) cmake/modules/FindBoost.cmake:2091 (_Boost_MISSING_DEPENDENCIES) CMakeLists.txt:617 (find_package) CMake Warning at cmake/modules/FindBoost.cmake:1353 (message): New Boost version may have incorrect or missing dependencies and imported targets Call Stack (most recent call first): cmake/modules/FindBoost.cmake:1475 (_Boost_COMPONENT_DEPENDENCIES) cmake/modules/FindBoost.cmake:2091 (_Boost_MISSING_DEPENDENCIES) CMakeLists.txt:617 (find_package) CMake Warning at cmake/modules/FindBoost.cmake:1353 (message): New Boost version may have incorrect or missing dependencies and imported targets Call Stack (most recent call first): cmake/modules/FindBoost.cmake:1475 (_Boost_COMPONENT_DEPENDENCIES) cmake/modules/FindBoost.cmake:2091 (_Boost_MISSING_DEPENDENCIES) CMakeLists.txt:617 (find_package) CMake Warning at cmake/modules/FindBoost.cmake:1353 (message): New Boost version may have incorrect or missing dependencies and imported targets Call Stack (most recent call first): cmake/modules/FindBoost.cmake:1475 (_Boost_COMPONENT_DEPENDENCIES) cmake/modules/FindBoost.cmake:2091 (_Boost_MISSING_DEPENDENCIES) CMakeLists.txt:617 (find_package) CMake Warning at cmake/modules/FindBoost.cmake:1353 (message): New Boost version may have incorrect or missing dependencies and imported targets Call Stack (most recent call first): cmake/modules/FindBoost.cmake:1475 (_Boost_COMPONENT_DEPENDENCIES) cmake/modules/FindBoost.cmake:2091 (_Boost_MISSING_DEPENDENCIES) CMakeLists.txt:617 (find_package) CMake Warning at cmake/modules/FindBoost.cmake:1353 (message): New Boost version may have incorrect or missing dependencies and imported targets Call Stack (most recent call first): cmake/modules/FindBoost.cmake:1475 (_Boost_COMPONENT_DEPENDENCIES) cmake/modules/FindBoost.cmake:2091 (_Boost_MISSING_DEPENDENCIES) CMakeLists.txt:617 (find_package) CMake Warning at cmake/modules/FindBoost.cmake:1353 (message): New Boost version may have incorrect or missing dependencies and imported targets Call Stack (most recent call first): cmake/modules/FindBoost.cmake:1475 (_Boost_COMPONENT_DEPENDENCIES) cmake/modules/FindBoost.cmake:2091 (_Boost_MISSING_DEPENDENCIES) CMakeLists.txt:617 (find_package) CMake Warning at cmake/modules/FindBoost.cmake:1353 (message): New Boost version may have incorrect or missing dependencies and imported targets Call Stack (most recent call first): cmake/modules/FindBoost.cmake:1475 (_Boost_COMPONENT_DEPENDENCIES) cmake/modules/FindBoost.cmake:2091 (_Boost_MISSING_DEPENDENCIES) CMakeLists.txt:617 (find_package) CMake Warning at cmake/modules/FindBoost.cmake:1353 (message): New Boost version may have incorrect or missing dependencies and imported targets Call Stack (most recent call first): cmake/modules/FindBoost.cmake:1475 (_Boost_COMPONENT_DEPENDENCIES) cmake/modules/FindBoost.cmake:2091 (_Boost_MISSING_DEPENDENCIES) CMakeLists.txt:617 (find_package) CMake Warning at cmake/modules/FindBoost.cmake:1353 (message): New Boost version may have incorrect or missing dependencies and imported targets Call Stack (most recent call first): cmake/modules/FindBoost.cmake:1475 (_Boost_COMPONENT_DEPENDENCIES) cmake/modules/FindBoost.cmake:2091 (_Boost_MISSING_DEPENDENCIES) CMakeLists.txt:617 (find_package) CMake Warning at cmake/modules/FindBoost.cmake:2190 (message): No header defined for python310; skipping header check (note: header-only libraries have no designated component) Call Stack (most recent call first): CMakeLists.txt:617 (find_package) -- Found Boost: /usr/include (found suitable version "1.79.0", minimum required is "1.73") found components: atomic chrono thread system regex random program_options date_time iostreams context coroutine python310 filesystem -- Found StdFilesystem: included by standard library -- Ceph/.git directory not found, parsing /tmp/B.9grlomhr/BUILD/ceph-17.2.3/src/.git_version for CEPH_GIT_VER and CEPH_GIT_NICE_VER -- Performing Test COMPILER_SUPPORTS_PESSIMIZING_MOVE -- Performing Test COMPILER_SUPPORTS_PESSIMIZING_MOVE - Success -- Performing Test COMPILER_SUPPORTS_REDUNDANT_MOVE -- Performing Test COMPILER_SUPPORTS_REDUNDANT_MOVE - Success -- Performing Test HAS_FORTIFY_SOURCE -- Performing Test HAS_FORTIFY_SOURCE - Success -- Performing Test HAS_STACK_PROTECT -- Performing Test HAS_STACK_PROTECT - Success -- Performing Test HAS_GLIBCXX_ASSERTIONS -- Performing Test HAS_GLIBCXX_ASSERTIONS - Success -- Found nasm: best -- capable of assembling AVX512 -- Performing Test HAVE_STDLIB_MAP_SPLICING -- Performing Test HAVE_STDLIB_MAP_SPLICING - Success -- Performing Test COMPILER_SUPPORTS_DIAGNOSTICS_COLOR -- Performing Test COMPILER_SUPPORTS_DIAGNOSTICS_COLOR - Success -- Found Java: /usr/lib64/jvm/java/bin/java (found version "11.0.16") found components: Development -- Found JNI: /usr/lib64/jvm/java/include found components: AWT JVM -- Check size of suseconds_t -- Check size of suseconds_t - done -- Performing Test HAS_VTA -- Performing Test HAS_VTA - Success -- mgr module disabled for 3.10.7: diskprediction_local -- Found pmem: pmem_pmem_INCLUDE_DIR (found suitable version "1.12.0", minimum required is "1.10") -- Found Lua: /usr/lib64/liblua5.4.so;/usr/lib64/libm.so (found suitable version "5.4.4", minimum required is "5.3") -- Found Cython: 0.29 -- Found uring: /usr/lib64/liburing.so -- Found Zstd: /usr/lib64/libzstd.so (found suitable version "1.5.2", minimum required is "1.4.4") -- Looking for wsyncup in /usr/lib64/libcurses.so -- Looking for wsyncup in /usr/lib64/libcurses.so - found -- Looking for cbreak in /usr/lib64/libncurses.so -- Looking for cbreak in /usr/lib64/libncurses.so - found -- Looking for nodelay in /usr/lib64/libncurses.so -- Looking for nodelay in /usr/lib64/libncurses.so - found -- Found Curses: /usr/lib64/libncurses.so -- Found nl: /usr/lib64/libnl-3.so -- Checking for module 'libcap-ng' -- Found libcap-ng, version 0.8.3 -- Found thrift: /usr/lib64/libthrift.so (Required is at least version "0.13") -- arrow is installed, radosgw/s3select-op is able to process parquet objects -- Found the following ICU libraries: -- uc (required): /usr/lib64/libicuuc.so -- Found ICU: /usr/include (found suitable version "71.1", minimum required is "52.0") CMake Warning at src/rgw/store/dbstore/CMakeLists.txt:47 (message): Gtest not enabled -- Performing Test COMPILER_SUPPORTS_WARN_IMPLICIT_CONST_INT_FLOAT_CONVERSION -- Performing Test COMPILER_SUPPORTS_WARN_IMPLICIT_CONST_INT_FLOAT_CONVERSION - Failed -- Found RabbitMQ: /usr/include -- Checking for one of the modules 'rdkafka' -- Found RDKafka: /usr/include (found suitable version "1.8.2", minimum required is "0.9.2") -- Found Doxygen: /usr/bin/doxygen (found version "1.8.10") found components: doxygen dot -- exclude following files under src: *.js;*.css;.tox;python-common/build;erasure-code/jerasure/jerasure;erasure-code/jerasure/gf-complete;rocksdb;googletest;spdk;xxHash;isa-l;zstd;crypto/isa-l/isa-l_crypto;blkin;rapidjson;dmclock;seastar;fmt;c-ares;spawn;pybind/mgr/rook/rook-client-python;s3select;libkmip;arrow;utf8proc -- Configuring done -- Generating done CMake Warning: Manually-specified variables were not used by the project: CMAKE_Fortran_FLAGS_PLD CMAKE_INSTALL_LOCALSTATEDIRPATH CMAKE_INSTALL_SHAREDSTATEDIRPATH FIO_INCLUDE_DIR PYTHON SYSCONF_INSTALL_DIR -- Build files have been written to: /tmp/B.9grlomhr/BUILD/ceph-17.2.3/build + /usr/bin/make -Otarget -j9 legacy-option-headers /usr/bin/cmake -S/tmp/B.9grlomhr/BUILD/ceph-17.2.3 -B/tmp/B.9grlomhr/BUILD/ceph-17.2.3/build --check-build-system CMakeFiles/Makefile.cmake 0 /usr/bin/make -f CMakeFiles/Makefile2 legacy-option-headers make[1]: Entering directory '/tmp/B.9grlomhr/BUILD/ceph-17.2.3/build' /usr/bin/cmake -S/tmp/B.9grlomhr/BUILD/ceph-17.2.3 -B/tmp/B.9grlomhr/BUILD/ceph-17.2.3/build --check-build-system CMakeFiles/Makefile.cmake 0 make[1]: Leaving directory '/tmp/B.9grlomhr/BUILD/ceph-17.2.3/build' make[1]: Entering directory '/tmp/B.9grlomhr/BUILD/ceph-17.2.3/build' /usr/bin/cmake -E cmake_progress_start /tmp/B.9grlomhr/BUILD/ceph-17.2.3/build/CMakeFiles 2 make[1]: Leaving directory '/tmp/B.9grlomhr/BUILD/ceph-17.2.3/build' /usr/bin/make -f CMakeFiles/Makefile2 src/common/options/CMakeFiles/legacy-option-headers.dir/all /usr/bin/make -f src/common/options/CMakeFiles/legacy-option-headers.dir/build.make src/common/options/CMakeFiles/legacy-option-headers.dir/depend make[3]: Entering directory '/tmp/B.9grlomhr/BUILD/ceph-17.2.3/build' cd /tmp/B.9grlomhr/BUILD/ceph-17.2.3/build && /usr/bin/cmake -E cmake_depends "Unix Makefiles" /tmp/B.9grlomhr/BUILD/ceph-17.2.3 /tmp/B.9grlomhr/BUILD/ceph-17.2.3/src/common/options /tmp/B.9grlomhr/BUILD/ceph-17.2.3/build /tmp/B.9grlomhr/BUILD/ceph-17.2.3/build/src/common/options /tmp/B.9grlomhr/BUILD/ceph-17.2.3/build/src/common/options/CMakeFiles/legacy-option-headers.dir/DependInfo.cmake --color= make[3]: Leaving directory '/tmp/B.9grlomhr/BUILD/ceph-17.2.3/build' /usr/bin/make -f src/common/options/CMakeFiles/legacy-option-headers.dir/build.make src/common/options/CMakeFiles/legacy-option-headers.dir/build make[3]: Entering directory '/tmp/B.9grlomhr/BUILD/ceph-17.2.3/build' [ 0%] Generating crimson.yaml cd /tmp/B.9grlomhr/BUILD/ceph-17.2.3/build/src/common/options && /usr/bin/cmake -D input_file=/tmp/B.9grlomhr/BUILD/ceph-17.2.3/src/common/options/crimson.yaml.in -D output_file=/tmp/B.9grlomhr/BUILD/ceph-17.2.3/build/src/common/options/crimson.yaml -P configure_file.cmake make[3]: Leaving directory '/tmp/B.9grlomhr/BUILD/ceph-17.2.3/build' make[3]: Entering directory '/tmp/B.9grlomhr/BUILD/ceph-17.2.3/build' [ 0%] Generating cephfs-mirror.yaml cd /tmp/B.9grlomhr/BUILD/ceph-17.2.3/build/src/common/options && /usr/bin/cmake -D input_file=/tmp/B.9grlomhr/BUILD/ceph-17.2.3/src/common/options/cephfs-mirror.yaml.in -D output_file=/tmp/B.9grlomhr/BUILD/ceph-17.2.3/build/src/common/options/cephfs-mirror.yaml -P configure_file.cmake make[3]: Leaving directory '/tmp/B.9grlomhr/BUILD/ceph-17.2.3/build' make[3]: Entering directory '/tmp/B.9grlomhr/BUILD/ceph-17.2.3/build' [ 0%] Generating immutable-object-cache.yaml cd /tmp/B.9grlomhr/BUILD/ceph-17.2.3/build/src/common/options && /usr/bin/cmake -D input_file=/tmp/B.9grlomhr/BUILD/ceph-17.2.3/src/common/options/immutable-object-cache.yaml.in -D output_file=/tmp/B.9grlomhr/BUILD/ceph-17.2.3/build/src/common/options/immutable-object-cache.yaml -P configure_file.cmake make[3]: Leaving directory '/tmp/B.9grlomhr/BUILD/ceph-17.2.3/build' make[3]: Entering directory '/tmp/B.9grlomhr/BUILD/ceph-17.2.3/build' [ 0%] Generating mds.yaml cd /tmp/B.9grlomhr/BUILD/ceph-17.2.3/build/src/common/options && /usr/bin/cmake -D input_file=/tmp/B.9grlomhr/BUILD/ceph-17.2.3/src/common/options/mds.yaml.in -D output_file=/tmp/B.9grlomhr/BUILD/ceph-17.2.3/build/src/common/options/mds.yaml -P configure_file.cmake make[3]: Leaving directory '/tmp/B.9grlomhr/BUILD/ceph-17.2.3/build' make[3]: Entering directory '/tmp/B.9grlomhr/BUILD/ceph-17.2.3/build' [ 0%] Generating mgr.yaml cd /tmp/B.9grlomhr/BUILD/ceph-17.2.3/build/src/common/options && /usr/bin/cmake -D input_file=/tmp/B.9grlomhr/BUILD/ceph-17.2.3/src/common/options/mgr.yaml.in -D output_file=/tmp/B.9grlomhr/BUILD/ceph-17.2.3/build/src/common/options/mgr.yaml -D CEPH_INSTALL_DATADIR=/usr/share/ceph -D mgr_disabled_modules=diskprediction_local -P configure_file.cmake make[3]: Leaving directory '/tmp/B.9grlomhr/BUILD/ceph-17.2.3/build' make[3]: Entering directory '/tmp/B.9grlomhr/BUILD/ceph-17.2.3/build' [ 0%] Generating global.yaml cd /tmp/B.9grlomhr/BUILD/ceph-17.2.3/build/src/common/options && /usr/bin/cmake -D input_file=/tmp/B.9grlomhr/BUILD/ceph-17.2.3/src/common/options/global.yaml.in -D output_file=/tmp/B.9grlomhr/BUILD/ceph-17.2.3/build/src/common/options/global.yaml -D CEPH_INSTALL_FULL_PKGLIBDIR=/usr/lib64/ceph -D CEPH_INSTALL_FULL_PKGLIBDIR=/usr/lib64/ceph -D "keyring_paths=/etc/ceph/\$cluster.\$name.keyring,/etc/ceph/\$cluster.keyring,/etc/ceph/keyring,/etc/ceph/keyring.bin" -D ms_bind_retry_count=3 -D ms_bind_retry_delay=5 -D "osd_erasure_code_plugins=jerasure lrc" -P configure_file.cmake make[3]: Leaving directory '/tmp/B.9grlomhr/BUILD/ceph-17.2.3/build' make[3]: Entering directory '/tmp/B.9grlomhr/BUILD/ceph-17.2.3/build' [ 0%] Generating mon.yaml cd /tmp/B.9grlomhr/BUILD/ceph-17.2.3/build/src/common/options && /usr/bin/cmake -D input_file=/tmp/B.9grlomhr/BUILD/ceph-17.2.3/src/common/options/mon.yaml.in -D output_file=/tmp/B.9grlomhr/BUILD/ceph-17.2.3/build/src/common/options/mon.yaml -P configure_file.cmake make[3]: Leaving directory '/tmp/B.9grlomhr/BUILD/ceph-17.2.3/build' make[3]: Entering directory '/tmp/B.9grlomhr/BUILD/ceph-17.2.3/build' [ 0%] Generating osd.yaml cd /tmp/B.9grlomhr/BUILD/ceph-17.2.3/build/src/common/options && /usr/bin/cmake -D input_file=/tmp/B.9grlomhr/BUILD/ceph-17.2.3/src/common/options/osd.yaml.in -D output_file=/tmp/B.9grlomhr/BUILD/ceph-17.2.3/build/src/common/options/osd.yaml -D CMAKE_INSTALL_LIBDIR=/usr/lib64 -P configure_file.cmake make[3]: Leaving directory '/tmp/B.9grlomhr/BUILD/ceph-17.2.3/build' make[3]: Entering directory '/tmp/B.9grlomhr/BUILD/ceph-17.2.3/build' [ 0%] Generating mds-client.yaml cd /tmp/B.9grlomhr/BUILD/ceph-17.2.3/build/src/common/options && /usr/bin/cmake -D input_file=/tmp/B.9grlomhr/BUILD/ceph-17.2.3/src/common/options/mds-client.yaml.in -D output_file=/tmp/B.9grlomhr/BUILD/ceph-17.2.3/build/src/common/options/mds-client.yaml -P configure_file.cmake make[3]: Leaving directory '/tmp/B.9grlomhr/BUILD/ceph-17.2.3/build' make[3]: Entering directory '/tmp/B.9grlomhr/BUILD/ceph-17.2.3/build' [ 0%] Generating rbd-mirror.yaml cd /tmp/B.9grlomhr/BUILD/ceph-17.2.3/build/src/common/options && /usr/bin/cmake -D input_file=/tmp/B.9grlomhr/BUILD/ceph-17.2.3/src/common/options/rbd-mirror.yaml.in -D output_file=/tmp/B.9grlomhr/BUILD/ceph-17.2.3/build/src/common/options/rbd-mirror.yaml -P configure_file.cmake make[3]: Leaving directory '/tmp/B.9grlomhr/BUILD/ceph-17.2.3/build' make[3]: Entering directory '/tmp/B.9grlomhr/BUILD/ceph-17.2.3/build' [ 50%] Generating rgw.yaml cd /tmp/B.9grlomhr/BUILD/ceph-17.2.3/build/src/common/options && /usr/bin/cmake -D input_file=/tmp/B.9grlomhr/BUILD/ceph-17.2.3/src/common/options/rgw.yaml.in -D output_file=/tmp/B.9grlomhr/BUILD/ceph-17.2.3/build/src/common/options/rgw.yaml -D rgw_luarocks_location=/tmp/luarocks -P configure_file.cmake make[3]: Leaving directory '/tmp/B.9grlomhr/BUILD/ceph-17.2.3/build' make[3]: Entering directory '/tmp/B.9grlomhr/BUILD/ceph-17.2.3/build' [ 50%] Generating rbd.yaml cd /tmp/B.9grlomhr/BUILD/ceph-17.2.3/build/src/common/options && /usr/bin/cmake -D input_file=/tmp/B.9grlomhr/BUILD/ceph-17.2.3/src/common/options/rbd.yaml.in -D output_file=/tmp/B.9grlomhr/BUILD/ceph-17.2.3/build/src/common/options/rbd.yaml -P configure_file.cmake make[3]: Leaving directory '/tmp/B.9grlomhr/BUILD/ceph-17.2.3/build' make[3]: Entering directory '/tmp/B.9grlomhr/BUILD/ceph-17.2.3/build' [ 50%] Generating crimson_options.cc, ../../../include/crimson_legacy_options.h cd /tmp/B.9grlomhr/BUILD/ceph-17.2.3/build/src/common/options && /usr/bin/python3.10 /tmp/B.9grlomhr/BUILD/ceph-17.2.3/src/common/options/y2c.py --input /tmp/B.9grlomhr/BUILD/ceph-17.2.3/build/src/common/options/crimson.yaml --output crimson_options.cc --legacy /tmp/B.9grlomhr/BUILD/ceph-17.2.3/build/include/crimson_legacy_options.h --name crimson make[3]: Leaving directory '/tmp/B.9grlomhr/BUILD/ceph-17.2.3/build' make[3]: Entering directory '/tmp/B.9grlomhr/BUILD/ceph-17.2.3/build' [ 50%] Generating cephfs-mirror_options.cc, ../../../include/cephfs-mirror_legacy_options.h cd /tmp/B.9grlomhr/BUILD/ceph-17.2.3/build/src/common/options && /usr/bin/python3.10 /tmp/B.9grlomhr/BUILD/ceph-17.2.3/src/common/options/y2c.py --input /tmp/B.9grlomhr/BUILD/ceph-17.2.3/build/src/common/options/cephfs-mirror.yaml --output cephfs-mirror_options.cc --legacy /tmp/B.9grlomhr/BUILD/ceph-17.2.3/build/include/cephfs-mirror_legacy_options.h --name cephfs-mirror make[3]: Leaving directory '/tmp/B.9grlomhr/BUILD/ceph-17.2.3/build' make[3]: Entering directory '/tmp/B.9grlomhr/BUILD/ceph-17.2.3/build' [ 50%] Generating immutable-object-cache_options.cc, ../../../include/immutable-object-cache_legacy_options.h cd /tmp/B.9grlomhr/BUILD/ceph-17.2.3/build/src/common/options && /usr/bin/python3.10 /tmp/B.9grlomhr/BUILD/ceph-17.2.3/src/common/options/y2c.py --input /tmp/B.9grlomhr/BUILD/ceph-17.2.3/build/src/common/options/immutable-object-cache.yaml --output immutable-object-cache_options.cc --legacy /tmp/B.9grlomhr/BUILD/ceph-17.2.3/build/include/immutable-object-cache_legacy_options.h --name immutable-object-cache make[3]: Leaving directory '/tmp/B.9grlomhr/BUILD/ceph-17.2.3/build' make[3]: Entering directory '/tmp/B.9grlomhr/BUILD/ceph-17.2.3/build' [ 50%] Generating mgr_options.cc, ../../../include/mgr_legacy_options.h cd /tmp/B.9grlomhr/BUILD/ceph-17.2.3/build/src/common/options && /usr/bin/python3.10 /tmp/B.9grlomhr/BUILD/ceph-17.2.3/src/common/options/y2c.py --input /tmp/B.9grlomhr/BUILD/ceph-17.2.3/build/src/common/options/mgr.yaml --output mgr_options.cc --legacy /tmp/B.9grlomhr/BUILD/ceph-17.2.3/build/include/mgr_legacy_options.h --name mgr make[3]: Leaving directory '/tmp/B.9grlomhr/BUILD/ceph-17.2.3/build' make[3]: Entering directory '/tmp/B.9grlomhr/BUILD/ceph-17.2.3/build' [100%] Generating rbd-mirror_options.cc, ../../../include/rbd-mirror_legacy_options.h cd /tmp/B.9grlomhr/BUILD/ceph-17.2.3/build/src/common/options && /usr/bin/python3.10 /tmp/B.9grlomhr/BUILD/ceph-17.2.3/src/common/options/y2c.py --input /tmp/B.9grlomhr/BUILD/ceph-17.2.3/build/src/common/options/rbd-mirror.yaml --output rbd-mirror_options.cc --legacy /tmp/B.9grlomhr/BUILD/ceph-17.2.3/build/include/rbd-mirror_legacy_options.h --name rbd-mirror make[3]: Leaving directory '/tmp/B.9grlomhr/BUILD/ceph-17.2.3/build' make[3]: Entering directory '/tmp/B.9grlomhr/BUILD/ceph-17.2.3/build' [100%] Generating mon_options.cc, ../../../include/mon_legacy_options.h cd /tmp/B.9grlomhr/BUILD/ceph-17.2.3/build/src/common/options && /usr/bin/python3.10 /tmp/B.9grlomhr/BUILD/ceph-17.2.3/src/common/options/y2c.py --input /tmp/B.9grlomhr/BUILD/ceph-17.2.3/build/src/common/options/mon.yaml --output mon_options.cc --legacy /tmp/B.9grlomhr/BUILD/ceph-17.2.3/build/include/mon_legacy_options.h --name mon make[3]: Leaving directory '/tmp/B.9grlomhr/BUILD/ceph-17.2.3/build' make[3]: Entering directory '/tmp/B.9grlomhr/BUILD/ceph-17.2.3/build' [100%] Generating osd_options.cc, ../../../include/osd_legacy_options.h cd /tmp/B.9grlomhr/BUILD/ceph-17.2.3/build/src/common/options && /usr/bin/python3.10 /tmp/B.9grlomhr/BUILD/ceph-17.2.3/src/common/options/y2c.py --input /tmp/B.9grlomhr/BUILD/ceph-17.2.3/build/src/common/options/osd.yaml --output osd_options.cc --legacy /tmp/B.9grlomhr/BUILD/ceph-17.2.3/build/include/osd_legacy_options.h --name osd make[3]: Leaving directory '/tmp/B.9grlomhr/BUILD/ceph-17.2.3/build' make[3]: Entering directory '/tmp/B.9grlomhr/BUILD/ceph-17.2.3/build' [100%] Generating rbd_options.cc, ../../../include/rbd_legacy_options.h cd /tmp/B.9grlomhr/BUILD/ceph-17.2.3/build/src/common/options && /usr/bin/python3.10 /tmp/B.9grlomhr/BUILD/ceph-17.2.3/src/common/options/y2c.py --input /tmp/B.9grlomhr/BUILD/ceph-17.2.3/build/src/common/options/rbd.yaml --output rbd_options.cc --legacy /tmp/B.9grlomhr/BUILD/ceph-17.2.3/build/include/rbd_legacy_options.h --name rbd make[3]: Leaving directory '/tmp/B.9grlomhr/BUILD/ceph-17.2.3/build' make[3]: Entering directory '/tmp/B.9grlomhr/BUILD/ceph-17.2.3/build' [ 50%] Generating mds_options.cc, ../../../include/mds_legacy_options.h cd /tmp/B.9grlomhr/BUILD/ceph-17.2.3/build/src/common/options && /usr/bin/python3.10 /tmp/B.9grlomhr/BUILD/ceph-17.2.3/src/common/options/y2c.py --input /tmp/B.9grlomhr/BUILD/ceph-17.2.3/build/src/common/options/mds.yaml --output mds_options.cc --legacy /tmp/B.9grlomhr/BUILD/ceph-17.2.3/build/include/mds_legacy_options.h --name mds make[3]: Leaving directory '/tmp/B.9grlomhr/BUILD/ceph-17.2.3/build' make[3]: Entering directory '/tmp/B.9grlomhr/BUILD/ceph-17.2.3/build' [100%] Generating mds-client_options.cc, ../../../include/mds-client_legacy_options.h cd /tmp/B.9grlomhr/BUILD/ceph-17.2.3/build/src/common/options && /usr/bin/python3.10 /tmp/B.9grlomhr/BUILD/ceph-17.2.3/src/common/options/y2c.py --input /tmp/B.9grlomhr/BUILD/ceph-17.2.3/build/src/common/options/mds-client.yaml --output mds-client_options.cc --legacy /tmp/B.9grlomhr/BUILD/ceph-17.2.3/build/include/mds-client_legacy_options.h --name mds-client make[3]: Leaving directory '/tmp/B.9grlomhr/BUILD/ceph-17.2.3/build' make[3]: Entering directory '/tmp/B.9grlomhr/BUILD/ceph-17.2.3/build' [100%] Generating rgw_options.cc, ../../../include/rgw_legacy_options.h cd /tmp/B.9grlomhr/BUILD/ceph-17.2.3/build/src/common/options && /usr/bin/python3.10 /tmp/B.9grlomhr/BUILD/ceph-17.2.3/src/common/options/y2c.py --input /tmp/B.9grlomhr/BUILD/ceph-17.2.3/build/src/common/options/rgw.yaml --output rgw_options.cc --legacy /tmp/B.9grlomhr/BUILD/ceph-17.2.3/build/include/rgw_legacy_options.h --name rgw make[3]: Leaving directory '/tmp/B.9grlomhr/BUILD/ceph-17.2.3/build' make[3]: Entering directory '/tmp/B.9grlomhr/BUILD/ceph-17.2.3/build' [ 50%] Generating global_options.cc, ../../../include/global_legacy_options.h cd /tmp/B.9grlomhr/BUILD/ceph-17.2.3/build/src/common/options && /usr/bin/python3.10 /tmp/B.9grlomhr/BUILD/ceph-17.2.3/src/common/options/y2c.py --input /tmp/B.9grlomhr/BUILD/ceph-17.2.3/build/src/common/options/global.yaml --output global_options.cc --legacy /tmp/B.9grlomhr/BUILD/ceph-17.2.3/build/include/global_legacy_options.h --name global make[3]: Leaving directory '/tmp/B.9grlomhr/BUILD/ceph-17.2.3/build' make[2]: Entering directory '/tmp/B.9grlomhr/BUILD/ceph-17.2.3/build' [100%] Built target legacy-option-headers make[2]: Leaving directory '/tmp/B.9grlomhr/BUILD/ceph-17.2.3/build' make[1]: Entering directory '/tmp/B.9grlomhr/BUILD/ceph-17.2.3/build' /usr/bin/cmake -E cmake_progress_start /tmp/B.9grlomhr/BUILD/ceph-17.2.3/build/CMakeFiles 0 make[1]: Leaving directory '/tmp/B.9grlomhr/BUILD/ceph-17.2.3/build' + /usr/bin/make -Otarget -j9 /usr/bin/cmake -S/tmp/B.9grlomhr/BUILD/ceph-17.2.3 -B/tmp/B.9grlomhr/BUILD/ceph-17.2.3/build --check-build-system CMakeFiles/Makefile.cmake 0 /usr/bin/cmake -E cmake_progress_start /tmp/B.9grlomhr/BUILD/ceph-17.2.3/build/CMakeFiles /tmp/B.9grlomhr/BUILD/ceph-17.2.3/build//CMakeFiles/progress.marks /usr/bin/make -f CMakeFiles/Makefile2 all /usr/bin/make -f src/tracing/CMakeFiles/oprequest-tp.dir/build.make src/tracing/CMakeFiles/oprequest-tp.dir/depend /usr/bin/make -f src/common/options/CMakeFiles/legacy-option-headers.dir/build.make src/common/options/CMakeFiles/legacy-option-headers.dir/depend /usr/bin/make -f src/compressor/CMakeFiles/compressor_objs.dir/build.make src/compressor/CMakeFiles/compressor_objs.dir/depend /usr/bin/make -f src/common/CMakeFiles/common_utf8.dir/build.make src/common/CMakeFiles/common_utf8.dir/depend /usr/bin/make -f src/common/CMakeFiles/common_buffer_obj.dir/build.make src/common/CMakeFiles/common_buffer_obj.dir/depend /usr/bin/make -f src/common/CMakeFiles/common_texttable_obj.dir/build.make src/common/CMakeFiles/common_texttable_obj.dir/depend /usr/bin/make -f src/common/CMakeFiles/common_mountcephfs_objs.dir/build.make src/common/CMakeFiles/common_mountcephfs_objs.dir/depend /usr/bin/make -f src/arch/CMakeFiles/arch.dir/build.make src/arch/CMakeFiles/arch.dir/depend /usr/bin/make -f src/common/options/CMakeFiles/common-options-objs.dir/build.make src/common/options/CMakeFiles/common-options-objs.dir/depend make[2]: Entering directory '/tmp/B.9grlomhr/BUILD/ceph-17.2.3/build' cd /tmp/B.9grlomhr/BUILD/ceph-17.2.3/build && /usr/bin/cmake -E cmake_depends "Unix Makefiles" /tmp/B.9grlomhr/BUILD/ceph-17.2.3 /tmp/B.9grlomhr/BUILD/ceph-17.2.3/src/tracing /tmp/B.9grlomhr/BUILD/ceph-17.2.3/build /tmp/B.9grlomhr/BUILD/ceph-17.2.3/build/src/tracing /tmp/B.9grlomhr/BUILD/ceph-17.2.3/build/src/tracing/CMakeFiles/oprequest-tp.dir/DependInfo.cmake --color= make[2]: Leaving directory '/tmp/B.9grlomhr/BUILD/ceph-17.2.3/build' make[2]: Entering directory '/tmp/B.9grlomhr/BUILD/ceph-17.2.3/build' cd /tmp/B.9grlomhr/BUILD/ceph-17.2.3/build && /usr/bin/cmake -E cmake_depends "Unix Makefiles" /tmp/B.9grlomhr/BUILD/ceph-17.2.3 /tmp/B.9grlomhr/BUILD/ceph-17.2.3/src/common /tmp/B.9grlomhr/BUILD/ceph-17.2.3/build /tmp/B.9grlomhr/BUILD/ceph-17.2.3/build/src/common /tmp/B.9grlomhr/BUILD/ceph-17.2.3/build/src/common/CMakeFiles/common_texttable_obj.dir/DependInfo.cmake --color= make[2]: Leaving directory '/tmp/B.9grlomhr/BUILD/ceph-17.2.3/build' /usr/bin/make -f src/tracing/CMakeFiles/oprequest-tp.dir/build.make src/tracing/CMakeFiles/oprequest-tp.dir/build make[2]: Entering directory '/tmp/B.9grlomhr/BUILD/ceph-17.2.3/build' cd /tmp/B.9grlomhr/BUILD/ceph-17.2.3/build && /usr/bin/cmake -E cmake_depends "Unix Makefiles" /tmp/B.9grlomhr/BUILD/ceph-17.2.3 /tmp/B.9grlomhr/BUILD/ceph-17.2.3/src/compressor /tmp/B.9grlomhr/BUILD/ceph-17.2.3/build /tmp/B.9grlomhr/BUILD/ceph-17.2.3/build/src/compressor /tmp/B.9grlomhr/BUILD/ceph-17.2.3/build/src/compressor/CMakeFiles/compressor_objs.dir/DependInfo.cmake --color= make[2]: Leaving directory '/tmp/B.9grlomhr/BUILD/ceph-17.2.3/build' /usr/bin/make -f src/common/CMakeFiles/common_texttable_obj.dir/build.make src/common/CMakeFiles/common_texttable_obj.dir/build make[2]: Entering directory '/tmp/B.9grlomhr/BUILD/ceph-17.2.3/build' cd /tmp/B.9grlomhr/BUILD/ceph-17.2.3/build && /usr/bin/cmake -E cmake_depends "Unix Makefiles" /tmp/B.9grlomhr/BUILD/ceph-17.2.3 /tmp/B.9grlomhr/BUILD/ceph-17.2.3/src/common /tmp/B.9grlomhr/BUILD/ceph-17.2.3/build /tmp/B.9grlomhr/BUILD/ceph-17.2.3/build/src/common /tmp/B.9grlomhr/BUILD/ceph-17.2.3/build/src/common/CMakeFiles/common_buffer_obj.dir/DependInfo.cmake --color= make[2]: Leaving directory '/tmp/B.9grlomhr/BUILD/ceph-17.2.3/build' make[2]: Entering directory '/tmp/B.9grlomhr/BUILD/ceph-17.2.3/build' cd /tmp/B.9grlomhr/BUILD/ceph-17.2.3/build && /usr/bin/cmake -E cmake_depends "Unix Makefiles" /tmp/B.9grlomhr/BUILD/ceph-17.2.3 /tmp/B.9grlomhr/BUILD/ceph-17.2.3/src/common /tmp/B.9grlomhr/BUILD/ceph-17.2.3/build /tmp/B.9grlomhr/BUILD/ceph-17.2.3/build/src/common /tmp/B.9grlomhr/BUILD/ceph-17.2.3/build/src/common/CMakeFiles/common_mountcephfs_objs.dir/DependInfo.cmake --color= make[2]: Leaving directory '/tmp/B.9grlomhr/BUILD/ceph-17.2.3/build' make[2]: Entering directory '/tmp/B.9grlomhr/BUILD/ceph-17.2.3/build' cd /tmp/B.9grlomhr/BUILD/ceph-17.2.3/build && /usr/bin/cmake -E cmake_depends "Unix Makefiles" /tmp/B.9grlomhr/BUILD/ceph-17.2.3 /tmp/B.9grlomhr/BUILD/ceph-17.2.3/src/common/options /tmp/B.9grlomhr/BUILD/ceph-17.2.3/build /tmp/B.9grlomhr/BUILD/ceph-17.2.3/build/src/common/options /tmp/B.9grlomhr/BUILD/ceph-17.2.3/build/src/common/options/CMakeFiles/legacy-option-headers.dir/DependInfo.cmake --color= make[2]: Leaving directory '/tmp/B.9grlomhr/BUILD/ceph-17.2.3/build' make[2]: Entering directory '/tmp/B.9grlomhr/BUILD/ceph-17.2.3/build' cd /tmp/B.9grlomhr/BUILD/ceph-17.2.3/build && /usr/bin/cmake -E cmake_depends "Unix Makefiles" /tmp/B.9grlomhr/BUILD/ceph-17.2.3 /tmp/B.9grlomhr/BUILD/ceph-17.2.3/src/common /tmp/B.9grlomhr/BUILD/ceph-17.2.3/build /tmp/B.9grlomhr/BUILD/ceph-17.2.3/build/src/common /tmp/B.9grlomhr/BUILD/ceph-17.2.3/build/src/common/CMakeFiles/common_utf8.dir/DependInfo.cmake --color= make[2]: Leaving directory '/tmp/B.9grlomhr/BUILD/ceph-17.2.3/build' /usr/bin/make -f src/common/CMakeFiles/common_buffer_obj.dir/build.make src/common/CMakeFiles/common_buffer_obj.dir/build /usr/bin/make -f src/common/CMakeFiles/common_mountcephfs_objs.dir/build.make src/common/CMakeFiles/common_mountcephfs_objs.dir/build /usr/bin/make -f src/common/options/CMakeFiles/legacy-option-headers.dir/build.make src/common/options/CMakeFiles/legacy-option-headers.dir/build make[2]: Entering directory '/tmp/B.9grlomhr/BUILD/ceph-17.2.3/build' cd /tmp/B.9grlomhr/BUILD/ceph-17.2.3/build && /usr/bin/cmake -E cmake_depends "Unix Makefiles" /tmp/B.9grlomhr/BUILD/ceph-17.2.3 /tmp/B.9grlomhr/BUILD/ceph-17.2.3/src/arch /tmp/B.9grlomhr/BUILD/ceph-17.2.3/build /tmp/B.9grlomhr/BUILD/ceph-17.2.3/build/src/arch /tmp/B.9grlomhr/BUILD/ceph-17.2.3/build/src/arch/CMakeFiles/arch.dir/DependInfo.cmake --color= make[2]: Leaving directory '/tmp/B.9grlomhr/BUILD/ceph-17.2.3/build' /usr/bin/make -f src/compressor/CMakeFiles/compressor_objs.dir/build.make src/compressor/CMakeFiles/compressor_objs.dir/build /usr/bin/make -f src/common/CMakeFiles/common_utf8.dir/build.make src/common/CMakeFiles/common_utf8.dir/build make[2]: Nothing to be done for 'src/common/options/CMakeFiles/legacy-option-headers.dir/build'. /usr/bin/make -f src/arch/CMakeFiles/arch.dir/build.make src/arch/CMakeFiles/arch.dir/build make[2]: Entering directory '/tmp/B.9grlomhr/BUILD/ceph-17.2.3/build' cd /tmp/B.9grlomhr/BUILD/ceph-17.2.3/build && /usr/bin/cmake -E cmake_depends "Unix Makefiles" /tmp/B.9grlomhr/BUILD/ceph-17.2.3 /tmp/B.9grlomhr/BUILD/ceph-17.2.3/src/common/options /tmp/B.9grlomhr/BUILD/ceph-17.2.3/build /tmp/B.9grlomhr/BUILD/ceph-17.2.3/build/src/common/options /tmp/B.9grlomhr/BUILD/ceph-17.2.3/build/src/common/options/CMakeFiles/common-options-objs.dir/DependInfo.cmake --color= make[2]: Leaving directory '/tmp/B.9grlomhr/BUILD/ceph-17.2.3/build' /usr/bin/make -f src/common/options/CMakeFiles/common-options-objs.dir/build.make src/common/options/CMakeFiles/common-options-objs.dir/build make[1]: Entering directory '/tmp/B.9grlomhr/BUILD/ceph-17.2.3/build' [ 3%] Built target legacy-option-headers make[1]: Leaving directory '/tmp/B.9grlomhr/BUILD/ceph-17.2.3/build' make[2]: Entering directory '/tmp/B.9grlomhr/BUILD/ceph-17.2.3/build' [ 1%] generating /tmp/B.9grlomhr/BUILD/ceph-17.2.3/build/include/tracing/oprequest.h cd /tmp/B.9grlomhr/BUILD/ceph-17.2.3/build/include && /usr/bin/lttng-gen-tp /tmp/B.9grlomhr/BUILD/ceph-17.2.3/src/tracing/oprequest.tp -o tracing/oprequest.h make[2]: Leaving directory '/tmp/B.9grlomhr/BUILD/ceph-17.2.3/build' make[2]: Entering directory '/tmp/B.9grlomhr/BUILD/ceph-17.2.3/build' [ 3%] Building CXX object src/arch/CMakeFiles/arch.dir/probe.cc.o cd /tmp/B.9grlomhr/BUILD/ceph-17.2.3/build/src/arch && /usr/bin/x86_64-pld-linux-g++ -DBOOST_ASIO_DISABLE_THREAD_KEYWORD_EXTENSION -DBOOST_ASIO_USE_TS_EXECUTOR_AS_DEFAULT -DHAVE_CONFIG_H -D_FILE_OFFSET_BITS=64 -D_FORTIFY_SOURCE=2 -D_GNU_SOURCE -D_REENTRANT -D_THREAD_SAFE -D__CEPH__ -D__STDC_FORMAT_MACROS -D__linux__ -I/tmp/B.9grlomhr/BUILD/ceph-17.2.3/build/src/include -I/tmp/B.9grlomhr/BUILD/ceph-17.2.3/src -isystem /tmp/B.9grlomhr/BUILD/ceph-17.2.3/build/include -isystem /tmp/B.9grlomhr/BUILD/ceph-17.2.3/src/xxHash -isystem /tmp/B.9grlomhr/BUILD/ceph-17.2.3/src/rapidjson/include -O2 -fwrapv -pipe -Wformat -Werror=format-security -gdwarf-4 -fno-debug-types-section -fvar-tracking-assignments -g2 -Wp,-D_FORTIFY_SOURCE=2 -fstack-protector-strong --param=ssp-buffer-size=4 -Werror=trampolines -fPIC -march=x86-64 -mtune=generic -gdwarf-4 -fno-debug-types-section -fvar-tracking-assignments -g2 -DNDEBUG -DQT_NO_DEBUG -fPIC -U_FORTIFY_SOURCE -Wall -fno-strict-aliasing -fsigned-char -Wtype-limits -Wignored-qualifiers -Wpointer-arith -Werror=format-security -Winit-self -Wno-unknown-pragmas -Wnon-virtual-dtor -Wno-ignored-qualifiers -ftemplate-depth-1024 -Wpessimizing-move -Wredundant-move -Wstrict-null-sentinel -Woverloaded-virtual -fno-new-ttp-matching -fstack-protector-strong -fdiagnostics-color=auto -fno-builtin-malloc -fno-builtin-calloc -fno-builtin-realloc -fno-builtin-free -std=c++17 -MD -MT src/arch/CMakeFiles/arch.dir/probe.cc.o -MF CMakeFiles/arch.dir/probe.cc.o.d -o CMakeFiles/arch.dir/probe.cc.o -c /tmp/B.9grlomhr/BUILD/ceph-17.2.3/src/arch/probe.cc make[2]: Leaving directory '/tmp/B.9grlomhr/BUILD/ceph-17.2.3/build' make[1]: Entering directory '/tmp/B.9grlomhr/BUILD/ceph-17.2.3/build' [ 4%] Built target oprequest-tp make[1]: Leaving directory '/tmp/B.9grlomhr/BUILD/ceph-17.2.3/build' make[2]: Entering directory '/tmp/B.9grlomhr/BUILD/ceph-17.2.3/build' [ 1%] Building C object src/common/CMakeFiles/common_mountcephfs_objs.dir/armor.c.o cd /tmp/B.9grlomhr/BUILD/ceph-17.2.3/build/src/common && /usr/bin/x86_64-pld-linux-gcc -DBOOST_ASIO_DISABLE_THREAD_KEYWORD_EXTENSION -DBOOST_ASIO_USE_TS_EXECUTOR_AS_DEFAULT -DHAVE_CONFIG_H -D_FILE_OFFSET_BITS=64 -D_FORTIFY_SOURCE=2 -D_GNU_SOURCE -D_REENTRANT -D_THREAD_SAFE -D__CEPH__ -D__STDC_FORMAT_MACROS -D__linux__ -I/tmp/B.9grlomhr/BUILD/ceph-17.2.3/build/src/include -I/tmp/B.9grlomhr/BUILD/ceph-17.2.3/src -isystem /tmp/B.9grlomhr/BUILD/ceph-17.2.3/build/include -isystem /tmp/B.9grlomhr/BUILD/ceph-17.2.3/src/xxHash -isystem /tmp/B.9grlomhr/BUILD/ceph-17.2.3/src/rapidjson/include -O2 -fwrapv -pipe -Wformat -Werror=format-security -gdwarf-4 -fno-debug-types-section -fvar-tracking-assignments -g2 -Wp,-D_FORTIFY_SOURCE=2 -fstack-protector-strong --param=ssp-buffer-size=4 -Werror=trampolines -fPIC -march=x86-64 -mtune=generic -gdwarf-4 -fno-debug-types-section -fvar-tracking-assignments -g2 -DNDEBUG -DQT_NO_DEBUG -fPIC -U_FORTIFY_SOURCE -Wall -fno-strict-aliasing -fsigned-char -Wtype-limits -Wignored-qualifiers -Wpointer-arith -Werror=format-security -Winit-self -Wno-unknown-pragmas -fstack-protector-strong -fdiagnostics-color=auto -std=gnu99 -MD -MT src/common/CMakeFiles/common_mountcephfs_objs.dir/armor.c.o -MF CMakeFiles/common_mountcephfs_objs.dir/armor.c.o.d -o CMakeFiles/common_mountcephfs_objs.dir/armor.c.o -c /tmp/B.9grlomhr/BUILD/ceph-17.2.3/src/common/armor.c make[2]: Leaving directory '/tmp/B.9grlomhr/BUILD/ceph-17.2.3/build' /usr/bin/make -f src/crush/CMakeFiles/crush_objs.dir/build.make src/crush/CMakeFiles/crush_objs.dir/depend make[2]: Entering directory '/tmp/B.9grlomhr/BUILD/ceph-17.2.3/build' [ 1%] Building C object src/common/CMakeFiles/common_utf8.dir/utf8.c.o cd /tmp/B.9grlomhr/BUILD/ceph-17.2.3/build/src/common && /usr/bin/x86_64-pld-linux-gcc -DBOOST_ASIO_DISABLE_THREAD_KEYWORD_EXTENSION -DBOOST_ASIO_USE_TS_EXECUTOR_AS_DEFAULT -DHAVE_CONFIG_H -D_FILE_OFFSET_BITS=64 -D_FORTIFY_SOURCE=2 -D_GNU_SOURCE -D_REENTRANT -D_THREAD_SAFE -D__CEPH__ -D__STDC_FORMAT_MACROS -D__linux__ -I/tmp/B.9grlomhr/BUILD/ceph-17.2.3/build/src/include -I/tmp/B.9grlomhr/BUILD/ceph-17.2.3/src -isystem /tmp/B.9grlomhr/BUILD/ceph-17.2.3/build/include -isystem /tmp/B.9grlomhr/BUILD/ceph-17.2.3/src/xxHash -isystem /tmp/B.9grlomhr/BUILD/ceph-17.2.3/src/rapidjson/include -O2 -fwrapv -pipe -Wformat -Werror=format-security -gdwarf-4 -fno-debug-types-section -fvar-tracking-assignments -g2 -Wp,-D_FORTIFY_SOURCE=2 -fstack-protector-strong --param=ssp-buffer-size=4 -Werror=trampolines -fPIC -march=x86-64 -mtune=generic -gdwarf-4 -fno-debug-types-section -fvar-tracking-assignments -g2 -DNDEBUG -DQT_NO_DEBUG -fPIC -U_FORTIFY_SOURCE -Wall -fno-strict-aliasing -fsigned-char -Wtype-limits -Wignored-qualifiers -Wpointer-arith -Werror=format-security -Winit-self -Wno-unknown-pragmas -fstack-protector-strong -fdiagnostics-color=auto -std=gnu99 -MD -MT src/common/CMakeFiles/common_utf8.dir/utf8.c.o -MF CMakeFiles/common_utf8.dir/utf8.c.o.d -o CMakeFiles/common_utf8.dir/utf8.c.o -c /tmp/B.9grlomhr/BUILD/ceph-17.2.3/src/common/utf8.c make[2]: Leaving directory '/tmp/B.9grlomhr/BUILD/ceph-17.2.3/build' make[2]: Entering directory '/tmp/B.9grlomhr/BUILD/ceph-17.2.3/build' [ 4%] Building C object src/arch/CMakeFiles/arch.dir/intel.c.o cd /tmp/B.9grlomhr/BUILD/ceph-17.2.3/build/src/arch && /usr/bin/x86_64-pld-linux-gcc -DBOOST_ASIO_DISABLE_THREAD_KEYWORD_EXTENSION -DBOOST_ASIO_USE_TS_EXECUTOR_AS_DEFAULT -DHAVE_CONFIG_H -D_FILE_OFFSET_BITS=64 -D_FORTIFY_SOURCE=2 -D_GNU_SOURCE -D_REENTRANT -D_THREAD_SAFE -D__CEPH__ -D__STDC_FORMAT_MACROS -D__linux__ -I/tmp/B.9grlomhr/BUILD/ceph-17.2.3/build/src/include -I/tmp/B.9grlomhr/BUILD/ceph-17.2.3/src -isystem /tmp/B.9grlomhr/BUILD/ceph-17.2.3/build/include -isystem /tmp/B.9grlomhr/BUILD/ceph-17.2.3/src/xxHash -isystem /tmp/B.9grlomhr/BUILD/ceph-17.2.3/src/rapidjson/include -O2 -fwrapv -pipe -Wformat -Werror=format-security -gdwarf-4 -fno-debug-types-section -fvar-tracking-assignments -g2 -Wp,-D_FORTIFY_SOURCE=2 -fstack-protector-strong --param=ssp-buffer-size=4 -Werror=trampolines -fPIC -march=x86-64 -mtune=generic -gdwarf-4 -fno-debug-types-section -fvar-tracking-assignments -g2 -DNDEBUG -DQT_NO_DEBUG -fPIC -U_FORTIFY_SOURCE -Wall -fno-strict-aliasing -fsigned-char -Wtype-limits -Wignored-qualifiers -Wpointer-arith -Werror=format-security -Winit-self -Wno-unknown-pragmas -fstack-protector-strong -fdiagnostics-color=auto -std=gnu99 -MD -MT src/arch/CMakeFiles/arch.dir/intel.c.o -MF CMakeFiles/arch.dir/intel.c.o.d -o CMakeFiles/arch.dir/intel.c.o -c /tmp/B.9grlomhr/BUILD/ceph-17.2.3/src/arch/intel.c make[2]: Leaving directory '/tmp/B.9grlomhr/BUILD/ceph-17.2.3/build' make[2]: Entering directory '/tmp/B.9grlomhr/BUILD/ceph-17.2.3/build' cd /tmp/B.9grlomhr/BUILD/ceph-17.2.3/build && /usr/bin/cmake -E cmake_depends "Unix Makefiles" /tmp/B.9grlomhr/BUILD/ceph-17.2.3 /tmp/B.9grlomhr/BUILD/ceph-17.2.3/src/crush /tmp/B.9grlomhr/BUILD/ceph-17.2.3/build /tmp/B.9grlomhr/BUILD/ceph-17.2.3/build/src/crush /tmp/B.9grlomhr/BUILD/ceph-17.2.3/build/src/crush/CMakeFiles/crush_objs.dir/DependInfo.cmake --color= make[2]: Leaving directory '/tmp/B.9grlomhr/BUILD/ceph-17.2.3/build' /usr/bin/make -f src/crush/CMakeFiles/crush_objs.dir/build.make src/crush/CMakeFiles/crush_objs.dir/build make[2]: Entering directory '/tmp/B.9grlomhr/BUILD/ceph-17.2.3/build' [ 4%] Linking C static library ../../lib/libcommon_utf8.a cd /tmp/B.9grlomhr/BUILD/ceph-17.2.3/build/src/common && /usr/bin/cmake -P CMakeFiles/common_utf8.dir/cmake_clean_target.cmake cd /tmp/B.9grlomhr/BUILD/ceph-17.2.3/build/src/common && /usr/bin/cmake -E cmake_link_script CMakeFiles/common_utf8.dir/link.txt --verbose=1 /usr/bin/ar qc ../../lib/libcommon_utf8.a CMakeFiles/common_utf8.dir/utf8.c.o /usr/bin/ranlib ../../lib/libcommon_utf8.a make[2]: Leaving directory '/tmp/B.9grlomhr/BUILD/ceph-17.2.3/build' make[2]: Entering directory '/tmp/B.9grlomhr/BUILD/ceph-17.2.3/build' [ 4%] Linking CXX static library ../../lib/libarch.a cd /tmp/B.9grlomhr/BUILD/ceph-17.2.3/build/src/arch && /usr/bin/cmake -P CMakeFiles/arch.dir/cmake_clean_target.cmake cd /tmp/B.9grlomhr/BUILD/ceph-17.2.3/build/src/arch && /usr/bin/cmake -E cmake_link_script CMakeFiles/arch.dir/link.txt --verbose=1 /usr/bin/ar qc ../../lib/libarch.a CMakeFiles/arch.dir/probe.cc.o CMakeFiles/arch.dir/intel.c.o /usr/bin/ranlib ../../lib/libarch.a make[2]: Leaving directory '/tmp/B.9grlomhr/BUILD/ceph-17.2.3/build' make[1]: Entering directory '/tmp/B.9grlomhr/BUILD/ceph-17.2.3/build' [ 4%] Built target common_utf8 make[1]: Leaving directory '/tmp/B.9grlomhr/BUILD/ceph-17.2.3/build' /usr/bin/make -f src/msg/CMakeFiles/common-msg-objs.dir/build.make src/msg/CMakeFiles/common-msg-objs.dir/depend make[2]: Entering directory '/tmp/B.9grlomhr/BUILD/ceph-17.2.3/build' [ 4%] Building C object src/common/CMakeFiles/common_mountcephfs_objs.dir/module.c.o cd /tmp/B.9grlomhr/BUILD/ceph-17.2.3/build/src/common && /usr/bin/x86_64-pld-linux-gcc -DBOOST_ASIO_DISABLE_THREAD_KEYWORD_EXTENSION -DBOOST_ASIO_USE_TS_EXECUTOR_AS_DEFAULT -DHAVE_CONFIG_H -D_FILE_OFFSET_BITS=64 -D_FORTIFY_SOURCE=2 -D_GNU_SOURCE -D_REENTRANT -D_THREAD_SAFE -D__CEPH__ -D__STDC_FORMAT_MACROS -D__linux__ -I/tmp/B.9grlomhr/BUILD/ceph-17.2.3/build/src/include -I/tmp/B.9grlomhr/BUILD/ceph-17.2.3/src -isystem /tmp/B.9grlomhr/BUILD/ceph-17.2.3/build/include -isystem /tmp/B.9grlomhr/BUILD/ceph-17.2.3/src/xxHash -isystem /tmp/B.9grlomhr/BUILD/ceph-17.2.3/src/rapidjson/include -O2 -fwrapv -pipe -Wformat -Werror=format-security -gdwarf-4 -fno-debug-types-section -fvar-tracking-assignments -g2 -Wp,-D_FORTIFY_SOURCE=2 -fstack-protector-strong --param=ssp-buffer-size=4 -Werror=trampolines -fPIC -march=x86-64 -mtune=generic -gdwarf-4 -fno-debug-types-section -fvar-tracking-assignments -g2 -DNDEBUG -DQT_NO_DEBUG -fPIC -U_FORTIFY_SOURCE -Wall -fno-strict-aliasing -fsigned-char -Wtype-limits -Wignored-qualifiers -Wpointer-arith -Werror=format-security -Winit-self -Wno-unknown-pragmas -fstack-protector-strong -fdiagnostics-color=auto -std=gnu99 -MD -MT src/common/CMakeFiles/common_mountcephfs_objs.dir/module.c.o -MF CMakeFiles/common_mountcephfs_objs.dir/module.c.o.d -o CMakeFiles/common_mountcephfs_objs.dir/module.c.o -c /tmp/B.9grlomhr/BUILD/ceph-17.2.3/src/common/module.c make[2]: Leaving directory '/tmp/B.9grlomhr/BUILD/ceph-17.2.3/build' make[1]: Entering directory '/tmp/B.9grlomhr/BUILD/ceph-17.2.3/build' [ 4%] Built target arch make[1]: Leaving directory '/tmp/B.9grlomhr/BUILD/ceph-17.2.3/build' make[2]: Entering directory '/tmp/B.9grlomhr/BUILD/ceph-17.2.3/build' cd /tmp/B.9grlomhr/BUILD/ceph-17.2.3/build && /usr/bin/cmake -E cmake_depends "Unix Makefiles" /tmp/B.9grlomhr/BUILD/ceph-17.2.3 /tmp/B.9grlomhr/BUILD/ceph-17.2.3/src/msg /tmp/B.9grlomhr/BUILD/ceph-17.2.3/build /tmp/B.9grlomhr/BUILD/ceph-17.2.3/build/src/msg /tmp/B.9grlomhr/BUILD/ceph-17.2.3/build/src/msg/CMakeFiles/common-msg-objs.dir/DependInfo.cmake --color= make[2]: Leaving directory '/tmp/B.9grlomhr/BUILD/ceph-17.2.3/build' /usr/bin/make -f src/msg/CMakeFiles/common-msg-objs.dir/build.make src/msg/CMakeFiles/common-msg-objs.dir/build make[2]: Entering directory '/tmp/B.9grlomhr/BUILD/ceph-17.2.3/build' [ 4%] Building C object src/common/CMakeFiles/common_mountcephfs_objs.dir/safe_io.c.o cd /tmp/B.9grlomhr/BUILD/ceph-17.2.3/build/src/common && /usr/bin/x86_64-pld-linux-gcc -DBOOST_ASIO_DISABLE_THREAD_KEYWORD_EXTENSION -DBOOST_ASIO_USE_TS_EXECUTOR_AS_DEFAULT -DHAVE_CONFIG_H -D_FILE_OFFSET_BITS=64 -D_FORTIFY_SOURCE=2 -D_GNU_SOURCE -D_REENTRANT -D_THREAD_SAFE -D__CEPH__ -D__STDC_FORMAT_MACROS -D__linux__ -I/tmp/B.9grlomhr/BUILD/ceph-17.2.3/build/src/include -I/tmp/B.9grlomhr/BUILD/ceph-17.2.3/src -isystem /tmp/B.9grlomhr/BUILD/ceph-17.2.3/build/include -isystem /tmp/B.9grlomhr/BUILD/ceph-17.2.3/src/xxHash -isystem /tmp/B.9grlomhr/BUILD/ceph-17.2.3/src/rapidjson/include -O2 -fwrapv -pipe -Wformat -Werror=format-security -gdwarf-4 -fno-debug-types-section -fvar-tracking-assignments -g2 -Wp,-D_FORTIFY_SOURCE=2 -fstack-protector-strong --param=ssp-buffer-size=4 -Werror=trampolines -fPIC -march=x86-64 -mtune=generic -gdwarf-4 -fno-debug-types-section -fvar-tracking-assignments -g2 -DNDEBUG -DQT_NO_DEBUG -fPIC -U_FORTIFY_SOURCE -Wall -fno-strict-aliasing -fsigned-char -Wtype-limits -Wignored-qualifiers -Wpointer-arith -Werror=format-security -Winit-self -Wno-unknown-pragmas -fstack-protector-strong -fdiagnostics-color=auto -std=gnu99 -MD -MT src/common/CMakeFiles/common_mountcephfs_objs.dir/safe_io.c.o -MF CMakeFiles/common_mountcephfs_objs.dir/safe_io.c.o.d -o CMakeFiles/common_mountcephfs_objs.dir/safe_io.c.o -c /tmp/B.9grlomhr/BUILD/ceph-17.2.3/src/common/safe_io.c make[2]: Leaving directory '/tmp/B.9grlomhr/BUILD/ceph-17.2.3/build' make[2]: Entering directory '/tmp/B.9grlomhr/BUILD/ceph-17.2.3/build' [ 4%] Building C object src/common/CMakeFiles/common_mountcephfs_objs.dir/addr_parsing.c.o cd /tmp/B.9grlomhr/BUILD/ceph-17.2.3/build/src/common && /usr/bin/x86_64-pld-linux-gcc -DBOOST_ASIO_DISABLE_THREAD_KEYWORD_EXTENSION -DBOOST_ASIO_USE_TS_EXECUTOR_AS_DEFAULT -DHAVE_CONFIG_H -D_FILE_OFFSET_BITS=64 -D_FORTIFY_SOURCE=2 -D_GNU_SOURCE -D_REENTRANT -D_THREAD_SAFE -D__CEPH__ -D__STDC_FORMAT_MACROS -D__linux__ -I/tmp/B.9grlomhr/BUILD/ceph-17.2.3/build/src/include -I/tmp/B.9grlomhr/BUILD/ceph-17.2.3/src -isystem /tmp/B.9grlomhr/BUILD/ceph-17.2.3/build/include -isystem /tmp/B.9grlomhr/BUILD/ceph-17.2.3/src/xxHash -isystem /tmp/B.9grlomhr/BUILD/ceph-17.2.3/src/rapidjson/include -O2 -fwrapv -pipe -Wformat -Werror=format-security -gdwarf-4 -fno-debug-types-section -fvar-tracking-assignments -g2 -Wp,-D_FORTIFY_SOURCE=2 -fstack-protector-strong --param=ssp-buffer-size=4 -Werror=trampolines -fPIC -march=x86-64 -mtune=generic -gdwarf-4 -fno-debug-types-section -fvar-tracking-assignments -g2 -DNDEBUG -DQT_NO_DEBUG -fPIC -U_FORTIFY_SOURCE -Wall -fno-strict-aliasing -fsigned-char -Wtype-limits -Wignored-qualifiers -Wpointer-arith -Werror=format-security -Winit-self -Wno-unknown-pragmas -fstack-protector-strong -fdiagnostics-color=auto -std=gnu99 -MD -MT src/common/CMakeFiles/common_mountcephfs_objs.dir/addr_parsing.c.o -MF CMakeFiles/common_mountcephfs_objs.dir/addr_parsing.c.o.d -o CMakeFiles/common_mountcephfs_objs.dir/addr_parsing.c.o -c /tmp/B.9grlomhr/BUILD/ceph-17.2.3/src/common/addr_parsing.c make[2]: Leaving directory '/tmp/B.9grlomhr/BUILD/ceph-17.2.3/build' make[1]: Entering directory '/tmp/B.9grlomhr/BUILD/ceph-17.2.3/build' [ 4%] Built target common_mountcephfs_objs make[1]: Leaving directory '/tmp/B.9grlomhr/BUILD/ceph-17.2.3/build' make[2]: Entering directory '/tmp/B.9grlomhr/BUILD/ceph-17.2.3/build' [ 0%] Building CXX object src/common/CMakeFiles/common_texttable_obj.dir/TextTable.cc.o cd /tmp/B.9grlomhr/BUILD/ceph-17.2.3/build/src/common && /usr/bin/x86_64-pld-linux-g++ -DBOOST_ASIO_DISABLE_THREAD_KEYWORD_EXTENSION -DBOOST_ASIO_USE_TS_EXECUTOR_AS_DEFAULT -DHAVE_CONFIG_H -D_FILE_OFFSET_BITS=64 -D_FORTIFY_SOURCE=2 -D_GNU_SOURCE -D_REENTRANT -D_THREAD_SAFE -D__CEPH__ -D__STDC_FORMAT_MACROS -D__linux__ -I/tmp/B.9grlomhr/BUILD/ceph-17.2.3/build/src/include -I/tmp/B.9grlomhr/BUILD/ceph-17.2.3/src -isystem /tmp/B.9grlomhr/BUILD/ceph-17.2.3/build/include -isystem /tmp/B.9grlomhr/BUILD/ceph-17.2.3/src/xxHash -isystem /tmp/B.9grlomhr/BUILD/ceph-17.2.3/src/rapidjson/include -O2 -fwrapv -pipe -Wformat -Werror=format-security -gdwarf-4 -fno-debug-types-section -fvar-tracking-assignments -g2 -Wp,-D_FORTIFY_SOURCE=2 -fstack-protector-strong --param=ssp-buffer-size=4 -Werror=trampolines -fPIC -march=x86-64 -mtune=generic -gdwarf-4 -fno-debug-types-section -fvar-tracking-assignments -g2 -DNDEBUG -DQT_NO_DEBUG -fPIC -U_FORTIFY_SOURCE -Wall -fno-strict-aliasing -fsigned-char -Wtype-limits -Wignored-qualifiers -Wpointer-arith -Werror=format-security -Winit-self -Wno-unknown-pragmas -Wnon-virtual-dtor -Wno-ignored-qualifiers -ftemplate-depth-1024 -Wpessimizing-move -Wredundant-move -Wstrict-null-sentinel -Woverloaded-virtual -fno-new-ttp-matching -fstack-protector-strong -fdiagnostics-color=auto -fno-builtin-malloc -fno-builtin-calloc -fno-builtin-realloc -fno-builtin-free -std=c++17 -MD -MT src/common/CMakeFiles/common_texttable_obj.dir/TextTable.cc.o -MF CMakeFiles/common_texttable_obj.dir/TextTable.cc.o.d -o CMakeFiles/common_texttable_obj.dir/TextTable.cc.o -c /tmp/B.9grlomhr/BUILD/ceph-17.2.3/src/common/TextTable.cc make[2]: Leaving directory '/tmp/B.9grlomhr/BUILD/ceph-17.2.3/build' make[2]: Entering directory '/tmp/B.9grlomhr/BUILD/ceph-17.2.3/build' [ 4%] Building C object src/crush/CMakeFiles/crush_objs.dir/builder.c.o cd /tmp/B.9grlomhr/BUILD/ceph-17.2.3/build/src/crush && /usr/bin/x86_64-pld-linux-gcc -DBOOST_ASIO_DISABLE_THREAD_KEYWORD_EXTENSION -DBOOST_ASIO_USE_TS_EXECUTOR_AS_DEFAULT -DHAVE_CONFIG_H -D_FILE_OFFSET_BITS=64 -D_FORTIFY_SOURCE=2 -D_GNU_SOURCE -D_REENTRANT -D_THREAD_SAFE -D__CEPH__ -D__STDC_FORMAT_MACROS -D__linux__ -I/tmp/B.9grlomhr/BUILD/ceph-17.2.3/build/src/include -I/tmp/B.9grlomhr/BUILD/ceph-17.2.3/src -isystem /tmp/B.9grlomhr/BUILD/ceph-17.2.3/build/include -isystem /tmp/B.9grlomhr/BUILD/ceph-17.2.3/src/xxHash -isystem /tmp/B.9grlomhr/BUILD/ceph-17.2.3/src/rapidjson/include -O2 -fwrapv -pipe -Wformat -Werror=format-security -gdwarf-4 -fno-debug-types-section -fvar-tracking-assignments -g2 -Wp,-D_FORTIFY_SOURCE=2 -fstack-protector-strong --param=ssp-buffer-size=4 -Werror=trampolines -fPIC -march=x86-64 -mtune=generic -gdwarf-4 -fno-debug-types-section -fvar-tracking-assignments -g2 -DNDEBUG -DQT_NO_DEBUG -fPIC -U_FORTIFY_SOURCE -Wall -fno-strict-aliasing -fsigned-char -Wtype-limits -Wignored-qualifiers -Wpointer-arith -Werror=format-security -Winit-self -Wno-unknown-pragmas -fstack-protector-strong -fdiagnostics-color=auto -std=gnu99 -MD -MT src/crush/CMakeFiles/crush_objs.dir/builder.c.o -MF CMakeFiles/crush_objs.dir/builder.c.o.d -o CMakeFiles/crush_objs.dir/builder.c.o -c /tmp/B.9grlomhr/BUILD/ceph-17.2.3/src/crush/builder.c make[2]: Leaving directory '/tmp/B.9grlomhr/BUILD/ceph-17.2.3/build' make[1]: Entering directory '/tmp/B.9grlomhr/BUILD/ceph-17.2.3/build' [ 4%] Built target common_texttable_obj make[1]: Leaving directory '/tmp/B.9grlomhr/BUILD/ceph-17.2.3/build' make[2]: Entering directory '/tmp/B.9grlomhr/BUILD/ceph-17.2.3/build' [ 4%] Building C object src/crush/CMakeFiles/crush_objs.dir/mapper.c.o cd /tmp/B.9grlomhr/BUILD/ceph-17.2.3/build/src/crush && /usr/bin/x86_64-pld-linux-gcc -DBOOST_ASIO_DISABLE_THREAD_KEYWORD_EXTENSION -DBOOST_ASIO_USE_TS_EXECUTOR_AS_DEFAULT -DHAVE_CONFIG_H -D_FILE_OFFSET_BITS=64 -D_FORTIFY_SOURCE=2 -D_GNU_SOURCE -D_REENTRANT -D_THREAD_SAFE -D__CEPH__ -D__STDC_FORMAT_MACROS -D__linux__ -I/tmp/B.9grlomhr/BUILD/ceph-17.2.3/build/src/include -I/tmp/B.9grlomhr/BUILD/ceph-17.2.3/src -isystem /tmp/B.9grlomhr/BUILD/ceph-17.2.3/build/include -isystem /tmp/B.9grlomhr/BUILD/ceph-17.2.3/src/xxHash -isystem /tmp/B.9grlomhr/BUILD/ceph-17.2.3/src/rapidjson/include -O2 -fwrapv -pipe -Wformat -Werror=format-security -gdwarf-4 -fno-debug-types-section -fvar-tracking-assignments -g2 -Wp,-D_FORTIFY_SOURCE=2 -fstack-protector-strong --param=ssp-buffer-size=4 -Werror=trampolines -fPIC -march=x86-64 -mtune=generic -gdwarf-4 -fno-debug-types-section -fvar-tracking-assignments -g2 -DNDEBUG -DQT_NO_DEBUG -fPIC -U_FORTIFY_SOURCE -Wall -fno-strict-aliasing -fsigned-char -Wtype-limits -Wignored-qualifiers -Wpointer-arith -Werror=format-security -Winit-self -Wno-unknown-pragmas -fstack-protector-strong -fdiagnostics-color=auto -std=gnu99 -MD -MT src/crush/CMakeFiles/crush_objs.dir/mapper.c.o -MF CMakeFiles/crush_objs.dir/mapper.c.o.d -o CMakeFiles/crush_objs.dir/mapper.c.o -c /tmp/B.9grlomhr/BUILD/ceph-17.2.3/src/crush/mapper.c make[2]: Leaving directory '/tmp/B.9grlomhr/BUILD/ceph-17.2.3/build' make[2]: Entering directory '/tmp/B.9grlomhr/BUILD/ceph-17.2.3/build' [ 4%] Building C object src/crush/CMakeFiles/crush_objs.dir/crush.c.o cd /tmp/B.9grlomhr/BUILD/ceph-17.2.3/build/src/crush && /usr/bin/x86_64-pld-linux-gcc -DBOOST_ASIO_DISABLE_THREAD_KEYWORD_EXTENSION -DBOOST_ASIO_USE_TS_EXECUTOR_AS_DEFAULT -DHAVE_CONFIG_H -D_FILE_OFFSET_BITS=64 -D_FORTIFY_SOURCE=2 -D_GNU_SOURCE -D_REENTRANT -D_THREAD_SAFE -D__CEPH__ -D__STDC_FORMAT_MACROS -D__linux__ -I/tmp/B.9grlomhr/BUILD/ceph-17.2.3/build/src/include -I/tmp/B.9grlomhr/BUILD/ceph-17.2.3/src -isystem /tmp/B.9grlomhr/BUILD/ceph-17.2.3/build/include -isystem /tmp/B.9grlomhr/BUILD/ceph-17.2.3/src/xxHash -isystem /tmp/B.9grlomhr/BUILD/ceph-17.2.3/src/rapidjson/include -O2 -fwrapv -pipe -Wformat -Werror=format-security -gdwarf-4 -fno-debug-types-section -fvar-tracking-assignments -g2 -Wp,-D_FORTIFY_SOURCE=2 -fstack-protector-strong --param=ssp-buffer-size=4 -Werror=trampolines -fPIC -march=x86-64 -mtune=generic -gdwarf-4 -fno-debug-types-section -fvar-tracking-assignments -g2 -DNDEBUG -DQT_NO_DEBUG -fPIC -U_FORTIFY_SOURCE -Wall -fno-strict-aliasing -fsigned-char -Wtype-limits -Wignored-qualifiers -Wpointer-arith -Werror=format-security -Winit-self -Wno-unknown-pragmas -fstack-protector-strong -fdiagnostics-color=auto -std=gnu99 -MD -MT src/crush/CMakeFiles/crush_objs.dir/crush.c.o -MF CMakeFiles/crush_objs.dir/crush.c.o.d -o CMakeFiles/crush_objs.dir/crush.c.o -c /tmp/B.9grlomhr/BUILD/ceph-17.2.3/src/crush/crush.c make[2]: Leaving directory '/tmp/B.9grlomhr/BUILD/ceph-17.2.3/build' make[2]: Entering directory '/tmp/B.9grlomhr/BUILD/ceph-17.2.3/build' [ 4%] Building C object src/crush/CMakeFiles/crush_objs.dir/hash.c.o cd /tmp/B.9grlomhr/BUILD/ceph-17.2.3/build/src/crush && /usr/bin/x86_64-pld-linux-gcc -DBOOST_ASIO_DISABLE_THREAD_KEYWORD_EXTENSION -DBOOST_ASIO_USE_TS_EXECUTOR_AS_DEFAULT -DHAVE_CONFIG_H -D_FILE_OFFSET_BITS=64 -D_FORTIFY_SOURCE=2 -D_GNU_SOURCE -D_REENTRANT -D_THREAD_SAFE -D__CEPH__ -D__STDC_FORMAT_MACROS -D__linux__ -I/tmp/B.9grlomhr/BUILD/ceph-17.2.3/build/src/include -I/tmp/B.9grlomhr/BUILD/ceph-17.2.3/src -isystem /tmp/B.9grlomhr/BUILD/ceph-17.2.3/build/include -isystem /tmp/B.9grlomhr/BUILD/ceph-17.2.3/src/xxHash -isystem /tmp/B.9grlomhr/BUILD/ceph-17.2.3/src/rapidjson/include -O2 -fwrapv -pipe -Wformat -Werror=format-security -gdwarf-4 -fno-debug-types-section -fvar-tracking-assignments -g2 -Wp,-D_FORTIFY_SOURCE=2 -fstack-protector-strong --param=ssp-buffer-size=4 -Werror=trampolines -fPIC -march=x86-64 -mtune=generic -gdwarf-4 -fno-debug-types-section -fvar-tracking-assignments -g2 -DNDEBUG -DQT_NO_DEBUG -fPIC -U_FORTIFY_SOURCE -Wall -fno-strict-aliasing -fsigned-char -Wtype-limits -Wignored-qualifiers -Wpointer-arith -Werror=format-security -Winit-self -Wno-unknown-pragmas -fstack-protector-strong -fdiagnostics-color=auto -std=gnu99 -MD -MT src/crush/CMakeFiles/crush_objs.dir/hash.c.o -MF CMakeFiles/crush_objs.dir/hash.c.o.d -o CMakeFiles/crush_objs.dir/hash.c.o -c /tmp/B.9grlomhr/BUILD/ceph-17.2.3/src/crush/hash.c make[2]: Leaving directory '/tmp/B.9grlomhr/BUILD/ceph-17.2.3/build' make[2]: Entering directory '/tmp/B.9grlomhr/BUILD/ceph-17.2.3/build' [ 4%] Building CXX object src/common/options/CMakeFiles/common-options-objs.dir/build_options.cc.o cd /tmp/B.9grlomhr/BUILD/ceph-17.2.3/build/src/common/options && /usr/bin/x86_64-pld-linux-g++ -DBOOST_ASIO_DISABLE_THREAD_KEYWORD_EXTENSION -DBOOST_ASIO_USE_TS_EXECUTOR_AS_DEFAULT -DHAVE_CONFIG_H -D_FILE_OFFSET_BITS=64 -D_FORTIFY_SOURCE=2 -D_GNU_SOURCE -D_REENTRANT -D_THREAD_SAFE -D__CEPH__ -D__STDC_FORMAT_MACROS -D__linux__ -I/tmp/B.9grlomhr/BUILD/ceph-17.2.3/build/src/include -I/tmp/B.9grlomhr/BUILD/ceph-17.2.3/src -isystem /tmp/B.9grlomhr/BUILD/ceph-17.2.3/build/include -isystem /tmp/B.9grlomhr/BUILD/ceph-17.2.3/src/xxHash -isystem /tmp/B.9grlomhr/BUILD/ceph-17.2.3/src/rapidjson/include -O2 -fwrapv -pipe -Wformat -Werror=format-security -gdwarf-4 -fno-debug-types-section -fvar-tracking-assignments -g2 -Wp,-D_FORTIFY_SOURCE=2 -fstack-protector-strong --param=ssp-buffer-size=4 -Werror=trampolines -fPIC -march=x86-64 -mtune=generic -gdwarf-4 -fno-debug-types-section -fvar-tracking-assignments -g2 -DNDEBUG -DQT_NO_DEBUG -fPIC -U_FORTIFY_SOURCE -Wall -fno-strict-aliasing -fsigned-char -Wtype-limits -Wignored-qualifiers -Wpointer-arith -Werror=format-security -Winit-self -Wno-unknown-pragmas -Wnon-virtual-dtor -Wno-ignored-qualifiers -ftemplate-depth-1024 -Wpessimizing-move -Wredundant-move -Wstrict-null-sentinel -Woverloaded-virtual -fno-new-ttp-matching -fstack-protector-strong -fdiagnostics-color=auto -fno-builtin-malloc -fno-builtin-calloc -fno-builtin-realloc -fno-builtin-free -std=c++17 -MD -MT src/common/options/CMakeFiles/common-options-objs.dir/build_options.cc.o -MF CMakeFiles/common-options-objs.dir/build_options.cc.o.d -o CMakeFiles/common-options-objs.dir/build_options.cc.o -c /tmp/B.9grlomhr/BUILD/ceph-17.2.3/src/common/options/build_options.cc make[2]: Leaving directory '/tmp/B.9grlomhr/BUILD/ceph-17.2.3/build' make[2]: Entering directory '/tmp/B.9grlomhr/BUILD/ceph-17.2.3/build' [ 4%] Building CXX object src/common/options/CMakeFiles/common-options-objs.dir/cephfs-mirror_options.cc.o cd /tmp/B.9grlomhr/BUILD/ceph-17.2.3/build/src/common/options && /usr/bin/x86_64-pld-linux-g++ -DBOOST_ASIO_DISABLE_THREAD_KEYWORD_EXTENSION -DBOOST_ASIO_USE_TS_EXECUTOR_AS_DEFAULT -DHAVE_CONFIG_H -D_FILE_OFFSET_BITS=64 -D_FORTIFY_SOURCE=2 -D_GNU_SOURCE -D_REENTRANT -D_THREAD_SAFE -D__CEPH__ -D__STDC_FORMAT_MACROS -D__linux__ -I/tmp/B.9grlomhr/BUILD/ceph-17.2.3/build/src/include -I/tmp/B.9grlomhr/BUILD/ceph-17.2.3/src -isystem /tmp/B.9grlomhr/BUILD/ceph-17.2.3/build/include -isystem /tmp/B.9grlomhr/BUILD/ceph-17.2.3/src/xxHash -isystem /tmp/B.9grlomhr/BUILD/ceph-17.2.3/src/rapidjson/include -O2 -fwrapv -pipe -Wformat -Werror=format-security -gdwarf-4 -fno-debug-types-section -fvar-tracking-assignments -g2 -Wp,-D_FORTIFY_SOURCE=2 -fstack-protector-strong --param=ssp-buffer-size=4 -Werror=trampolines -fPIC -march=x86-64 -mtune=generic -gdwarf-4 -fno-debug-types-section -fvar-tracking-assignments -g2 -DNDEBUG -DQT_NO_DEBUG -fPIC -U_FORTIFY_SOURCE -Wall -fno-strict-aliasing -fsigned-char -Wtype-limits -Wignored-qualifiers -Wpointer-arith -Werror=format-security -Winit-self -Wno-unknown-pragmas -Wnon-virtual-dtor -Wno-ignored-qualifiers -ftemplate-depth-1024 -Wpessimizing-move -Wredundant-move -Wstrict-null-sentinel -Woverloaded-virtual -fno-new-ttp-matching -fstack-protector-strong -fdiagnostics-color=auto -fno-builtin-malloc -fno-builtin-calloc -fno-builtin-realloc -fno-builtin-free -std=c++17 -MD -MT src/common/options/CMakeFiles/common-options-objs.dir/cephfs-mirror_options.cc.o -MF CMakeFiles/common-options-objs.dir/cephfs-mirror_options.cc.o.d -o CMakeFiles/common-options-objs.dir/cephfs-mirror_options.cc.o -c /tmp/B.9grlomhr/BUILD/ceph-17.2.3/build/src/common/options/cephfs-mirror_options.cc make[2]: Leaving directory '/tmp/B.9grlomhr/BUILD/ceph-17.2.3/build' make[2]: Entering directory '/tmp/B.9grlomhr/BUILD/ceph-17.2.3/build' [ 4%] Building CXX object src/common/options/CMakeFiles/common-options-objs.dir/crimson_options.cc.o cd /tmp/B.9grlomhr/BUILD/ceph-17.2.3/build/src/common/options && /usr/bin/x86_64-pld-linux-g++ -DBOOST_ASIO_DISABLE_THREAD_KEYWORD_EXTENSION -DBOOST_ASIO_USE_TS_EXECUTOR_AS_DEFAULT -DHAVE_CONFIG_H -D_FILE_OFFSET_BITS=64 -D_FORTIFY_SOURCE=2 -D_GNU_SOURCE -D_REENTRANT -D_THREAD_SAFE -D__CEPH__ -D__STDC_FORMAT_MACROS -D__linux__ -I/tmp/B.9grlomhr/BUILD/ceph-17.2.3/build/src/include -I/tmp/B.9grlomhr/BUILD/ceph-17.2.3/src -isystem /tmp/B.9grlomhr/BUILD/ceph-17.2.3/build/include -isystem /tmp/B.9grlomhr/BUILD/ceph-17.2.3/src/xxHash -isystem /tmp/B.9grlomhr/BUILD/ceph-17.2.3/src/rapidjson/include -O2 -fwrapv -pipe -Wformat -Werror=format-security -gdwarf-4 -fno-debug-types-section -fvar-tracking-assignments -g2 -Wp,-D_FORTIFY_SOURCE=2 -fstack-protector-strong --param=ssp-buffer-size=4 -Werror=trampolines -fPIC -march=x86-64 -mtune=generic -gdwarf-4 -fno-debug-types-section -fvar-tracking-assignments -g2 -DNDEBUG -DQT_NO_DEBUG -fPIC -U_FORTIFY_SOURCE -Wall -fno-strict-aliasing -fsigned-char -Wtype-limits -Wignored-qualifiers -Wpointer-arith -Werror=format-security -Winit-self -Wno-unknown-pragmas -Wnon-virtual-dtor -Wno-ignored-qualifiers -ftemplate-depth-1024 -Wpessimizing-move -Wredundant-move -Wstrict-null-sentinel -Woverloaded-virtual -fno-new-ttp-matching -fstack-protector-strong -fdiagnostics-color=auto -fno-builtin-malloc -fno-builtin-calloc -fno-builtin-realloc -fno-builtin-free -std=c++17 -MD -MT src/common/options/CMakeFiles/common-options-objs.dir/crimson_options.cc.o -MF CMakeFiles/common-options-objs.dir/crimson_options.cc.o.d -o CMakeFiles/common-options-objs.dir/crimson_options.cc.o -c /tmp/B.9grlomhr/BUILD/ceph-17.2.3/build/src/common/options/crimson_options.cc make[2]: Leaving directory '/tmp/B.9grlomhr/BUILD/ceph-17.2.3/build' make[2]: Entering directory '/tmp/B.9grlomhr/BUILD/ceph-17.2.3/build' [ 1%] Building CXX object src/common/CMakeFiles/common_buffer_obj.dir/buffer.cc.o cd /tmp/B.9grlomhr/BUILD/ceph-17.2.3/build/src/common && /usr/bin/x86_64-pld-linux-g++ -DBOOST_ASIO_DISABLE_THREAD_KEYWORD_EXTENSION -DBOOST_ASIO_USE_TS_EXECUTOR_AS_DEFAULT -DHAVE_CONFIG_H -D_FILE_OFFSET_BITS=64 -D_FORTIFY_SOURCE=2 -D_GNU_SOURCE -D_REENTRANT -D_THREAD_SAFE -D__CEPH__ -D__STDC_FORMAT_MACROS -D__linux__ -I/tmp/B.9grlomhr/BUILD/ceph-17.2.3/build/src/include -I/tmp/B.9grlomhr/BUILD/ceph-17.2.3/src -isystem /tmp/B.9grlomhr/BUILD/ceph-17.2.3/build/include -isystem /tmp/B.9grlomhr/BUILD/ceph-17.2.3/src/xxHash -isystem /tmp/B.9grlomhr/BUILD/ceph-17.2.3/src/rapidjson/include -O2 -fwrapv -pipe -Wformat -Werror=format-security -gdwarf-4 -fno-debug-types-section -fvar-tracking-assignments -g2 -Wp,-D_FORTIFY_SOURCE=2 -fstack-protector-strong --param=ssp-buffer-size=4 -Werror=trampolines -fPIC -march=x86-64 -mtune=generic -gdwarf-4 -fno-debug-types-section -fvar-tracking-assignments -g2 -DNDEBUG -DQT_NO_DEBUG -fPIC -U_FORTIFY_SOURCE -Wall -fno-strict-aliasing -fsigned-char -Wtype-limits -Wignored-qualifiers -Wpointer-arith -Werror=format-security -Winit-self -Wno-unknown-pragmas -Wnon-virtual-dtor -Wno-ignored-qualifiers -ftemplate-depth-1024 -Wpessimizing-move -Wredundant-move -Wstrict-null-sentinel -Woverloaded-virtual -fno-new-ttp-matching -fstack-protector-strong -fdiagnostics-color=auto -fno-builtin-malloc -fno-builtin-calloc -fno-builtin-realloc -fno-builtin-free -std=c++17 -MD -MT src/common/CMakeFiles/common_buffer_obj.dir/buffer.cc.o -MF CMakeFiles/common_buffer_obj.dir/buffer.cc.o.d -o CMakeFiles/common_buffer_obj.dir/buffer.cc.o -c /tmp/B.9grlomhr/BUILD/ceph-17.2.3/src/common/buffer.cc make[2]: Leaving directory '/tmp/B.9grlomhr/BUILD/ceph-17.2.3/build' make[1]: Entering directory '/tmp/B.9grlomhr/BUILD/ceph-17.2.3/build' [ 4%] Built target common_buffer_obj make[1]: Leaving directory '/tmp/B.9grlomhr/BUILD/ceph-17.2.3/build' make[2]: Entering directory '/tmp/B.9grlomhr/BUILD/ceph-17.2.3/build' [ 3%] Building CXX object src/compressor/CMakeFiles/compressor_objs.dir/Compressor.cc.o cd /tmp/B.9grlomhr/BUILD/ceph-17.2.3/build/src/compressor && /usr/bin/x86_64-pld-linux-g++ -DBOOST_ASIO_DISABLE_THREAD_KEYWORD_EXTENSION -DBOOST_ASIO_USE_TS_EXECUTOR_AS_DEFAULT -DHAVE_CONFIG_H -D_FILE_OFFSET_BITS=64 -D_FORTIFY_SOURCE=2 -D_GNU_SOURCE -D_REENTRANT -D_THREAD_SAFE -D__CEPH__ -D__STDC_FORMAT_MACROS -D__linux__ -I/tmp/B.9grlomhr/BUILD/ceph-17.2.3/build/src/include -I/tmp/B.9grlomhr/BUILD/ceph-17.2.3/src -isystem /tmp/B.9grlomhr/BUILD/ceph-17.2.3/build/include -isystem /tmp/B.9grlomhr/BUILD/ceph-17.2.3/src/xxHash -isystem /tmp/B.9grlomhr/BUILD/ceph-17.2.3/src/rapidjson/include -O2 -fwrapv -pipe -Wformat -Werror=format-security -gdwarf-4 -fno-debug-types-section -fvar-tracking-assignments -g2 -Wp,-D_FORTIFY_SOURCE=2 -fstack-protector-strong --param=ssp-buffer-size=4 -Werror=trampolines -fPIC -march=x86-64 -mtune=generic -gdwarf-4 -fno-debug-types-section -fvar-tracking-assignments -g2 -DNDEBUG -DQT_NO_DEBUG -fPIC -U_FORTIFY_SOURCE -Wall -fno-strict-aliasing -fsigned-char -Wtype-limits -Wignored-qualifiers -Wpointer-arith -Werror=format-security -Winit-self -Wno-unknown-pragmas -Wnon-virtual-dtor -Wno-ignored-qualifiers -ftemplate-depth-1024 -Wpessimizing-move -Wredundant-move -Wstrict-null-sentinel -Woverloaded-virtual -fno-new-ttp-matching -fstack-protector-strong -fdiagnostics-color=auto -fno-builtin-malloc -fno-builtin-calloc -fno-builtin-realloc -fno-builtin-free -std=c++17 -MD -MT src/compressor/CMakeFiles/compressor_objs.dir/Compressor.cc.o -MF CMakeFiles/compressor_objs.dir/Compressor.cc.o.d -o CMakeFiles/compressor_objs.dir/Compressor.cc.o -c /tmp/B.9grlomhr/BUILD/ceph-17.2.3/src/compressor/Compressor.cc make[2]: Leaving directory '/tmp/B.9grlomhr/BUILD/ceph-17.2.3/build' /usr/bin/make -f src/erasure-code/CMakeFiles/erasure_code.dir/build.make src/erasure-code/CMakeFiles/erasure_code.dir/depend make[2]: Entering directory '/tmp/B.9grlomhr/BUILD/ceph-17.2.3/build' cd /tmp/B.9grlomhr/BUILD/ceph-17.2.3/build && /usr/bin/cmake -E cmake_depends "Unix Makefiles" /tmp/B.9grlomhr/BUILD/ceph-17.2.3 /tmp/B.9grlomhr/BUILD/ceph-17.2.3/src/erasure-code /tmp/B.9grlomhr/BUILD/ceph-17.2.3/build /tmp/B.9grlomhr/BUILD/ceph-17.2.3/build/src/erasure-code /tmp/B.9grlomhr/BUILD/ceph-17.2.3/build/src/erasure-code/CMakeFiles/erasure_code.dir/DependInfo.cmake --color= make[2]: Leaving directory '/tmp/B.9grlomhr/BUILD/ceph-17.2.3/build' /usr/bin/make -f src/erasure-code/CMakeFiles/erasure_code.dir/build.make src/erasure-code/CMakeFiles/erasure_code.dir/build make[2]: Entering directory '/tmp/B.9grlomhr/BUILD/ceph-17.2.3/build' [ 4%] Building CXX object src/common/options/CMakeFiles/common-options-objs.dir/mgr_options.cc.o cd /tmp/B.9grlomhr/BUILD/ceph-17.2.3/build/src/common/options && /usr/bin/x86_64-pld-linux-g++ -DBOOST_ASIO_DISABLE_THREAD_KEYWORD_EXTENSION -DBOOST_ASIO_USE_TS_EXECUTOR_AS_DEFAULT -DHAVE_CONFIG_H -D_FILE_OFFSET_BITS=64 -D_FORTIFY_SOURCE=2 -D_GNU_SOURCE -D_REENTRANT -D_THREAD_SAFE -D__CEPH__ -D__STDC_FORMAT_MACROS -D__linux__ -I/tmp/B.9grlomhr/BUILD/ceph-17.2.3/build/src/include -I/tmp/B.9grlomhr/BUILD/ceph-17.2.3/src -isystem /tmp/B.9grlomhr/BUILD/ceph-17.2.3/build/include -isystem /tmp/B.9grlomhr/BUILD/ceph-17.2.3/src/xxHash -isystem /tmp/B.9grlomhr/BUILD/ceph-17.2.3/src/rapidjson/include -O2 -fwrapv -pipe -Wformat -Werror=format-security -gdwarf-4 -fno-debug-types-section -fvar-tracking-assignments -g2 -Wp,-D_FORTIFY_SOURCE=2 -fstack-protector-strong --param=ssp-buffer-size=4 -Werror=trampolines -fPIC -march=x86-64 -mtune=generic -gdwarf-4 -fno-debug-types-section -fvar-tracking-assignments -g2 -DNDEBUG -DQT_NO_DEBUG -fPIC -U_FORTIFY_SOURCE -Wall -fno-strict-aliasing -fsigned-char -Wtype-limits -Wignored-qualifiers -Wpointer-arith -Werror=format-security -Winit-self -Wno-unknown-pragmas -Wnon-virtual-dtor -Wno-ignored-qualifiers -ftemplate-depth-1024 -Wpessimizing-move -Wredundant-move -Wstrict-null-sentinel -Woverloaded-virtual -fno-new-ttp-matching -fstack-protector-strong -fdiagnostics-color=auto -fno-builtin-malloc -fno-builtin-calloc -fno-builtin-realloc -fno-builtin-free -std=c++17 -MD -MT src/common/options/CMakeFiles/common-options-objs.dir/mgr_options.cc.o -MF CMakeFiles/common-options-objs.dir/mgr_options.cc.o.d -o CMakeFiles/common-options-objs.dir/mgr_options.cc.o -c /tmp/B.9grlomhr/BUILD/ceph-17.2.3/build/src/common/options/mgr_options.cc make[2]: Leaving directory '/tmp/B.9grlomhr/BUILD/ceph-17.2.3/build' /usr/bin/make -f src/CMakeFiles/rados_snap_set_diff_obj.dir/build.make src/CMakeFiles/rados_snap_set_diff_obj.dir/depend make[2]: Entering directory '/tmp/B.9grlomhr/BUILD/ceph-17.2.3/build' cd /tmp/B.9grlomhr/BUILD/ceph-17.2.3/build && /usr/bin/cmake -E cmake_depends "Unix Makefiles" /tmp/B.9grlomhr/BUILD/ceph-17.2.3 /tmp/B.9grlomhr/BUILD/ceph-17.2.3/src /tmp/B.9grlomhr/BUILD/ceph-17.2.3/build /tmp/B.9grlomhr/BUILD/ceph-17.2.3/build/src /tmp/B.9grlomhr/BUILD/ceph-17.2.3/build/src/CMakeFiles/rados_snap_set_diff_obj.dir/DependInfo.cmake --color= make[2]: Leaving directory '/tmp/B.9grlomhr/BUILD/ceph-17.2.3/build' /usr/bin/make -f src/CMakeFiles/rados_snap_set_diff_obj.dir/build.make src/CMakeFiles/rados_snap_set_diff_obj.dir/build make[2]: Entering directory '/tmp/B.9grlomhr/BUILD/ceph-17.2.3/build' [ 4%] Building CXX object src/compressor/CMakeFiles/compressor_objs.dir/QatAccel.cc.o cd /tmp/B.9grlomhr/BUILD/ceph-17.2.3/build/src/compressor && /usr/bin/x86_64-pld-linux-g++ -DBOOST_ASIO_DISABLE_THREAD_KEYWORD_EXTENSION -DBOOST_ASIO_USE_TS_EXECUTOR_AS_DEFAULT -DHAVE_CONFIG_H -D_FILE_OFFSET_BITS=64 -D_FORTIFY_SOURCE=2 -D_GNU_SOURCE -D_REENTRANT -D_THREAD_SAFE -D__CEPH__ -D__STDC_FORMAT_MACROS -D__linux__ -I/tmp/B.9grlomhr/BUILD/ceph-17.2.3/build/src/include -I/tmp/B.9grlomhr/BUILD/ceph-17.2.3/src -isystem /tmp/B.9grlomhr/BUILD/ceph-17.2.3/build/include -isystem /tmp/B.9grlomhr/BUILD/ceph-17.2.3/src/xxHash -isystem /tmp/B.9grlomhr/BUILD/ceph-17.2.3/src/rapidjson/include -O2 -fwrapv -pipe -Wformat -Werror=format-security -gdwarf-4 -fno-debug-types-section -fvar-tracking-assignments -g2 -Wp,-D_FORTIFY_SOURCE=2 -fstack-protector-strong --param=ssp-buffer-size=4 -Werror=trampolines -fPIC -march=x86-64 -mtune=generic -gdwarf-4 -fno-debug-types-section -fvar-tracking-assignments -g2 -DNDEBUG -DQT_NO_DEBUG -fPIC -U_FORTIFY_SOURCE -Wall -fno-strict-aliasing -fsigned-char -Wtype-limits -Wignored-qualifiers -Wpointer-arith -Werror=format-security -Winit-self -Wno-unknown-pragmas -Wnon-virtual-dtor -Wno-ignored-qualifiers -ftemplate-depth-1024 -Wpessimizing-move -Wredundant-move -Wstrict-null-sentinel -Woverloaded-virtual -fno-new-ttp-matching -fstack-protector-strong -fdiagnostics-color=auto -fno-builtin-malloc -fno-builtin-calloc -fno-builtin-realloc -fno-builtin-free -std=c++17 -MD -MT src/compressor/CMakeFiles/compressor_objs.dir/QatAccel.cc.o -MF CMakeFiles/compressor_objs.dir/QatAccel.cc.o.d -o CMakeFiles/compressor_objs.dir/QatAccel.cc.o -c /tmp/B.9grlomhr/BUILD/ceph-17.2.3/src/compressor/QatAccel.cc make[2]: Leaving directory '/tmp/B.9grlomhr/BUILD/ceph-17.2.3/build' make[1]: Entering directory '/tmp/B.9grlomhr/BUILD/ceph-17.2.3/build' [ 4%] Built target compressor_objs make[1]: Leaving directory '/tmp/B.9grlomhr/BUILD/ceph-17.2.3/build' make[2]: Entering directory '/tmp/B.9grlomhr/BUILD/ceph-17.2.3/build' [ 4%] Building CXX object src/erasure-code/CMakeFiles/erasure_code.dir/ErasureCodePlugin.cc.o cd /tmp/B.9grlomhr/BUILD/ceph-17.2.3/build/src/erasure-code && /usr/bin/x86_64-pld-linux-g++ -DBOOST_ASIO_DISABLE_THREAD_KEYWORD_EXTENSION -DBOOST_ASIO_USE_TS_EXECUTOR_AS_DEFAULT -DHAVE_CONFIG_H -D_FILE_OFFSET_BITS=64 -D_FORTIFY_SOURCE=2 -D_GNU_SOURCE -D_REENTRANT -D_THREAD_SAFE -D__CEPH__ -D__STDC_FORMAT_MACROS -D__linux__ -I/tmp/B.9grlomhr/BUILD/ceph-17.2.3/build/src/include -I/tmp/B.9grlomhr/BUILD/ceph-17.2.3/src -I/tmp/B.9grlomhr/BUILD/ceph-17.2.3/src/erasure-code/jerasure -isystem /tmp/B.9grlomhr/BUILD/ceph-17.2.3/build/include -isystem /tmp/B.9grlomhr/BUILD/ceph-17.2.3/src/xxHash -isystem /tmp/B.9grlomhr/BUILD/ceph-17.2.3/src/rapidjson/include -isystem /tmp/B.9grlomhr/BUILD/ceph-17.2.3/src/erasure-code/jerasure/jerasure/include -isystem /tmp/B.9grlomhr/BUILD/ceph-17.2.3/src/erasure-code/jerasure/gf-complete/include -O2 -fwrapv -pipe -Wformat -Werror=format-security -gdwarf-4 -fno-debug-types-section -fvar-tracking-assignments -g2 -Wp,-D_FORTIFY_SOURCE=2 -fstack-protector-strong --param=ssp-buffer-size=4 -Werror=trampolines -fPIC -march=x86-64 -mtune=generic -gdwarf-4 -fno-debug-types-section -fvar-tracking-assignments -g2 -DNDEBUG -DQT_NO_DEBUG -fPIC -U_FORTIFY_SOURCE -Wall -fno-strict-aliasing -fsigned-char -Wtype-limits -Wignored-qualifiers -Wpointer-arith -Werror=format-security -Winit-self -Wno-unknown-pragmas -Wnon-virtual-dtor -Wno-ignored-qualifiers -ftemplate-depth-1024 -Wpessimizing-move -Wredundant-move -Wstrict-null-sentinel -Woverloaded-virtual -fno-new-ttp-matching -fstack-protector-strong -fdiagnostics-color=auto -fno-builtin-malloc -fno-builtin-calloc -fno-builtin-realloc -fno-builtin-free -std=c++17 -MD -MT src/erasure-code/CMakeFiles/erasure_code.dir/ErasureCodePlugin.cc.o -MF CMakeFiles/erasure_code.dir/ErasureCodePlugin.cc.o.d -o CMakeFiles/erasure_code.dir/ErasureCodePlugin.cc.o -c /tmp/B.9grlomhr/BUILD/ceph-17.2.3/src/erasure-code/ErasureCodePlugin.cc make[2]: Leaving directory '/tmp/B.9grlomhr/BUILD/ceph-17.2.3/build' make[2]: Entering directory '/tmp/B.9grlomhr/BUILD/ceph-17.2.3/build' [ 5%] Linking CXX static library ../../lib/liberasure_code.a cd /tmp/B.9grlomhr/BUILD/ceph-17.2.3/build/src/erasure-code && /usr/bin/cmake -P CMakeFiles/erasure_code.dir/cmake_clean_target.cmake cd /tmp/B.9grlomhr/BUILD/ceph-17.2.3/build/src/erasure-code && /usr/bin/cmake -E cmake_link_script CMakeFiles/erasure_code.dir/link.txt --verbose=1 /usr/bin/ar qc ../../lib/liberasure_code.a CMakeFiles/erasure_code.dir/ErasureCodePlugin.cc.o /usr/bin/ranlib ../../lib/liberasure_code.a make[2]: Leaving directory '/tmp/B.9grlomhr/BUILD/ceph-17.2.3/build' make[1]: Entering directory '/tmp/B.9grlomhr/BUILD/ceph-17.2.3/build' [ 5%] Built target erasure_code make[1]: Leaving directory '/tmp/B.9grlomhr/BUILD/ceph-17.2.3/build' /usr/bin/make -f src/cls/CMakeFiles/cls_lock_client.dir/build.make src/cls/CMakeFiles/cls_lock_client.dir/depend make[2]: Entering directory '/tmp/B.9grlomhr/BUILD/ceph-17.2.3/build' cd /tmp/B.9grlomhr/BUILD/ceph-17.2.3/build && /usr/bin/cmake -E cmake_depends "Unix Makefiles" /tmp/B.9grlomhr/BUILD/ceph-17.2.3 /tmp/B.9grlomhr/BUILD/ceph-17.2.3/src/cls /tmp/B.9grlomhr/BUILD/ceph-17.2.3/build /tmp/B.9grlomhr/BUILD/ceph-17.2.3/build/src/cls /tmp/B.9grlomhr/BUILD/ceph-17.2.3/build/src/cls/CMakeFiles/cls_lock_client.dir/DependInfo.cmake --color= make[2]: Leaving directory '/tmp/B.9grlomhr/BUILD/ceph-17.2.3/build' /usr/bin/make -f src/cls/CMakeFiles/cls_lock_client.dir/build.make src/cls/CMakeFiles/cls_lock_client.dir/build make[2]: Entering directory '/tmp/B.9grlomhr/BUILD/ceph-17.2.3/build' [ 4%] Building CXX object src/msg/CMakeFiles/common-msg-objs.dir/DispatchQueue.cc.o cd /tmp/B.9grlomhr/BUILD/ceph-17.2.3/build/src/msg && /usr/bin/x86_64-pld-linux-g++ -DBOOST_ASIO_DISABLE_THREAD_KEYWORD_EXTENSION -DBOOST_ASIO_USE_TS_EXECUTOR_AS_DEFAULT -DHAVE_CONFIG_H -D_FILE_OFFSET_BITS=64 -D_FORTIFY_SOURCE=2 -D_GNU_SOURCE -D_REENTRANT -D_THREAD_SAFE -D__CEPH__ -D__STDC_FORMAT_MACROS -D__linux__ -I/tmp/B.9grlomhr/BUILD/ceph-17.2.3/build/src/include -I/tmp/B.9grlomhr/BUILD/ceph-17.2.3/src -isystem /tmp/B.9grlomhr/BUILD/ceph-17.2.3/build/include -isystem /tmp/B.9grlomhr/BUILD/ceph-17.2.3/src/xxHash -isystem /tmp/B.9grlomhr/BUILD/ceph-17.2.3/src/rapidjson/include -O2 -fwrapv -pipe -Wformat -Werror=format-security -gdwarf-4 -fno-debug-types-section -fvar-tracking-assignments -g2 -Wp,-D_FORTIFY_SOURCE=2 -fstack-protector-strong --param=ssp-buffer-size=4 -Werror=trampolines -fPIC -march=x86-64 -mtune=generic -gdwarf-4 -fno-debug-types-section -fvar-tracking-assignments -g2 -DNDEBUG -DQT_NO_DEBUG -fPIC -U_FORTIFY_SOURCE -Wall -fno-strict-aliasing -fsigned-char -Wtype-limits -Wignored-qualifiers -Wpointer-arith -Werror=format-security -Winit-self -Wno-unknown-pragmas -Wnon-virtual-dtor -Wno-ignored-qualifiers -ftemplate-depth-1024 -Wpessimizing-move -Wredundant-move -Wstrict-null-sentinel -Woverloaded-virtual -fno-new-ttp-matching -fstack-protector-strong -fdiagnostics-color=auto -fno-builtin-malloc -fno-builtin-calloc -fno-builtin-realloc -fno-builtin-free -std=c++17 -MD -MT src/msg/CMakeFiles/common-msg-objs.dir/DispatchQueue.cc.o -MF CMakeFiles/common-msg-objs.dir/DispatchQueue.cc.o.d -o CMakeFiles/common-msg-objs.dir/DispatchQueue.cc.o -c /tmp/B.9grlomhr/BUILD/ceph-17.2.3/src/msg/DispatchQueue.cc make[2]: Leaving directory '/tmp/B.9grlomhr/BUILD/ceph-17.2.3/build' /usr/bin/make -f src/tracing/CMakeFiles/librados-tp.dir/build.make src/tracing/CMakeFiles/librados-tp.dir/depend make[2]: Entering directory '/tmp/B.9grlomhr/BUILD/ceph-17.2.3/build' cd /tmp/B.9grlomhr/BUILD/ceph-17.2.3/build && /usr/bin/cmake -E cmake_depends "Unix Makefiles" /tmp/B.9grlomhr/BUILD/ceph-17.2.3 /tmp/B.9grlomhr/BUILD/ceph-17.2.3/src/tracing /tmp/B.9grlomhr/BUILD/ceph-17.2.3/build /tmp/B.9grlomhr/BUILD/ceph-17.2.3/build/src/tracing /tmp/B.9grlomhr/BUILD/ceph-17.2.3/build/src/tracing/CMakeFiles/librados-tp.dir/DependInfo.cmake --color= make[2]: Leaving directory '/tmp/B.9grlomhr/BUILD/ceph-17.2.3/build' /usr/bin/make -f src/tracing/CMakeFiles/librados-tp.dir/build.make src/tracing/CMakeFiles/librados-tp.dir/build make[2]: Entering directory '/tmp/B.9grlomhr/BUILD/ceph-17.2.3/build' [ 6%] generating /tmp/B.9grlomhr/BUILD/ceph-17.2.3/build/include/tracing/librados.h cd /tmp/B.9grlomhr/BUILD/ceph-17.2.3/build/include && /usr/bin/lttng-gen-tp /tmp/B.9grlomhr/BUILD/ceph-17.2.3/src/tracing/librados.tp -o tracing/librados.h make[2]: Leaving directory '/tmp/B.9grlomhr/BUILD/ceph-17.2.3/build' make[1]: Entering directory '/tmp/B.9grlomhr/BUILD/ceph-17.2.3/build' [ 6%] Built target librados-tp make[1]: Leaving directory '/tmp/B.9grlomhr/BUILD/ceph-17.2.3/build' make[2]: Entering directory '/tmp/B.9grlomhr/BUILD/ceph-17.2.3/build' [ 4%] Building CXX object src/crush/CMakeFiles/crush_objs.dir/CrushWrapper.cc.o cd /tmp/B.9grlomhr/BUILD/ceph-17.2.3/build/src/crush && /usr/bin/x86_64-pld-linux-g++ -DBOOST_ASIO_DISABLE_THREAD_KEYWORD_EXTENSION -DBOOST_ASIO_USE_TS_EXECUTOR_AS_DEFAULT -DHAVE_CONFIG_H -D_FILE_OFFSET_BITS=64 -D_FORTIFY_SOURCE=2 -D_GNU_SOURCE -D_REENTRANT -D_THREAD_SAFE -D__CEPH__ -D__STDC_FORMAT_MACROS -D__linux__ -I/tmp/B.9grlomhr/BUILD/ceph-17.2.3/build/src/include -I/tmp/B.9grlomhr/BUILD/ceph-17.2.3/src -isystem /tmp/B.9grlomhr/BUILD/ceph-17.2.3/build/include -isystem /tmp/B.9grlomhr/BUILD/ceph-17.2.3/src/xxHash -isystem /tmp/B.9grlomhr/BUILD/ceph-17.2.3/src/rapidjson/include -O2 -fwrapv -pipe -Wformat -Werror=format-security -gdwarf-4 -fno-debug-types-section -fvar-tracking-assignments -g2 -Wp,-D_FORTIFY_SOURCE=2 -fstack-protector-strong --param=ssp-buffer-size=4 -Werror=trampolines -fPIC -march=x86-64 -mtune=generic -gdwarf-4 -fno-debug-types-section -fvar-tracking-assignments -g2 -DNDEBUG -DQT_NO_DEBUG -fPIC -U_FORTIFY_SOURCE -Wall -fno-strict-aliasing -fsigned-char -Wtype-limits -Wignored-qualifiers -Wpointer-arith -Werror=format-security -Winit-self -Wno-unknown-pragmas -Wnon-virtual-dtor -Wno-ignored-qualifiers -ftemplate-depth-1024 -Wpessimizing-move -Wredundant-move -Wstrict-null-sentinel -Woverloaded-virtual -fno-new-ttp-matching -fstack-protector-strong -fdiagnostics-color=auto -fno-builtin-malloc -fno-builtin-calloc -fno-builtin-realloc -fno-builtin-free -std=c++17 -MD -MT src/crush/CMakeFiles/crush_objs.dir/CrushWrapper.cc.o -MF CMakeFiles/crush_objs.dir/CrushWrapper.cc.o.d -o CMakeFiles/crush_objs.dir/CrushWrapper.cc.o -c /tmp/B.9grlomhr/BUILD/ceph-17.2.3/src/crush/CrushWrapper.cc In file included from /tmp/B.9grlomhr/BUILD/ceph-17.2.3/src/librados/ListObjectImpl.h:19, from /tmp/B.9grlomhr/BUILD/ceph-17.2.3/src/osd/osd_types.h:51, from /tmp/B.9grlomhr/BUILD/ceph-17.2.3/src/crush/CrushWrapper.cc:4: /tmp/B.9grlomhr/BUILD/ceph-17.2.3/src/include/rados/librados.hpp:107:54: warning: 'template<class _Category, class _Tp, class _Distance, class _Pointer, class _Reference> struct std::iterator' is deprecated [-Wdeprecated-declarations] 107 | class CEPH_RADOS_API NObjectIterator : public std::iterator <std::forward_iterator_tag, ListObject> { | ^~~~~~~~ In file included from /usr/include/c++/12.2.0/string:45, from /usr/include/c++/12.2.0/bits/locale_classes.h:40, from /usr/include/c++/12.2.0/bits/ios_base.h:41, from /usr/include/c++/12.2.0/ios:42, from /usr/include/c++/12.2.0/istream:38, from /usr/include/c++/12.2.0/sstream:38, from /tmp/B.9grlomhr/BUILD/ceph-17.2.3/src/osd/osd_types.h:22: /usr/include/c++/12.2.0/bits/stl_iterator_base_types.h:127:34: note: declared here 127 | struct _GLIBCXX17_DEPRECATED iterator | ^~~~~~~~ In file included from /tmp/B.9grlomhr/BUILD/ceph-17.2.3/src/common/debug.h:18, from /tmp/B.9grlomhr/BUILD/ceph-17.2.3/src/msg/Connection.h:24, from /tmp/B.9grlomhr/BUILD/ceph-17.2.3/src/osd/Watch.h:18, from /tmp/B.9grlomhr/BUILD/ceph-17.2.3/src/osd/osd_types.h:49: /tmp/B.9grlomhr/BUILD/ceph-17.2.3/src/osd/osd_types.h: In lambda function: /tmp/B.9grlomhr/BUILD/ceph-17.2.3/src/common/dout.h:185:56: error: call to non-'constexpr' function 'ceph::dout::dynamic_marker_t<T> ceph::dout::need_dynamic(T&&) [with T = unsigned int]' 185 | dout_impl(pdpp->get_cct(), ceph::dout::need_dynamic(pdpp->get_subsys()), v) \ | ~~~~~~~~~~~~~~~~~~~~~~~~^~~~~~~~~~~~~~~~~~~~ /tmp/B.9grlomhr/BUILD/ceph-17.2.3/src/common/dout.h:156:58: note: in definition of macro 'dout_impl' 156 | return (cctX->_conf->subsys.template should_gather<sub, v>()); \ | ^~~ /tmp/B.9grlomhr/BUILD/ceph-17.2.3/src/osd/osd_types.h:3651:3: note: in expansion of macro 'ldpp_dout' 3651 | ldpp_dout(dpp, 10) << "build_prior all_probe " << all_probe << dendl; | ^~~~~~~~~ /tmp/B.9grlomhr/BUILD/ceph-17.2.3/src/common/dout.h:106:21: note: 'ceph::dout::dynamic_marker_t<T> ceph::dout::need_dynamic(T&&) [with T = unsigned int]' declared here 106 | dynamic_marker_t<T> need_dynamic(T&& t) { | ^~~~~~~~~~~~ /tmp/B.9grlomhr/BUILD/ceph-17.2.3/src/osd/osd_types.h: In lambda function: /tmp/B.9grlomhr/BUILD/ceph-17.2.3/src/common/dout.h:185:56: error: call to non-'constexpr' function 'ceph::dout::dynamic_marker_t<T> ceph::dout::need_dynamic(T&&) [with T = unsigned int]' 185 | dout_impl(pdpp->get_cct(), ceph::dout::need_dynamic(pdpp->get_subsys()), v) \ | ~~~~~~~~~~~~~~~~~~~~~~~~^~~~~~~~~~~~~~~~~~~~ /tmp/B.9grlomhr/BUILD/ceph-17.2.3/src/common/dout.h:156:58: note: in definition of macro 'dout_impl' 156 | return (cctX->_conf->subsys.template should_gather<sub, v>()); \ | ^~~ /tmp/B.9grlomhr/BUILD/ceph-17.2.3/src/osd/osd_types.h:3670:7: note: in expansion of macro 'ldpp_dout' 3670 | ldpp_dout(dpp, 10) << "build_prior maybe_rw interval:" << start | ^~~~~~~~~ /tmp/B.9grlomhr/BUILD/ceph-17.2.3/src/common/dout.h:106:21: note: 'ceph::dout::dynamic_marker_t<T> ceph::dout::need_dynamic(T&&) [with T = unsigned int]' declared here 106 | dynamic_marker_t<T> need_dynamic(T&& t) { | ^~~~~~~~~~~~ /tmp/B.9grlomhr/BUILD/ceph-17.2.3/src/osd/osd_types.h: In lambda function: /tmp/B.9grlomhr/BUILD/ceph-17.2.3/src/common/dout.h:185:56: error: call to non-'constexpr' function 'ceph::dout::dynamic_marker_t<T> ceph::dout::need_dynamic(T&&) [with T = unsigned int]' 185 | dout_impl(pdpp->get_cct(), ceph::dout::need_dynamic(pdpp->get_subsys()), v) \ | ~~~~~~~~~~~~~~~~~~~~~~~~^~~~~~~~~~~~~~~~~~~~ /tmp/B.9grlomhr/BUILD/ceph-17.2.3/src/common/dout.h:156:58: note: in definition of macro 'dout_impl' 156 | return (cctX->_conf->subsys.template should_gather<sub, v>()); \ | ^~~ /tmp/B.9grlomhr/BUILD/ceph-17.2.3/src/osd/osd_types.h:3691:11: note: in expansion of macro 'ldpp_dout' 3691 | ldpp_dout(dpp, 10) << "build_prior prior osd." << so.osd | ^~~~~~~~~ /tmp/B.9grlomhr/BUILD/ceph-17.2.3/src/common/dout.h:106:21: note: 'ceph::dout::dynamic_marker_t<T> ceph::dout::need_dynamic(T&&) [with T = unsigned int]' declared here 106 | dynamic_marker_t<T> need_dynamic(T&& t) { | ^~~~~~~~~~~~ /tmp/B.9grlomhr/BUILD/ceph-17.2.3/src/osd/osd_types.h: In lambda function: /tmp/B.9grlomhr/BUILD/ceph-17.2.3/src/common/dout.h:185:56: error: call to non-'constexpr' function 'ceph::dout::dynamic_marker_t<T> ceph::dout::need_dynamic(T&&) [with T = unsigned int]' 185 | dout_impl(pdpp->get_cct(), ceph::dout::need_dynamic(pdpp->get_subsys()), v) \ | ~~~~~~~~~~~~~~~~~~~~~~~~^~~~~~~~~~~~~~~~~~~~ /tmp/B.9grlomhr/BUILD/ceph-17.2.3/src/common/dout.h:156:58: note: in definition of macro 'dout_impl' 156 | return (cctX->_conf->subsys.template should_gather<sub, v>()); \ | ^~~ /tmp/B.9grlomhr/BUILD/ceph-17.2.3/src/osd/osd_types.h:3696:11: note: in expansion of macro 'ldpp_dout' 3696 | ldpp_dout(dpp, 10) << "build_prior prior osd." << so.osd | ^~~~~~~~~ /tmp/B.9grlomhr/BUILD/ceph-17.2.3/src/common/dout.h:106:21: note: 'ceph::dout::dynamic_marker_t<T> ceph::dout::need_dynamic(T&&) [with T = unsigned int]' declared here 106 | dynamic_marker_t<T> need_dynamic(T&& t) { | ^~~~~~~~~~~~ /tmp/B.9grlomhr/BUILD/ceph-17.2.3/src/osd/osd_types.h: In lambda function: /tmp/B.9grlomhr/BUILD/ceph-17.2.3/src/common/dout.h:185:56: error: call to non-'constexpr' function 'ceph::dout::dynamic_marker_t<T> ceph::dout::need_dynamic(T&&) [with T = unsigned int]' 185 | dout_impl(pdpp->get_cct(), ceph::dout::need_dynamic(pdpp->get_subsys()), v) \ | ~~~~~~~~~~~~~~~~~~~~~~~~^~~~~~~~~~~~~~~~~~~~ /tmp/B.9grlomhr/BUILD/ceph-17.2.3/src/common/dout.h:156:58: note: in definition of macro 'dout_impl' 156 | return (cctX->_conf->subsys.template should_gather<sub, v>()); \ | ^~~ /tmp/B.9grlomhr/BUILD/ceph-17.2.3/src/osd/osd_types.h:3702:11: note: in expansion of macro 'ldpp_dout' 3702 | ldpp_dout(dpp, 10) << "build_prior prior osd." << so.osd | ^~~~~~~~~ /tmp/B.9grlomhr/BUILD/ceph-17.2.3/src/common/dout.h:106:21: note: 'ceph::dout::dynamic_marker_t<T> ceph::dout::need_dynamic(T&&) [with T = unsigned int]' declared here 106 | dynamic_marker_t<T> need_dynamic(T&& t) { | ^~~~~~~~~~~~ /tmp/B.9grlomhr/BUILD/ceph-17.2.3/src/osd/osd_types.h: In lambda function: /tmp/B.9grlomhr/BUILD/ceph-17.2.3/src/common/dout.h:185:56: error: call to non-'constexpr' function 'ceph::dout::dynamic_marker_t<T> ceph::dout::need_dynamic(T&&) [with T = unsigned int]' 185 | dout_impl(pdpp->get_cct(), ceph::dout::need_dynamic(pdpp->get_subsys()), v) \ | ~~~~~~~~~~~~~~~~~~~~~~~~^~~~~~~~~~~~~~~~~~~~ /tmp/B.9grlomhr/BUILD/ceph-17.2.3/src/common/dout.h:156:58: note: in definition of macro 'dout_impl' 156 | return (cctX->_conf->subsys.template should_gather<sub, v>()); \ | ^~~ /tmp/B.9grlomhr/BUILD/ceph-17.2.3/src/osd/osd_types.h:3716:9: note: in expansion of macro 'ldpp_dout' 3716 | ldpp_dout(dpp, 10) << "build_prior possibly went active+rw," | ^~~~~~~~~ /tmp/B.9grlomhr/BUILD/ceph-17.2.3/src/common/dout.h:106:21: note: 'ceph::dout::dynamic_marker_t<T> ceph::dout::need_dynamic(T&&) [with T = unsigned int]' declared here 106 | dynamic_marker_t<T> need_dynamic(T&& t) { | ^~~~~~~~~~~~ /tmp/B.9grlomhr/BUILD/ceph-17.2.3/src/osd/osd_types.h: In lambda function: /tmp/B.9grlomhr/BUILD/ceph-17.2.3/src/common/dout.h:185:56: error: call to non-'constexpr' function 'ceph::dout::dynamic_marker_t<T> ceph::dout::need_dynamic(T&&) [with T = unsigned int]' 185 | dout_impl(pdpp->get_cct(), ceph::dout::need_dynamic(pdpp->get_subsys()), v) \ | ~~~~~~~~~~~~~~~~~~~~~~~~^~~~~~~~~~~~~~~~~~~~ /tmp/B.9grlomhr/BUILD/ceph-17.2.3/src/common/dout.h:156:58: note: in definition of macro 'dout_impl' 156 | return (cctX->_conf->subsys.template should_gather<sub, v>()); \ | ^~~ /tmp/B.9grlomhr/BUILD/ceph-17.2.3/src/osd/osd_types.h:3726:3: note: in expansion of macro 'ldpp_dout' 3726 | ldpp_dout(dpp, 10) << "build_prior final: probe " << probe | ^~~~~~~~~ /tmp/B.9grlomhr/BUILD/ceph-17.2.3/src/common/dout.h:106:21: note: 'ceph::dout::dynamic_marker_t<T> ceph::dout::need_dynamic(T&&) [with T = unsigned int]' declared here 106 | dynamic_marker_t<T> need_dynamic(T&& t) { | ^~~~~~~~~~~~ make[2]: *** [src/crush/CMakeFiles/crush_objs.dir/build.make:135: src/crush/CMakeFiles/crush_objs.dir/CrushWrapper.cc.o] Error 1 make[2]: Leaving directory '/tmp/B.9grlomhr/BUILD/ceph-17.2.3/build' make[2]: *** Waiting for unfinished jobs.... make[2]: Entering directory '/tmp/B.9grlomhr/BUILD/ceph-17.2.3/build' [ 4%] Building CXX object src/CMakeFiles/rados_snap_set_diff_obj.dir/librados/snap_set_diff.cc.o cd /tmp/B.9grlomhr/BUILD/ceph-17.2.3/build/src && /usr/bin/x86_64-pld-linux-g++ -DBOOST_ASIO_DISABLE_THREAD_KEYWORD_EXTENSION -DBOOST_ASIO_USE_TS_EXECUTOR_AS_DEFAULT -DHAVE_CONFIG_H -D_FILE_OFFSET_BITS=64 -D_FORTIFY_SOURCE=2 -D_GNU_SOURCE -D_REENTRANT -D_THREAD_SAFE -D__CEPH__ -D__STDC_FORMAT_MACROS -D__linux__ -I/tmp/B.9grlomhr/BUILD/ceph-17.2.3/build/src/include -I/tmp/B.9grlomhr/BUILD/ceph-17.2.3/src -isystem /tmp/B.9grlomhr/BUILD/ceph-17.2.3/build/include -isystem /tmp/B.9grlomhr/BUILD/ceph-17.2.3/src/xxHash -isystem /tmp/B.9grlomhr/BUILD/ceph-17.2.3/src/rapidjson/include -O2 -fwrapv -pipe -Wformat -Werror=format-security -gdwarf-4 -fno-debug-types-section -fvar-tracking-assignments -g2 -Wp,-D_FORTIFY_SOURCE=2 -fstack-protector-strong --param=ssp-buffer-size=4 -Werror=trampolines -fPIC -march=x86-64 -mtune=generic -gdwarf-4 -fno-debug-types-section -fvar-tracking-assignments -g2 -DNDEBUG -DQT_NO_DEBUG -fPIC -U_FORTIFY_SOURCE -Wall -fno-strict-aliasing -fsigned-char -Wtype-limits -Wignored-qualifiers -Wpointer-arith -Werror=format-security -Winit-self -Wno-unknown-pragmas -Wnon-virtual-dtor -Wno-ignored-qualifiers -ftemplate-depth-1024 -Wpessimizing-move -Wredundant-move -Wstrict-null-sentinel -Woverloaded-virtual -fno-new-ttp-matching -fstack-protector-strong -fdiagnostics-color=auto -fno-builtin-malloc -fno-builtin-calloc -fno-builtin-realloc -fno-builtin-free -std=c++17 -MD -MT src/CMakeFiles/rados_snap_set_diff_obj.dir/librados/snap_set_diff.cc.o -MF CMakeFiles/rados_snap_set_diff_obj.dir/librados/snap_set_diff.cc.o.d -o CMakeFiles/rados_snap_set_diff_obj.dir/librados/snap_set_diff.cc.o -c /tmp/B.9grlomhr/BUILD/ceph-17.2.3/src/librados/snap_set_diff.cc In file included from /tmp/B.9grlomhr/BUILD/ceph-17.2.3/src/include/rados/rados_types.hpp:10, from /tmp/B.9grlomhr/BUILD/ceph-17.2.3/src/librados/snap_set_diff.h:8, from /tmp/B.9grlomhr/BUILD/ceph-17.2.3/src/librados/snap_set_diff.cc:6: /tmp/B.9grlomhr/BUILD/ceph-17.2.3/src/include/rados/buffer.h:98:52: error: expected template-name before '<' token 98 | struct unique_leakable_ptr : public std::unique_ptr<T, ceph::nop_delete<T>> { | ^ /tmp/B.9grlomhr/BUILD/ceph-17.2.3/src/include/rados/buffer.h:98:52: error: expected '{' before '<' token /tmp/B.9grlomhr/BUILD/ceph-17.2.3/src/include/rados/buffer.h:374:17: error: 'unique_ptr' in namespace 'std' does not name a template type 374 | static std::unique_ptr<ptr_node, disposer> | ^~~~~~~~~~ /tmp/B.9grlomhr/BUILD/ceph-17.2.3/src/include/rados/buffer.h:65:1: note: 'std::unique_ptr' is defined in header '<memory>'; did you forget to '#include <memory>'? 64 | #include "inline_memory.h" +++ |+#include <memory> 65 | /tmp/B.9grlomhr/BUILD/ceph-17.2.3/src/include/rados/buffer.h:378:17: error: 'unique_ptr' in namespace 'std' does not name a template type 378 | static std::unique_ptr<ptr_node, disposer> | ^~~~~~~~~~ /tmp/B.9grlomhr/BUILD/ceph-17.2.3/src/include/rados/buffer.h:378:12: note: 'std::unique_ptr' is defined in header '<memory>'; did you forget to '#include <memory>'? 378 | static std::unique_ptr<ptr_node, disposer> | ^~~ /tmp/B.9grlomhr/BUILD/ceph-17.2.3/src/include/rados/buffer.h:383:17: error: 'unique_ptr' in namespace 'std' does not name a template type 383 | static std::unique_ptr<ptr_node, disposer> | ^~~~~~~~~~ /tmp/B.9grlomhr/BUILD/ceph-17.2.3/src/include/rados/buffer.h:383:12: note: 'std::unique_ptr' is defined in header '<memory>'; did you forget to '#include <memory>'? 383 | static std::unique_ptr<ptr_node, disposer> | ^~~ /tmp/B.9grlomhr/BUILD/ceph-17.2.3/src/include/rados/buffer.h:407:17: error: 'unique_ptr' in namespace 'std' does not name a template type 407 | static std::unique_ptr<ptr_node, disposer> create_hypercombined( | ^~~~~~~~~~ /tmp/B.9grlomhr/BUILD/ceph-17.2.3/src/include/rados/buffer.h:407:12: note: 'std::unique_ptr' is defined in header '<memory>'; did you forget to '#include <memory>'? 407 | static std::unique_ptr<ptr_node, disposer> create_hypercombined( | ^~~ /tmp/B.9grlomhr/BUILD/ceph-17.2.3/src/include/rados/buffer.h:1050:20: error: 'std::unique_ptr' has not been declared 1050 | void push_back(std::unique_ptr<ptr_node, ptr_node::disposer> bp) { | ^~~ /tmp/B.9grlomhr/BUILD/ceph-17.2.3/src/include/rados/buffer.h:1050:35: error: expected ',' or '...' before '<' token 1050 | void push_back(std::unique_ptr<ptr_node, ptr_node::disposer> bp) { | ^ /tmp/B.9grlomhr/BUILD/ceph-17.2.3/src/include/rados/buffer.h:1069:18: error: 'std::unique_ptr' has not been declared 1069 | void rebuild(std::unique_ptr<ptr_node, ptr_node::disposer> nb); | ^~~ /tmp/B.9grlomhr/BUILD/ceph-17.2.3/src/include/rados/buffer.h:1069:33: error: expected ',' or '...' before '<' token 1069 | void rebuild(std::unique_ptr<ptr_node, ptr_node::disposer> nb); | ^ /tmp/B.9grlomhr/BUILD/ceph-17.2.3/src/include/rados/buffer.h: In member function 'void ceph::buffer::v15_2_0::list::push_back(const ceph::buffer::v15_2_0::ptr&)': /tmp/B.9grlomhr/BUILD/ceph-17.2.3/src/include/rados/buffer.h:1035:37: error: 'create' is not a member of 'ceph::buffer::v15_2_0::ptr_node' 1035 | _buffers.push_back(*ptr_node::create(bp).release()); | ^~~~~~ /tmp/B.9grlomhr/BUILD/ceph-17.2.3/src/include/rados/buffer.h: In member function 'void ceph::buffer::v15_2_0::list::push_back(ceph::buffer::v15_2_0::ptr&&)': /tmp/B.9grlomhr/BUILD/ceph-17.2.3/src/include/rados/buffer.h:1044:37: error: 'create' is not a member of 'ceph::buffer::v15_2_0::ptr_node' 1044 | _buffers.push_back(*ptr_node::create(std::move(bp)).release()); | ^~~~~~ /tmp/B.9grlomhr/BUILD/ceph-17.2.3/src/include/rados/buffer.h: In member function 'void ceph::buffer::v15_2_0::list::push_back(int)': /tmp/B.9grlomhr/BUILD/ceph-17.2.3/src/include/rados/buffer.h:1051:19: error: 'bp' was not declared in this scope 1051 | _carriage = bp.get(); | ^~ /tmp/B.9grlomhr/BUILD/ceph-17.2.3/src/include/rados/buffer.h: At global scope: /tmp/B.9grlomhr/BUILD/ceph-17.2.3/src/include/rados/buffer.h:1057:51: error: 'r' has incomplete type 1057 | void push_back(ceph::unique_leakable_ptr<raw> r) { | ~~~~~~~~~~~~~~~~~~~~~~~~~~~~~~~^ /tmp/B.9grlomhr/BUILD/ceph-17.2.3/src/include/rados/buffer.h:98:8: note: declaration of 'struct ceph::unique_leakable_ptr<ceph::buffer::v15_2_0::raw>' 98 | struct unique_leakable_ptr : public std::unique_ptr<T, ceph::nop_delete<T>> { | ^~~~~~~~~~~~~~~~~~~ /tmp/B.9grlomhr/BUILD/ceph-17.2.3/src/include/rados/buffer.h: In member function 'void ceph::buffer::v15_2_0::list::push_back(ceph::unique_leakable_ptr<ceph::buffer::v15_2_0::raw>)': /tmp/B.9grlomhr/BUILD/ceph-17.2.3/src/include/rados/buffer.h:1058:37: error: 'create' is not a member of 'ceph::buffer::v15_2_0::ptr_node' 1058 | _buffers.push_back(*ptr_node::create(std::move(r)).release()); | ^~~~~~ /tmp/B.9grlomhr/BUILD/ceph-17.2.3/src/include/rados/buffer.h: In member function 'void ceph::buffer::v15_2_0::list::share(const ceph::buffer::v15_2_0::list&)': /tmp/B.9grlomhr/BUILD/ceph-17.2.3/src/include/rados/buffer.h:1094:41: error: 'create' is not a member of 'ceph::buffer::v15_2_0::ptr_node' 1094 | _buffers.push_back(*ptr_node::create(bp).release()); | ^~~~~~ In file included from /tmp/B.9grlomhr/BUILD/ceph-17.2.3/src/include/encoding.h:41, from /tmp/B.9grlomhr/BUILD/ceph-17.2.3/src/include/interval_set.h:23, from /tmp/B.9grlomhr/BUILD/ceph-17.2.3/src/librados/snap_set_diff.h:9: /tmp/B.9grlomhr/BUILD/ceph-17.2.3/src/include/denc.h: In static member function 'static void denc_traits<ceph::buffer::v15_2_0::ptr>::decode(ceph::buffer::v15_2_0::ptr&, ceph::buffer::v15_2_0::list::const_iterator&)': /tmp/B.9grlomhr/BUILD/ceph-17.2.3/src/include/denc.h:823:31: error: invalid use of incomplete type 'struct ceph::unique_leakable_ptr<ceph::buffer::v15_2_0::raw>' 823 | v = ceph::buffer::copy(s.c_str(), s.length()); | ~~~~~~~~~~~~~~~~~~^~~~~~~~~~~~~~~~~~~~~~~ /tmp/B.9grlomhr/BUILD/ceph-17.2.3/src/include/rados/buffer.h:98:8: note: declaration of 'struct ceph::unique_leakable_ptr<ceph::buffer::v15_2_0::raw>' 98 | struct unique_leakable_ptr : public std::unique_ptr<T, ceph::nop_delete<T>> { | ^~~~~~~~~~~~~~~~~~~ /tmp/B.9grlomhr/BUILD/ceph-17.2.3/src/include/encoding.h: In function 'void ceph::decode(buffer::v15_2_0::ptr&, buffer::v15_2_0::list::const_iterator&)': /tmp/B.9grlomhr/BUILD/ceph-17.2.3/src/include/encoding.h:273:24: error: invalid use of incomplete type 'struct ceph::unique_leakable_ptr<ceph::buffer::v15_2_0::raw>' 273 | bp = buffer::copy(s.c_str(), s.length()); | ~~~~~~~~~~~~^~~~~~~~~~~~~~~~~~~~~~~ /tmp/B.9grlomhr/BUILD/ceph-17.2.3/src/include/rados/buffer.h:98:8: note: declaration of 'struct ceph::unique_leakable_ptr<ceph::buffer::v15_2_0::raw>' 98 | struct unique_leakable_ptr : public std::unique_ptr<T, ceph::nop_delete<T>> { | ^~~~~~~~~~~~~~~~~~~ In file included from /tmp/B.9grlomhr/BUILD/ceph-17.2.3/src/librados/snap_set_diff.cc:8: /tmp/B.9grlomhr/BUILD/ceph-17.2.3/src/include/rados/librados.hpp: At global scope: /tmp/B.9grlomhr/BUILD/ceph-17.2.3/src/include/rados/librados.hpp:107:54: warning: 'template<class _Category, class _Tp, class _Distance, class _Pointer, class _Reference> struct std::iterator' is deprecated [-Wdeprecated-declarations] 107 | class CEPH_RADOS_API NObjectIterator : public std::iterator <std::forward_iterator_tag, ListObject> { | ^~~~~~~~ In file included from /usr/include/c++/12.2.0/bits/stl_algobase.h:65, from /usr/include/c++/12.2.0/vector:60, from /tmp/B.9grlomhr/BUILD/ceph-17.2.3/src/librados/snap_set_diff.cc:4: /usr/include/c++/12.2.0/bits/stl_iterator_base_types.h:127:34: note: declared here 127 | struct _GLIBCXX17_DEPRECATED iterator | ^~~~~~~~ /tmp/B.9grlomhr/BUILD/ceph-17.2.3/src/include/rados/buffer.h: In instantiation of 'ceph::buffer::v15_2_0::ptr ceph::buffer::v15_2_0::ptr::iterator_impl<is_const>::get_ptr(size_t) [with bool is_const = true; size_t = long unsigned int]': /tmp/B.9grlomhr/BUILD/ceph-17.2.3/src/include/denc.h:849:26: required from here /tmp/B.9grlomhr/BUILD/ceph-17.2.3/src/include/rados/buffer.h:203:30: error: invalid use of incomplete type 'struct ceph::unique_leakable_ptr<ceph::buffer::v15_2_0::raw>' 203 | return buffer::copy(get_pos_add(len), len); | ~~~~~~~~~~~~^~~~~~~~~~~~~~~~~~~~~~~ /tmp/B.9grlomhr/BUILD/ceph-17.2.3/src/include/rados/buffer.h:98:8: note: declaration of 'struct ceph::unique_leakable_ptr<ceph::buffer::v15_2_0::raw>' 98 | struct unique_leakable_ptr : public std::unique_ptr<T, ceph::nop_delete<T>> { | ^~~~~~~~~~~~~~~~~~~ make[2]: *** [src/CMakeFiles/rados_snap_set_diff_obj.dir/build.make:79: src/CMakeFiles/rados_snap_set_diff_obj.dir/librados/snap_set_diff.cc.o] Error 1 make[2]: Leaving directory '/tmp/B.9grlomhr/BUILD/ceph-17.2.3/build' make[1]: *** [CMakeFiles/Makefile2:2130: src/CMakeFiles/rados_snap_set_diff_obj.dir/all] Error 2 make[1]: *** Waiting for unfinished jobs.... make[2]: Entering directory '/tmp/B.9grlomhr/BUILD/ceph-17.2.3/build' [ 6%] Building CXX object src/cls/CMakeFiles/cls_lock_client.dir/lock/cls_lock_types.cc.o cd /tmp/B.9grlomhr/BUILD/ceph-17.2.3/build/src/cls && /usr/bin/x86_64-pld-linux-g++ -DBOOST_ASIO_DISABLE_THREAD_KEYWORD_EXTENSION -DBOOST_ASIO_USE_TS_EXECUTOR_AS_DEFAULT -DHAVE_CONFIG_H -D_FILE_OFFSET_BITS=64 -D_FORTIFY_SOURCE=2 -D_GNU_SOURCE -D_REENTRANT -D_THREAD_SAFE -D__CEPH__ -D__STDC_FORMAT_MACROS -D__linux__ -I/tmp/B.9grlomhr/BUILD/ceph-17.2.3/build/src/include -I/tmp/B.9grlomhr/BUILD/ceph-17.2.3/src -isystem /tmp/B.9grlomhr/BUILD/ceph-17.2.3/build/include -isystem /tmp/B.9grlomhr/BUILD/ceph-17.2.3/src/xxHash -isystem /tmp/B.9grlomhr/BUILD/ceph-17.2.3/src/rapidjson/include -O2 -fwrapv -pipe -Wformat -Werror=format-security -gdwarf-4 -fno-debug-types-section -fvar-tracking-assignments -g2 -Wp,-D_FORTIFY_SOURCE=2 -fstack-protector-strong --param=ssp-buffer-size=4 -Werror=trampolines -fPIC -march=x86-64 -mtune=generic -gdwarf-4 -fno-debug-types-section -fvar-tracking-assignments -g2 -DNDEBUG -DQT_NO_DEBUG -fPIC -U_FORTIFY_SOURCE -Wall -fno-strict-aliasing -fsigned-char -Wtype-limits -Wignored-qualifiers -Wpointer-arith -Werror=format-security -Winit-self -Wno-unknown-pragmas -Wnon-virtual-dtor -Wno-ignored-qualifiers -ftemplate-depth-1024 -Wpessimizing-move -Wredundant-move -Wstrict-null-sentinel -Woverloaded-virtual -fno-new-ttp-matching -fstack-protector-strong -fdiagnostics-color=auto -fno-builtin-malloc -fno-builtin-calloc -fno-builtin-realloc -fno-builtin-free -std=c++17 -MD -MT src/cls/CMakeFiles/cls_lock_client.dir/lock/cls_lock_types.cc.o -MF CMakeFiles/cls_lock_client.dir/lock/cls_lock_types.cc.o.d -o CMakeFiles/cls_lock_client.dir/lock/cls_lock_types.cc.o -c /tmp/B.9grlomhr/BUILD/ceph-17.2.3/src/cls/lock/cls_lock_types.cc make[2]: Leaving directory '/tmp/B.9grlomhr/BUILD/ceph-17.2.3/build' make[2]: Entering directory '/tmp/B.9grlomhr/BUILD/ceph-17.2.3/build' [ 4%] Building CXX object src/msg/CMakeFiles/common-msg-objs.dir/Messenger.cc.o cd /tmp/B.9grlomhr/BUILD/ceph-17.2.3/build/src/msg && /usr/bin/x86_64-pld-linux-g++ -DBOOST_ASIO_DISABLE_THREAD_KEYWORD_EXTENSION -DBOOST_ASIO_USE_TS_EXECUTOR_AS_DEFAULT -DHAVE_CONFIG_H -D_FILE_OFFSET_BITS=64 -D_FORTIFY_SOURCE=2 -D_GNU_SOURCE -D_REENTRANT -D_THREAD_SAFE -D__CEPH__ -D__STDC_FORMAT_MACROS -D__linux__ -I/tmp/B.9grlomhr/BUILD/ceph-17.2.3/build/src/include -I/tmp/B.9grlomhr/BUILD/ceph-17.2.3/src -isystem /tmp/B.9grlomhr/BUILD/ceph-17.2.3/build/include -isystem /tmp/B.9grlomhr/BUILD/ceph-17.2.3/src/xxHash -isystem /tmp/B.9grlomhr/BUILD/ceph-17.2.3/src/rapidjson/include -O2 -fwrapv -pipe -Wformat -Werror=format-security -gdwarf-4 -fno-debug-types-section -fvar-tracking-assignments -g2 -Wp,-D_FORTIFY_SOURCE=2 -fstack-protector-strong --param=ssp-buffer-size=4 -Werror=trampolines -fPIC -march=x86-64 -mtune=generic -gdwarf-4 -fno-debug-types-section -fvar-tracking-assignments -g2 -DNDEBUG -DQT_NO_DEBUG -fPIC -U_FORTIFY_SOURCE -Wall -fno-strict-aliasing -fsigned-char -Wtype-limits -Wignored-qualifiers -Wpointer-arith -Werror=format-security -Winit-self -Wno-unknown-pragmas -Wnon-virtual-dtor -Wno-ignored-qualifiers -ftemplate-depth-1024 -Wpessimizing-move -Wredundant-move -Wstrict-null-sentinel -Woverloaded-virtual -fno-new-ttp-matching -fstack-protector-strong -fdiagnostics-color=auto -fno-builtin-malloc -fno-builtin-calloc -fno-builtin-realloc -fno-builtin-free -std=c++17 -MD -MT src/msg/CMakeFiles/common-msg-objs.dir/Messenger.cc.o -MF CMakeFiles/common-msg-objs.dir/Messenger.cc.o.d -o CMakeFiles/common-msg-objs.dir/Messenger.cc.o -c /tmp/B.9grlomhr/BUILD/ceph-17.2.3/src/msg/Messenger.cc In file included from /tmp/B.9grlomhr/BUILD/ceph-17.2.3/src/msg/async/AsyncMessenger.h:23, from /tmp/B.9grlomhr/BUILD/ceph-17.2.3/src/msg/Messenger.cc:11: /tmp/B.9grlomhr/BUILD/ceph-17.2.3/src/include/xlist.h:162:24: warning: 'template<class _Category, class _Tp, class _Distance, class _Pointer, class _Reference> struct std::iterator' is deprecated [-Wdeprecated-declarations] 162 | class iterator: std::iterator<std::forward_iterator_tag, T> { | ^~~~~~~~ In file included from /usr/include/c++/12.2.0/bits/stl_algobase.h:65, from /usr/include/c++/12.2.0/bits/stl_tree.h:63, from /usr/include/c++/12.2.0/set:60, from /tmp/B.9grlomhr/BUILD/ceph-17.2.3/src/include/encoding.h:17, from /tmp/B.9grlomhr/BUILD/ceph-17.2.3/src/include/uuid.h:9, from /tmp/B.9grlomhr/BUILD/ceph-17.2.3/src/include/types.h:21, from /tmp/B.9grlomhr/BUILD/ceph-17.2.3/src/msg/Messenger.cc:6: /usr/include/c++/12.2.0/bits/stl_iterator_base_types.h:127:34: note: declared here 127 | struct _GLIBCXX17_DEPRECATED iterator | ^~~~~~~~ /tmp/B.9grlomhr/BUILD/ceph-17.2.3/src/include/xlist.h:186:30: warning: 'template<class _Category, class _Tp, class _Distance, class _Pointer, class _Reference> struct std::iterator' is deprecated [-Wdeprecated-declarations] 186 | class const_iterator: std::iterator<std::forward_iterator_tag, T> { | ^~~~~~~~ /usr/include/c++/12.2.0/bits/stl_iterator_base_types.h:127:34: note: declared here 127 | struct _GLIBCXX17_DEPRECATED iterator | ^~~~~~~~ make[2]: Leaving directory '/tmp/B.9grlomhr/BUILD/ceph-17.2.3/build' make[2]: Entering directory '/tmp/B.9grlomhr/BUILD/ceph-17.2.3/build' [ 5%] Building CXX object src/cls/CMakeFiles/cls_lock_client.dir/lock/cls_lock_client.cc.o cd /tmp/B.9grlomhr/BUILD/ceph-17.2.3/build/src/cls && /usr/bin/x86_64-pld-linux-g++ -DBOOST_ASIO_DISABLE_THREAD_KEYWORD_EXTENSION -DBOOST_ASIO_USE_TS_EXECUTOR_AS_DEFAULT -DHAVE_CONFIG_H -D_FILE_OFFSET_BITS=64 -D_FORTIFY_SOURCE=2 -D_GNU_SOURCE -D_REENTRANT -D_THREAD_SAFE -D__CEPH__ -D__STDC_FORMAT_MACROS -D__linux__ -I/tmp/B.9grlomhr/BUILD/ceph-17.2.3/build/src/include -I/tmp/B.9grlomhr/BUILD/ceph-17.2.3/src -isystem /tmp/B.9grlomhr/BUILD/ceph-17.2.3/build/include -isystem /tmp/B.9grlomhr/BUILD/ceph-17.2.3/src/xxHash -isystem /tmp/B.9grlomhr/BUILD/ceph-17.2.3/src/rapidjson/include -O2 -fwrapv -pipe -Wformat -Werror=format-security -gdwarf-4 -fno-debug-types-section -fvar-tracking-assignments -g2 -Wp,-D_FORTIFY_SOURCE=2 -fstack-protector-strong --param=ssp-buffer-size=4 -Werror=trampolines -fPIC -march=x86-64 -mtune=generic -gdwarf-4 -fno-debug-types-section -fvar-tracking-assignments -g2 -DNDEBUG -DQT_NO_DEBUG -fPIC -U_FORTIFY_SOURCE -Wall -fno-strict-aliasing -fsigned-char -Wtype-limits -Wignored-qualifiers -Wpointer-arith -Werror=format-security -Winit-self -Wno-unknown-pragmas -Wnon-virtual-dtor -Wno-ignored-qualifiers -ftemplate-depth-1024 -Wpessimizing-move -Wredundant-move -Wstrict-null-sentinel -Woverloaded-virtual -fno-new-ttp-matching -fstack-protector-strong -fdiagnostics-color=auto -fno-builtin-malloc -fno-builtin-calloc -fno-builtin-realloc -fno-builtin-free -std=c++17 -MD -MT src/cls/CMakeFiles/cls_lock_client.dir/lock/cls_lock_client.cc.o -MF CMakeFiles/cls_lock_client.dir/lock/cls_lock_client.cc.o.d -o CMakeFiles/cls_lock_client.dir/lock/cls_lock_client.cc.o -c /tmp/B.9grlomhr/BUILD/ceph-17.2.3/src/cls/lock/cls_lock_client.cc In file included from /tmp/B.9grlomhr/BUILD/ceph-17.2.3/src/cls/lock/cls_lock_client.cc:17: /tmp/B.9grlomhr/BUILD/ceph-17.2.3/src/include/rados/librados.hpp:107:54: warning: 'template<class _Category, class _Tp, class _Distance, class _Pointer, class _Reference> struct std::iterator' is deprecated [-Wdeprecated-declarations] 107 | class CEPH_RADOS_API NObjectIterator : public std::iterator <std::forward_iterator_tag, ListObject> { | ^~~~~~~~ In file included from /usr/include/c++/12.2.0/bits/stl_algobase.h:65, from /usr/include/c++/12.2.0/bits/stl_tree.h:63, from /usr/include/c++/12.2.0/set:60, from /tmp/B.9grlomhr/BUILD/ceph-17.2.3/src/include/encoding.h:17, from /tmp/B.9grlomhr/BUILD/ceph-17.2.3/src/include/uuid.h:9, from /tmp/B.9grlomhr/BUILD/ceph-17.2.3/src/include/types.h:21, from /tmp/B.9grlomhr/BUILD/ceph-17.2.3/src/cls/lock/cls_lock_client.cc:15: /usr/include/c++/12.2.0/bits/stl_iterator_base_types.h:127:34: note: declared here 127 | struct _GLIBCXX17_DEPRECATED iterator | ^~~~~~~~ make[2]: Leaving directory '/tmp/B.9grlomhr/BUILD/ceph-17.2.3/build' make[2]: Entering directory '/tmp/B.9grlomhr/BUILD/ceph-17.2.3/build' [ 6%] Building CXX object src/cls/CMakeFiles/cls_lock_client.dir/lock/cls_lock_ops.cc.o cd /tmp/B.9grlomhr/BUILD/ceph-17.2.3/build/src/cls && /usr/bin/x86_64-pld-linux-g++ -DBOOST_ASIO_DISABLE_THREAD_KEYWORD_EXTENSION -DBOOST_ASIO_USE_TS_EXECUTOR_AS_DEFAULT -DHAVE_CONFIG_H -D_FILE_OFFSET_BITS=64 -D_FORTIFY_SOURCE=2 -D_GNU_SOURCE -D_REENTRANT -D_THREAD_SAFE -D__CEPH__ -D__STDC_FORMAT_MACROS -D__linux__ -I/tmp/B.9grlomhr/BUILD/ceph-17.2.3/build/src/include -I/tmp/B.9grlomhr/BUILD/ceph-17.2.3/src -isystem /tmp/B.9grlomhr/BUILD/ceph-17.2.3/build/include -isystem /tmp/B.9grlomhr/BUILD/ceph-17.2.3/src/xxHash -isystem /tmp/B.9grlomhr/BUILD/ceph-17.2.3/src/rapidjson/include -O2 -fwrapv -pipe -Wformat -Werror=format-security -gdwarf-4 -fno-debug-types-section -fvar-tracking-assignments -g2 -Wp,-D_FORTIFY_SOURCE=2 -fstack-protector-strong --param=ssp-buffer-size=4 -Werror=trampolines -fPIC -march=x86-64 -mtune=generic -gdwarf-4 -fno-debug-types-section -fvar-tracking-assignments -g2 -DNDEBUG -DQT_NO_DEBUG -fPIC -U_FORTIFY_SOURCE -Wall -fno-strict-aliasing -fsigned-char -Wtype-limits -Wignored-qualifiers -Wpointer-arith -Werror=format-security -Winit-self -Wno-unknown-pragmas -Wnon-virtual-dtor -Wno-ignored-qualifiers -ftemplate-depth-1024 -Wpessimizing-move -Wredundant-move -Wstrict-null-sentinel -Woverloaded-virtual -fno-new-ttp-matching -fstack-protector-strong -fdiagnostics-color=auto -fno-builtin-malloc -fno-builtin-calloc -fno-builtin-realloc -fno-builtin-free -std=c++17 -MD -MT src/cls/CMakeFiles/cls_lock_client.dir/lock/cls_lock_ops.cc.o -MF CMakeFiles/cls_lock_client.dir/lock/cls_lock_ops.cc.o.d -o CMakeFiles/cls_lock_client.dir/lock/cls_lock_ops.cc.o -c /tmp/B.9grlomhr/BUILD/ceph-17.2.3/src/cls/lock/cls_lock_ops.cc make[2]: Leaving directory '/tmp/B.9grlomhr/BUILD/ceph-17.2.3/build' make[2]: Entering directory '/tmp/B.9grlomhr/BUILD/ceph-17.2.3/build' [ 7%] Linking CXX static library ../../lib/libcls_lock_client.a cd /tmp/B.9grlomhr/BUILD/ceph-17.2.3/build/src/cls && /usr/bin/cmake -P CMakeFiles/cls_lock_client.dir/cmake_clean_target.cmake cd /tmp/B.9grlomhr/BUILD/ceph-17.2.3/build/src/cls && /usr/bin/cmake -E cmake_link_script CMakeFiles/cls_lock_client.dir/link.txt --verbose=1 /usr/bin/ar qc ../../lib/libcls_lock_client.a CMakeFiles/cls_lock_client.dir/lock/cls_lock_client.cc.o CMakeFiles/cls_lock_client.dir/lock/cls_lock_types.cc.o CMakeFiles/cls_lock_client.dir/lock/cls_lock_ops.cc.o /usr/bin/ranlib ../../lib/libcls_lock_client.a make[2]: Leaving directory '/tmp/B.9grlomhr/BUILD/ceph-17.2.3/build' make[1]: Entering directory '/tmp/B.9grlomhr/BUILD/ceph-17.2.3/build' [ 7%] Built target cls_lock_client make[1]: Leaving directory '/tmp/B.9grlomhr/BUILD/ceph-17.2.3/build' make[2]: Entering directory '/tmp/B.9grlomhr/BUILD/ceph-17.2.3/build' [ 4%] Building CXX object src/common/options/CMakeFiles/common-options-objs.dir/mds_options.cc.o cd /tmp/B.9grlomhr/BUILD/ceph-17.2.3/build/src/common/options && /usr/bin/x86_64-pld-linux-g++ -DBOOST_ASIO_DISABLE_THREAD_KEYWORD_EXTENSION -DBOOST_ASIO_USE_TS_EXECUTOR_AS_DEFAULT -DHAVE_CONFIG_H -D_FILE_OFFSET_BITS=64 -D_FORTIFY_SOURCE=2 -D_GNU_SOURCE -D_REENTRANT -D_THREAD_SAFE -D__CEPH__ -D__STDC_FORMAT_MACROS -D__linux__ -I/tmp/B.9grlomhr/BUILD/ceph-17.2.3/build/src/include -I/tmp/B.9grlomhr/BUILD/ceph-17.2.3/src -isystem /tmp/B.9grlomhr/BUILD/ceph-17.2.3/build/include -isystem /tmp/B.9grlomhr/BUILD/ceph-17.2.3/src/xxHash -isystem /tmp/B.9grlomhr/BUILD/ceph-17.2.3/src/rapidjson/include -O2 -fwrapv -pipe -Wformat -Werror=format-security -gdwarf-4 -fno-debug-types-section -fvar-tracking-assignments -g2 -Wp,-D_FORTIFY_SOURCE=2 -fstack-protector-strong --param=ssp-buffer-size=4 -Werror=trampolines -fPIC -march=x86-64 -mtune=generic -gdwarf-4 -fno-debug-types-section -fvar-tracking-assignments -g2 -DNDEBUG -DQT_NO_DEBUG -fPIC -U_FORTIFY_SOURCE -Wall -fno-strict-aliasing -fsigned-char -Wtype-limits -Wignored-qualifiers -Wpointer-arith -Werror=format-security -Winit-self -Wno-unknown-pragmas -Wnon-virtual-dtor -Wno-ignored-qualifiers -ftemplate-depth-1024 -Wpessimizing-move -Wredundant-move -Wstrict-null-sentinel -Woverloaded-virtual -fno-new-ttp-matching -fstack-protector-strong -fdiagnostics-color=auto -fno-builtin-malloc -fno-builtin-calloc -fno-builtin-realloc -fno-builtin-free -std=c++17 -MD -MT src/common/options/CMakeFiles/common-options-objs.dir/mds_options.cc.o -MF CMakeFiles/common-options-objs.dir/mds_options.cc.o.d -o CMakeFiles/common-options-objs.dir/mds_options.cc.o -c /tmp/B.9grlomhr/BUILD/ceph-17.2.3/build/src/common/options/mds_options.cc make[2]: Leaving directory '/tmp/B.9grlomhr/BUILD/ceph-17.2.3/build' make[2]: Entering directory '/tmp/B.9grlomhr/BUILD/ceph-17.2.3/build' [ 6%] Building CXX object src/msg/CMakeFiles/common-msg-objs.dir/msg_types.cc.o cd /tmp/B.9grlomhr/BUILD/ceph-17.2.3/build/src/msg && /usr/bin/x86_64-pld-linux-g++ -DBOOST_ASIO_DISABLE_THREAD_KEYWORD_EXTENSION -DBOOST_ASIO_USE_TS_EXECUTOR_AS_DEFAULT -DHAVE_CONFIG_H -D_FILE_OFFSET_BITS=64 -D_FORTIFY_SOURCE=2 -D_GNU_SOURCE -D_REENTRANT -D_THREAD_SAFE -D__CEPH__ -D__STDC_FORMAT_MACROS -D__linux__ -I/tmp/B.9grlomhr/BUILD/ceph-17.2.3/build/src/include -I/tmp/B.9grlomhr/BUILD/ceph-17.2.3/src -isystem /tmp/B.9grlomhr/BUILD/ceph-17.2.3/build/include -isystem /tmp/B.9grlomhr/BUILD/ceph-17.2.3/src/xxHash -isystem /tmp/B.9grlomhr/BUILD/ceph-17.2.3/src/rapidjson/include -O2 -fwrapv -pipe -Wformat -Werror=format-security -gdwarf-4 -fno-debug-types-section -fvar-tracking-assignments -g2 -Wp,-D_FORTIFY_SOURCE=2 -fstack-protector-strong --param=ssp-buffer-size=4 -Werror=trampolines -fPIC -march=x86-64 -mtune=generic -gdwarf-4 -fno-debug-types-section -fvar-tracking-assignments -g2 -DNDEBUG -DQT_NO_DEBUG -fPIC -U_FORTIFY_SOURCE -Wall -fno-strict-aliasing -fsigned-char -Wtype-limits -Wignored-qualifiers -Wpointer-arith -Werror=format-security -Winit-self -Wno-unknown-pragmas -Wnon-virtual-dtor -Wno-ignored-qualifiers -ftemplate-depth-1024 -Wpessimizing-move -Wredundant-move -Wstrict-null-sentinel -Woverloaded-virtual -fno-new-ttp-matching -fstack-protector-strong -fdiagnostics-color=auto -fno-builtin-malloc -fno-builtin-calloc -fno-builtin-realloc -fno-builtin-free -std=c++17 -MD -MT src/msg/CMakeFiles/common-msg-objs.dir/msg_types.cc.o -MF CMakeFiles/common-msg-objs.dir/msg_types.cc.o.d -o CMakeFiles/common-msg-objs.dir/msg_types.cc.o -c /tmp/B.9grlomhr/BUILD/ceph-17.2.3/src/msg/msg_types.cc make[2]: Leaving directory '/tmp/B.9grlomhr/BUILD/ceph-17.2.3/build' make[2]: Entering directory '/tmp/B.9grlomhr/BUILD/ceph-17.2.3/build' [ 6%] Building CXX object src/msg/CMakeFiles/common-msg-objs.dir/Connection.cc.o cd /tmp/B.9grlomhr/BUILD/ceph-17.2.3/build/src/msg && /usr/bin/x86_64-pld-linux-g++ -DBOOST_ASIO_DISABLE_THREAD_KEYWORD_EXTENSION -DBOOST_ASIO_USE_TS_EXECUTOR_AS_DEFAULT -DHAVE_CONFIG_H -D_FILE_OFFSET_BITS=64 -D_FORTIFY_SOURCE=2 -D_GNU_SOURCE -D_REENTRANT -D_THREAD_SAFE -D__CEPH__ -D__STDC_FORMAT_MACROS -D__linux__ -I/tmp/B.9grlomhr/BUILD/ceph-17.2.3/build/src/include -I/tmp/B.9grlomhr/BUILD/ceph-17.2.3/src -isystem /tmp/B.9grlomhr/BUILD/ceph-17.2.3/build/include -isystem /tmp/B.9grlomhr/BUILD/ceph-17.2.3/src/xxHash -isystem /tmp/B.9grlomhr/BUILD/ceph-17.2.3/src/rapidjson/include -O2 -fwrapv -pipe -Wformat -Werror=format-security -gdwarf-4 -fno-debug-types-section -fvar-tracking-assignments -g2 -Wp,-D_FORTIFY_SOURCE=2 -fstack-protector-strong --param=ssp-buffer-size=4 -Werror=trampolines -fPIC -march=x86-64 -mtune=generic -gdwarf-4 -fno-debug-types-section -fvar-tracking-assignments -g2 -DNDEBUG -DQT_NO_DEBUG -fPIC -U_FORTIFY_SOURCE -Wall -fno-strict-aliasing -fsigned-char -Wtype-limits -Wignored-qualifiers -Wpointer-arith -Werror=format-security -Winit-self -Wno-unknown-pragmas -Wnon-virtual-dtor -Wno-ignored-qualifiers -ftemplate-depth-1024 -Wpessimizing-move -Wredundant-move -Wstrict-null-sentinel -Woverloaded-virtual -fno-new-ttp-matching -fstack-protector-strong -fdiagnostics-color=auto -fno-builtin-malloc -fno-builtin-calloc -fno-builtin-realloc -fno-builtin-free -std=c++17 -MD -MT src/msg/CMakeFiles/common-msg-objs.dir/Connection.cc.o -MF CMakeFiles/common-msg-objs.dir/Connection.cc.o.d -o CMakeFiles/common-msg-objs.dir/Connection.cc.o -c /tmp/B.9grlomhr/BUILD/ceph-17.2.3/src/msg/Connection.cc make[2]: Leaving directory '/tmp/B.9grlomhr/BUILD/ceph-17.2.3/build' make[2]: Entering directory '/tmp/B.9grlomhr/BUILD/ceph-17.2.3/build' [ 6%] Building CXX object src/common/options/CMakeFiles/common-options-objs.dir/mds-client_options.cc.o cd /tmp/B.9grlomhr/BUILD/ceph-17.2.3/build/src/common/options && /usr/bin/x86_64-pld-linux-g++ -DBOOST_ASIO_DISABLE_THREAD_KEYWORD_EXTENSION -DBOOST_ASIO_USE_TS_EXECUTOR_AS_DEFAULT -DHAVE_CONFIG_H -D_FILE_OFFSET_BITS=64 -D_FORTIFY_SOURCE=2 -D_GNU_SOURCE -D_REENTRANT -D_THREAD_SAFE -D__CEPH__ -D__STDC_FORMAT_MACROS -D__linux__ -I/tmp/B.9grlomhr/BUILD/ceph-17.2.3/build/src/include -I/tmp/B.9grlomhr/BUILD/ceph-17.2.3/src -isystem /tmp/B.9grlomhr/BUILD/ceph-17.2.3/build/include -isystem /tmp/B.9grlomhr/BUILD/ceph-17.2.3/src/xxHash -isystem /tmp/B.9grlomhr/BUILD/ceph-17.2.3/src/rapidjson/include -O2 -fwrapv -pipe -Wformat -Werror=format-security -gdwarf-4 -fno-debug-types-section -fvar-tracking-assignments -g2 -Wp,-D_FORTIFY_SOURCE=2 -fstack-protector-strong --param=ssp-buffer-size=4 -Werror=trampolines -fPIC -march=x86-64 -mtune=generic -gdwarf-4 -fno-debug-types-section -fvar-tracking-assignments -g2 -DNDEBUG -DQT_NO_DEBUG -fPIC -U_FORTIFY_SOURCE -Wall -fno-strict-aliasing -fsigned-char -Wtype-limits -Wignored-qualifiers -Wpointer-arith -Werror=format-security -Winit-self -Wno-unknown-pragmas -Wnon-virtual-dtor -Wno-ignored-qualifiers -ftemplate-depth-1024 -Wpessimizing-move -Wredundant-move -Wstrict-null-sentinel -Woverloaded-virtual -fno-new-ttp-matching -fstack-protector-strong -fdiagnostics-color=auto -fno-builtin-malloc -fno-builtin-calloc -fno-builtin-realloc -fno-builtin-free -std=c++17 -MD -MT src/common/options/CMakeFiles/common-options-objs.dir/mds-client_options.cc.o -MF CMakeFiles/common-options-objs.dir/mds-client_options.cc.o.d -o CMakeFiles/common-options-objs.dir/mds-client_options.cc.o -c /tmp/B.9grlomhr/BUILD/ceph-17.2.3/build/src/common/options/mds-client_options.cc make[2]: Leaving directory '/tmp/B.9grlomhr/BUILD/ceph-17.2.3/build' make[2]: Entering directory '/tmp/B.9grlomhr/BUILD/ceph-17.2.3/build' [ 4%] Building CXX object src/crush/CMakeFiles/crush_objs.dir/CrushCompiler.cc.o cd /tmp/B.9grlomhr/BUILD/ceph-17.2.3/build/src/crush && /usr/bin/x86_64-pld-linux-g++ -DBOOST_ASIO_DISABLE_THREAD_KEYWORD_EXTENSION -DBOOST_ASIO_USE_TS_EXECUTOR_AS_DEFAULT -DHAVE_CONFIG_H -D_FILE_OFFSET_BITS=64 -D_FORTIFY_SOURCE=2 -D_GNU_SOURCE -D_REENTRANT -D_THREAD_SAFE -D__CEPH__ -D__STDC_FORMAT_MACROS -D__linux__ -I/tmp/B.9grlomhr/BUILD/ceph-17.2.3/build/src/include -I/tmp/B.9grlomhr/BUILD/ceph-17.2.3/src -isystem /tmp/B.9grlomhr/BUILD/ceph-17.2.3/build/include -isystem /tmp/B.9grlomhr/BUILD/ceph-17.2.3/src/xxHash -isystem /tmp/B.9grlomhr/BUILD/ceph-17.2.3/src/rapidjson/include -O2 -fwrapv -pipe -Wformat -Werror=format-security -gdwarf-4 -fno-debug-types-section -fvar-tracking-assignments -g2 -Wp,-D_FORTIFY_SOURCE=2 -fstack-protector-strong --param=ssp-buffer-size=4 -Werror=trampolines -fPIC -march=x86-64 -mtune=generic -gdwarf-4 -fno-debug-types-section -fvar-tracking-assignments -g2 -DNDEBUG -DQT_NO_DEBUG -fPIC -U_FORTIFY_SOURCE -Wall -fno-strict-aliasing -fsigned-char -Wtype-limits -Wignored-qualifiers -Wpointer-arith -Werror=format-security -Winit-self -Wno-unknown-pragmas -Wnon-virtual-dtor -Wno-ignored-qualifiers -ftemplate-depth-1024 -Wpessimizing-move -Wredundant-move -Wstrict-null-sentinel -Woverloaded-virtual -fno-new-ttp-matching -fstack-protector-strong -fdiagnostics-color=auto -fno-builtin-malloc -fno-builtin-calloc -fno-builtin-realloc -fno-builtin-free -std=c++17 -MD -MT src/crush/CMakeFiles/crush_objs.dir/CrushCompiler.cc.o -MF CMakeFiles/crush_objs.dir/CrushCompiler.cc.o.d -o CMakeFiles/crush_objs.dir/CrushCompiler.cc.o -c /tmp/B.9grlomhr/BUILD/ceph-17.2.3/src/crush/CrushCompiler.cc make[2]: Leaving directory '/tmp/B.9grlomhr/BUILD/ceph-17.2.3/build' make[1]: *** [CMakeFiles/Makefile2:3067: src/crush/CMakeFiles/crush_objs.dir/all] Error 2 make[2]: Entering directory '/tmp/B.9grlomhr/BUILD/ceph-17.2.3/build' [ 7%] Building CXX object src/msg/CMakeFiles/common-msg-objs.dir/compressor_registry.cc.o cd /tmp/B.9grlomhr/BUILD/ceph-17.2.3/build/src/msg && /usr/bin/x86_64-pld-linux-g++ -DBOOST_ASIO_DISABLE_THREAD_KEYWORD_EXTENSION -DBOOST_ASIO_USE_TS_EXECUTOR_AS_DEFAULT -DHAVE_CONFIG_H -D_FILE_OFFSET_BITS=64 -D_FORTIFY_SOURCE=2 -D_GNU_SOURCE -D_REENTRANT -D_THREAD_SAFE -D__CEPH__ -D__STDC_FORMAT_MACROS -D__linux__ -I/tmp/B.9grlomhr/BUILD/ceph-17.2.3/build/src/include -I/tmp/B.9grlomhr/BUILD/ceph-17.2.3/src -isystem /tmp/B.9grlomhr/BUILD/ceph-17.2.3/build/include -isystem /tmp/B.9grlomhr/BUILD/ceph-17.2.3/src/xxHash -isystem /tmp/B.9grlomhr/BUILD/ceph-17.2.3/src/rapidjson/include -O2 -fwrapv -pipe -Wformat -Werror=format-security -gdwarf-4 -fno-debug-types-section -fvar-tracking-assignments -g2 -Wp,-D_FORTIFY_SOURCE=2 -fstack-protector-strong --param=ssp-buffer-size=4 -Werror=trampolines -fPIC -march=x86-64 -mtune=generic -gdwarf-4 -fno-debug-types-section -fvar-tracking-assignments -g2 -DNDEBUG -DQT_NO_DEBUG -fPIC -U_FORTIFY_SOURCE -Wall -fno-strict-aliasing -fsigned-char -Wtype-limits -Wignored-qualifiers -Wpointer-arith -Werror=format-security -Winit-self -Wno-unknown-pragmas -Wnon-virtual-dtor -Wno-ignored-qualifiers -ftemplate-depth-1024 -Wpessimizing-move -Wredundant-move -Wstrict-null-sentinel -Woverloaded-virtual -fno-new-ttp-matching -fstack-protector-strong -fdiagnostics-color=auto -fno-builtin-malloc -fno-builtin-calloc -fno-builtin-realloc -fno-builtin-free -std=c++17 -MD -MT src/msg/CMakeFiles/common-msg-objs.dir/compressor_registry.cc.o -MF CMakeFiles/common-msg-objs.dir/compressor_registry.cc.o.d -o CMakeFiles/common-msg-objs.dir/compressor_registry.cc.o -c /tmp/B.9grlomhr/BUILD/ceph-17.2.3/src/msg/compressor_registry.cc make[2]: Leaving directory '/tmp/B.9grlomhr/BUILD/ceph-17.2.3/build' make[2]: Entering directory '/tmp/B.9grlomhr/BUILD/ceph-17.2.3/build' [ 7%] Building CXX object src/common/options/CMakeFiles/common-options-objs.dir/mon_options.cc.o cd /tmp/B.9grlomhr/BUILD/ceph-17.2.3/build/src/common/options && /usr/bin/x86_64-pld-linux-g++ -DBOOST_ASIO_DISABLE_THREAD_KEYWORD_EXTENSION -DBOOST_ASIO_USE_TS_EXECUTOR_AS_DEFAULT -DHAVE_CONFIG_H -D_FILE_OFFSET_BITS=64 -D_FORTIFY_SOURCE=2 -D_GNU_SOURCE -D_REENTRANT -D_THREAD_SAFE -D__CEPH__ -D__STDC_FORMAT_MACROS -D__linux__ -I/tmp/B.9grlomhr/BUILD/ceph-17.2.3/build/src/include -I/tmp/B.9grlomhr/BUILD/ceph-17.2.3/src -isystem /tmp/B.9grlomhr/BUILD/ceph-17.2.3/build/include -isystem /tmp/B.9grlomhr/BUILD/ceph-17.2.3/src/xxHash -isystem /tmp/B.9grlomhr/BUILD/ceph-17.2.3/src/rapidjson/include -O2 -fwrapv -pipe -Wformat -Werror=format-security -gdwarf-4 -fno-debug-types-section -fvar-tracking-assignments -g2 -Wp,-D_FORTIFY_SOURCE=2 -fstack-protector-strong --param=ssp-buffer-size=4 -Werror=trampolines -fPIC -march=x86-64 -mtune=generic -gdwarf-4 -fno-debug-types-section -fvar-tracking-assignments -g2 -DNDEBUG -DQT_NO_DEBUG -fPIC -U_FORTIFY_SOURCE -Wall -fno-strict-aliasing -fsigned-char -Wtype-limits -Wignored-qualifiers -Wpointer-arith -Werror=format-security -Winit-self -Wno-unknown-pragmas -Wnon-virtual-dtor -Wno-ignored-qualifiers -ftemplate-depth-1024 -Wpessimizing-move -Wredundant-move -Wstrict-null-sentinel -Woverloaded-virtual -fno-new-ttp-matching -fstack-protector-strong -fdiagnostics-color=auto -fno-builtin-malloc -fno-builtin-calloc -fno-builtin-realloc -fno-builtin-free -std=c++17 -MD -MT src/common/options/CMakeFiles/common-options-objs.dir/mon_options.cc.o -MF CMakeFiles/common-options-objs.dir/mon_options.cc.o.d -o CMakeFiles/common-options-objs.dir/mon_options.cc.o -c /tmp/B.9grlomhr/BUILD/ceph-17.2.3/build/src/common/options/mon_options.cc make[2]: Leaving directory '/tmp/B.9grlomhr/BUILD/ceph-17.2.3/build' make[2]: Entering directory '/tmp/B.9grlomhr/BUILD/ceph-17.2.3/build' [ 7%] Building CXX object src/msg/CMakeFiles/common-msg-objs.dir/async/AsyncConnection.cc.o cd /tmp/B.9grlomhr/BUILD/ceph-17.2.3/build/src/msg && /usr/bin/x86_64-pld-linux-g++ -DBOOST_ASIO_DISABLE_THREAD_KEYWORD_EXTENSION -DBOOST_ASIO_USE_TS_EXECUTOR_AS_DEFAULT -DHAVE_CONFIG_H -D_FILE_OFFSET_BITS=64 -D_FORTIFY_SOURCE=2 -D_GNU_SOURCE -D_REENTRANT -D_THREAD_SAFE -D__CEPH__ -D__STDC_FORMAT_MACROS -D__linux__ -I/tmp/B.9grlomhr/BUILD/ceph-17.2.3/build/src/include -I/tmp/B.9grlomhr/BUILD/ceph-17.2.3/src -isystem /tmp/B.9grlomhr/BUILD/ceph-17.2.3/build/include -isystem /tmp/B.9grlomhr/BUILD/ceph-17.2.3/src/xxHash -isystem /tmp/B.9grlomhr/BUILD/ceph-17.2.3/src/rapidjson/include -O2 -fwrapv -pipe -Wformat -Werror=format-security -gdwarf-4 -fno-debug-types-section -fvar-tracking-assignments -g2 -Wp,-D_FORTIFY_SOURCE=2 -fstack-protector-strong --param=ssp-buffer-size=4 -Werror=trampolines -fPIC -march=x86-64 -mtune=generic -gdwarf-4 -fno-debug-types-section -fvar-tracking-assignments -g2 -DNDEBUG -DQT_NO_DEBUG -fPIC -U_FORTIFY_SOURCE -Wall -fno-strict-aliasing -fsigned-char -Wtype-limits -Wignored-qualifiers -Wpointer-arith -Werror=format-security -Winit-self -Wno-unknown-pragmas -Wnon-virtual-dtor -Wno-ignored-qualifiers -ftemplate-depth-1024 -Wpessimizing-move -Wredundant-move -Wstrict-null-sentinel -Woverloaded-virtual -fno-new-ttp-matching -fstack-protector-strong -fdiagnostics-color=auto -fno-builtin-malloc -fno-builtin-calloc -fno-builtin-realloc -fno-builtin-free -std=c++17 -MD -MT src/msg/CMakeFiles/common-msg-objs.dir/async/AsyncConnection.cc.o -MF CMakeFiles/common-msg-objs.dir/async/AsyncConnection.cc.o.d -o CMakeFiles/common-msg-objs.dir/async/AsyncConnection.cc.o -c /tmp/B.9grlomhr/BUILD/ceph-17.2.3/src/msg/async/AsyncConnection.cc In file included from /tmp/B.9grlomhr/BUILD/ceph-17.2.3/src/msg/async/AsyncMessenger.h:23, from /tmp/B.9grlomhr/BUILD/ceph-17.2.3/src/msg/async/AsyncConnection.cc:22: /tmp/B.9grlomhr/BUILD/ceph-17.2.3/src/include/xlist.h:162:24: warning: 'template<class _Category, class _Tp, class _Distance, class _Pointer, class _Reference> struct std::iterator' is deprecated [-Wdeprecated-declarations] 162 | class iterator: std::iterator<std::forward_iterator_tag, T> { | ^~~~~~~~ In file included from /usr/include/c++/12.2.0/string:45, from /tmp/B.9grlomhr/BUILD/ceph-17.2.3/src/include/ceph_assert.h:5, from /tmp/B.9grlomhr/BUILD/ceph-17.2.3/src/common/dout.h:21, from /tmp/B.9grlomhr/BUILD/ceph-17.2.3/src/include/Context.h:19, from /tmp/B.9grlomhr/BUILD/ceph-17.2.3/src/msg/async/AsyncConnection.cc:19: /usr/include/c++/12.2.0/bits/stl_iterator_base_types.h:127:34: note: declared here 127 | struct _GLIBCXX17_DEPRECATED iterator | ^~~~~~~~ /tmp/B.9grlomhr/BUILD/ceph-17.2.3/src/include/xlist.h:186:30: warning: 'template<class _Category, class _Tp, class _Distance, class _Pointer, class _Reference> struct std::iterator' is deprecated [-Wdeprecated-declarations] 186 | class const_iterator: std::iterator<std::forward_iterator_tag, T> { | ^~~~~~~~ /usr/include/c++/12.2.0/bits/stl_iterator_base_types.h:127:34: note: declared here 127 | struct _GLIBCXX17_DEPRECATED iterator | ^~~~~~~~ In file included from /tmp/B.9grlomhr/BUILD/ceph-17.2.3/src/librados/ListObjectImpl.h:19, from /tmp/B.9grlomhr/BUILD/ceph-17.2.3/src/osd/osd_types.h:51, from /tmp/B.9grlomhr/BUILD/ceph-17.2.3/src/messages/MOSDFastDispatchOp.h:8, from /tmp/B.9grlomhr/BUILD/ceph-17.2.3/src/messages/MOSDOp.h:21, from /tmp/B.9grlomhr/BUILD/ceph-17.2.3/src/msg/async/AsyncConnection.cc:28: /tmp/B.9grlomhr/BUILD/ceph-17.2.3/src/include/rados/librados.hpp:107:54: warning: 'template<class _Category, class _Tp, class _Distance, class _Pointer, class _Reference> struct std::iterator' is deprecated [-Wdeprecated-declarations] 107 | class CEPH_RADOS_API NObjectIterator : public std::iterator <std::forward_iterator_tag, ListObject> { | ^~~~~~~~ /usr/include/c++/12.2.0/bits/stl_iterator_base_types.h:127:34: note: declared here 127 | struct _GLIBCXX17_DEPRECATED iterator | ^~~~~~~~ /tmp/B.9grlomhr/BUILD/ceph-17.2.3/src/osd/osd_types.h: In lambda function: /tmp/B.9grlomhr/BUILD/ceph-17.2.3/src/common/dout.h:185:56: error: call to non-'constexpr' function 'ceph::dout::dynamic_marker_t<T> ceph::dout::need_dynamic(T&&) [with T = unsigned int]' 185 | dout_impl(pdpp->get_cct(), ceph::dout::need_dynamic(pdpp->get_subsys()), v) \ | ~~~~~~~~~~~~~~~~~~~~~~~~^~~~~~~~~~~~~~~~~~~~ /tmp/B.9grlomhr/BUILD/ceph-17.2.3/src/common/dout.h:156:58: note: in definition of macro 'dout_impl' 156 | return (cctX->_conf->subsys.template should_gather<sub, v>()); \ | ^~~ /tmp/B.9grlomhr/BUILD/ceph-17.2.3/src/osd/osd_types.h:3651:3: note: in expansion of macro 'ldpp_dout' 3651 | ldpp_dout(dpp, 10) << "build_prior all_probe " << all_probe << dendl; | ^~~~~~~~~ /tmp/B.9grlomhr/BUILD/ceph-17.2.3/src/common/dout.h:106:21: note: 'ceph::dout::dynamic_marker_t<T> ceph::dout::need_dynamic(T&&) [with T = unsigned int]' declared here 106 | dynamic_marker_t<T> need_dynamic(T&& t) { | ^~~~~~~~~~~~ /tmp/B.9grlomhr/BUILD/ceph-17.2.3/src/osd/osd_types.h: In lambda function: /tmp/B.9grlomhr/BUILD/ceph-17.2.3/src/common/dout.h:185:56: error: call to non-'constexpr' function 'ceph::dout::dynamic_marker_t<T> ceph::dout::need_dynamic(T&&) [with T = unsigned int]' 185 | dout_impl(pdpp->get_cct(), ceph::dout::need_dynamic(pdpp->get_subsys()), v) \ | ~~~~~~~~~~~~~~~~~~~~~~~~^~~~~~~~~~~~~~~~~~~~ /tmp/B.9grlomhr/BUILD/ceph-17.2.3/src/common/dout.h:156:58: note: in definition of macro 'dout_impl' 156 | return (cctX->_conf->subsys.template should_gather<sub, v>()); \ | ^~~ /tmp/B.9grlomhr/BUILD/ceph-17.2.3/src/osd/osd_types.h:3670:7: note: in expansion of macro 'ldpp_dout' 3670 | ldpp_dout(dpp, 10) << "build_prior maybe_rw interval:" << start | ^~~~~~~~~ /tmp/B.9grlomhr/BUILD/ceph-17.2.3/src/common/dout.h:106:21: note: 'ceph::dout::dynamic_marker_t<T> ceph::dout::need_dynamic(T&&) [with T = unsigned int]' declared here 106 | dynamic_marker_t<T> need_dynamic(T&& t) { | ^~~~~~~~~~~~ /tmp/B.9grlomhr/BUILD/ceph-17.2.3/src/osd/osd_types.h: In lambda function: /tmp/B.9grlomhr/BUILD/ceph-17.2.3/src/common/dout.h:185:56: error: call to non-'constexpr' function 'ceph::dout::dynamic_marker_t<T> ceph::dout::need_dynamic(T&&) [with T = unsigned int]' 185 | dout_impl(pdpp->get_cct(), ceph::dout::need_dynamic(pdpp->get_subsys()), v) \ | ~~~~~~~~~~~~~~~~~~~~~~~~^~~~~~~~~~~~~~~~~~~~ /tmp/B.9grlomhr/BUILD/ceph-17.2.3/src/common/dout.h:156:58: note: in definition of macro 'dout_impl' 156 | return (cctX->_conf->subsys.template should_gather<sub, v>()); \ | ^~~ /tmp/B.9grlomhr/BUILD/ceph-17.2.3/src/osd/osd_types.h:3691:11: note: in expansion of macro 'ldpp_dout' 3691 | ldpp_dout(dpp, 10) << "build_prior prior osd." << so.osd | ^~~~~~~~~ /tmp/B.9grlomhr/BUILD/ceph-17.2.3/src/common/dout.h:106:21: note: 'ceph::dout::dynamic_marker_t<T> ceph::dout::need_dynamic(T&&) [with T = unsigned int]' declared here 106 | dynamic_marker_t<T> need_dynamic(T&& t) { | ^~~~~~~~~~~~ /tmp/B.9grlomhr/BUILD/ceph-17.2.3/src/osd/osd_types.h: In lambda function: /tmp/B.9grlomhr/BUILD/ceph-17.2.3/src/common/dout.h:185:56: error: call to non-'constexpr' function 'ceph::dout::dynamic_marker_t<T> ceph::dout::need_dynamic(T&&) [with T = unsigned int]' 185 | dout_impl(pdpp->get_cct(), ceph::dout::need_dynamic(pdpp->get_subsys()), v) \ | ~~~~~~~~~~~~~~~~~~~~~~~~^~~~~~~~~~~~~~~~~~~~ /tmp/B.9grlomhr/BUILD/ceph-17.2.3/src/common/dout.h:156:58: note: in definition of macro 'dout_impl' 156 | return (cctX->_conf->subsys.template should_gather<sub, v>()); \ | ^~~ /tmp/B.9grlomhr/BUILD/ceph-17.2.3/src/osd/osd_types.h:3696:11: note: in expansion of macro 'ldpp_dout' 3696 | ldpp_dout(dpp, 10) << "build_prior prior osd." << so.osd | ^~~~~~~~~ /tmp/B.9grlomhr/BUILD/ceph-17.2.3/src/common/dout.h:106:21: note: 'ceph::dout::dynamic_marker_t<T> ceph::dout::need_dynamic(T&&) [with T = unsigned int]' declared here 106 | dynamic_marker_t<T> need_dynamic(T&& t) { | ^~~~~~~~~~~~ /tmp/B.9grlomhr/BUILD/ceph-17.2.3/src/osd/osd_types.h: In lambda function: /tmp/B.9grlomhr/BUILD/ceph-17.2.3/src/common/dout.h:185:56: error: call to non-'constexpr' function 'ceph::dout::dynamic_marker_t<T> ceph::dout::need_dynamic(T&&) [with T = unsigned int]' 185 | dout_impl(pdpp->get_cct(), ceph::dout::need_dynamic(pdpp->get_subsys()), v) \ | ~~~~~~~~~~~~~~~~~~~~~~~~^~~~~~~~~~~~~~~~~~~~ /tmp/B.9grlomhr/BUILD/ceph-17.2.3/src/common/dout.h:156:58: note: in definition of macro 'dout_impl' 156 | return (cctX->_conf->subsys.template should_gather<sub, v>()); \ | ^~~ /tmp/B.9grlomhr/BUILD/ceph-17.2.3/src/osd/osd_types.h:3702:11: note: in expansion of macro 'ldpp_dout' 3702 | ldpp_dout(dpp, 10) << "build_prior prior osd." << so.osd | ^~~~~~~~~ /tmp/B.9grlomhr/BUILD/ceph-17.2.3/src/common/dout.h:106:21: note: 'ceph::dout::dynamic_marker_t<T> ceph::dout::need_dynamic(T&&) [with T = unsigned int]' declared here 106 | dynamic_marker_t<T> need_dynamic(T&& t) { | ^~~~~~~~~~~~ /tmp/B.9grlomhr/BUILD/ceph-17.2.3/src/osd/osd_types.h: In lambda function: /tmp/B.9grlomhr/BUILD/ceph-17.2.3/src/common/dout.h:185:56: error: call to non-'constexpr' function 'ceph::dout::dynamic_marker_t<T> ceph::dout::need_dynamic(T&&) [with T = unsigned int]' 185 | dout_impl(pdpp->get_cct(), ceph::dout::need_dynamic(pdpp->get_subsys()), v) \ | ~~~~~~~~~~~~~~~~~~~~~~~~^~~~~~~~~~~~~~~~~~~~ /tmp/B.9grlomhr/BUILD/ceph-17.2.3/src/common/dout.h:156:58: note: in definition of macro 'dout_impl' 156 | return (cctX->_conf->subsys.template should_gather<sub, v>()); \ | ^~~ /tmp/B.9grlomhr/BUILD/ceph-17.2.3/src/osd/osd_types.h:3716:9: note: in expansion of macro 'ldpp_dout' 3716 | ldpp_dout(dpp, 10) << "build_prior possibly went active+rw," | ^~~~~~~~~ /tmp/B.9grlomhr/BUILD/ceph-17.2.3/src/common/dout.h:106:21: note: 'ceph::dout::dynamic_marker_t<T> ceph::dout::need_dynamic(T&&) [with T = unsigned int]' declared here 106 | dynamic_marker_t<T> need_dynamic(T&& t) { | ^~~~~~~~~~~~ /tmp/B.9grlomhr/BUILD/ceph-17.2.3/src/osd/osd_types.h: In lambda function: /tmp/B.9grlomhr/BUILD/ceph-17.2.3/src/common/dout.h:185:56: error: call to non-'constexpr' function 'ceph::dout::dynamic_marker_t<T> ceph::dout::need_dynamic(T&&) [with T = unsigned int]' 185 | dout_impl(pdpp->get_cct(), ceph::dout::need_dynamic(pdpp->get_subsys()), v) \ | ~~~~~~~~~~~~~~~~~~~~~~~~^~~~~~~~~~~~~~~~~~~~ /tmp/B.9grlomhr/BUILD/ceph-17.2.3/src/common/dout.h:156:58: note: in definition of macro 'dout_impl' 156 | return (cctX->_conf->subsys.template should_gather<sub, v>()); \ | ^~~ /tmp/B.9grlomhr/BUILD/ceph-17.2.3/src/osd/osd_types.h:3726:3: note: in expansion of macro 'ldpp_dout' 3726 | ldpp_dout(dpp, 10) << "build_prior final: probe " << probe | ^~~~~~~~~ /tmp/B.9grlomhr/BUILD/ceph-17.2.3/src/common/dout.h:106:21: note: 'ceph::dout::dynamic_marker_t<T> ceph::dout::need_dynamic(T&&) [with T = unsigned int]' declared here 106 | dynamic_marker_t<T> need_dynamic(T&& t) { | ^~~~~~~~~~~~ make[2]: *** [src/msg/CMakeFiles/common-msg-objs.dir/build.make:163: src/msg/CMakeFiles/common-msg-objs.dir/async/AsyncConnection.cc.o] Error 1 make[2]: Leaving directory '/tmp/B.9grlomhr/BUILD/ceph-17.2.3/build' make[2]: *** Waiting for unfinished jobs.... make[2]: Entering directory '/tmp/B.9grlomhr/BUILD/ceph-17.2.3/build' [ 7%] Building CXX object src/msg/CMakeFiles/common-msg-objs.dir/async/Protocol.cc.o cd /tmp/B.9grlomhr/BUILD/ceph-17.2.3/build/src/msg && /usr/bin/x86_64-pld-linux-g++ -DBOOST_ASIO_DISABLE_THREAD_KEYWORD_EXTENSION -DBOOST_ASIO_USE_TS_EXECUTOR_AS_DEFAULT -DHAVE_CONFIG_H -D_FILE_OFFSET_BITS=64 -D_FORTIFY_SOURCE=2 -D_GNU_SOURCE -D_REENTRANT -D_THREAD_SAFE -D__CEPH__ -D__STDC_FORMAT_MACROS -D__linux__ -I/tmp/B.9grlomhr/BUILD/ceph-17.2.3/build/src/include -I/tmp/B.9grlomhr/BUILD/ceph-17.2.3/src -isystem /tmp/B.9grlomhr/BUILD/ceph-17.2.3/build/include -isystem /tmp/B.9grlomhr/BUILD/ceph-17.2.3/src/xxHash -isystem /tmp/B.9grlomhr/BUILD/ceph-17.2.3/src/rapidjson/include -O2 -fwrapv -pipe -Wformat -Werror=format-security -gdwarf-4 -fno-debug-types-section -fvar-tracking-assignments -g2 -Wp,-D_FORTIFY_SOURCE=2 -fstack-protector-strong --param=ssp-buffer-size=4 -Werror=trampolines -fPIC -march=x86-64 -mtune=generic -gdwarf-4 -fno-debug-types-section -fvar-tracking-assignments -g2 -DNDEBUG -DQT_NO_DEBUG -fPIC -U_FORTIFY_SOURCE -Wall -fno-strict-aliasing -fsigned-char -Wtype-limits -Wignored-qualifiers -Wpointer-arith -Werror=format-security -Winit-self -Wno-unknown-pragmas -Wnon-virtual-dtor -Wno-ignored-qualifiers -ftemplate-depth-1024 -Wpessimizing-move -Wredundant-move -Wstrict-null-sentinel -Woverloaded-virtual -fno-new-ttp-matching -fstack-protector-strong -fdiagnostics-color=auto -fno-builtin-malloc -fno-builtin-calloc -fno-builtin-realloc -fno-builtin-free -std=c++17 -MD -MT src/msg/CMakeFiles/common-msg-objs.dir/async/Protocol.cc.o -MF CMakeFiles/common-msg-objs.dir/async/Protocol.cc.o.d -o CMakeFiles/common-msg-objs.dir/async/Protocol.cc.o -c /tmp/B.9grlomhr/BUILD/ceph-17.2.3/src/msg/async/Protocol.cc In file included from /tmp/B.9grlomhr/BUILD/ceph-17.2.3/src/msg/async/AsyncMessenger.h:23, from /tmp/B.9grlomhr/BUILD/ceph-17.2.3/src/msg/async/Protocol.cc:4: /tmp/B.9grlomhr/BUILD/ceph-17.2.3/src/include/xlist.h:162:24: warning: 'template<class _Category, class _Tp, class _Distance, class _Pointer, class _Reference> struct std::iterator' is deprecated [-Wdeprecated-declarations] 162 | class iterator: std::iterator<std::forward_iterator_tag, T> { | ^~~~~~~~ In file included from /usr/include/c++/12.2.0/bits/stl_algobase.h:65, from /usr/include/c++/12.2.0/list:60, from /tmp/B.9grlomhr/BUILD/ceph-17.2.3/src/msg/async/Protocol.h:7, from /tmp/B.9grlomhr/BUILD/ceph-17.2.3/src/msg/async/Protocol.cc:1: /usr/include/c++/12.2.0/bits/stl_iterator_base_types.h:127:34: note: declared here 127 | struct _GLIBCXX17_DEPRECATED iterator | ^~~~~~~~ /tmp/B.9grlomhr/BUILD/ceph-17.2.3/src/include/xlist.h:186:30: warning: 'template<class _Category, class _Tp, class _Distance, class _Pointer, class _Reference> struct std::iterator' is deprecated [-Wdeprecated-declarations] 186 | class const_iterator: std::iterator<std::forward_iterator_tag, T> { | ^~~~~~~~ /usr/include/c++/12.2.0/bits/stl_iterator_base_types.h:127:34: note: declared here 127 | struct _GLIBCXX17_DEPRECATED iterator | ^~~~~~~~ make[2]: Leaving directory '/tmp/B.9grlomhr/BUILD/ceph-17.2.3/build' make[2]: Entering directory '/tmp/B.9grlomhr/BUILD/ceph-17.2.3/build' [ 7%] Building CXX object src/msg/CMakeFiles/common-msg-objs.dir/async/AsyncMessenger.cc.o cd /tmp/B.9grlomhr/BUILD/ceph-17.2.3/build/src/msg && /usr/bin/x86_64-pld-linux-g++ -DBOOST_ASIO_DISABLE_THREAD_KEYWORD_EXTENSION -DBOOST_ASIO_USE_TS_EXECUTOR_AS_DEFAULT -DHAVE_CONFIG_H -D_FILE_OFFSET_BITS=64 -D_FORTIFY_SOURCE=2 -D_GNU_SOURCE -D_REENTRANT -D_THREAD_SAFE -D__CEPH__ -D__STDC_FORMAT_MACROS -D__linux__ -I/tmp/B.9grlomhr/BUILD/ceph-17.2.3/build/src/include -I/tmp/B.9grlomhr/BUILD/ceph-17.2.3/src -isystem /tmp/B.9grlomhr/BUILD/ceph-17.2.3/build/include -isystem /tmp/B.9grlomhr/BUILD/ceph-17.2.3/src/xxHash -isystem /tmp/B.9grlomhr/BUILD/ceph-17.2.3/src/rapidjson/include -O2 -fwrapv -pipe -Wformat -Werror=format-security -gdwarf-4 -fno-debug-types-section -fvar-tracking-assignments -g2 -Wp,-D_FORTIFY_SOURCE=2 -fstack-protector-strong --param=ssp-buffer-size=4 -Werror=trampolines -fPIC -march=x86-64 -mtune=generic -gdwarf-4 -fno-debug-types-section -fvar-tracking-assignments -g2 -DNDEBUG -DQT_NO_DEBUG -fPIC -U_FORTIFY_SOURCE -Wall -fno-strict-aliasing -fsigned-char -Wtype-limits -Wignored-qualifiers -Wpointer-arith -Werror=format-security -Winit-self -Wno-unknown-pragmas -Wnon-virtual-dtor -Wno-ignored-qualifiers -ftemplate-depth-1024 -Wpessimizing-move -Wredundant-move -Wstrict-null-sentinel -Woverloaded-virtual -fno-new-ttp-matching -fstack-protector-strong -fdiagnostics-color=auto -fno-builtin-malloc -fno-builtin-calloc -fno-builtin-realloc -fno-builtin-free -std=c++17 -MD -MT src/msg/CMakeFiles/common-msg-objs.dir/async/AsyncMessenger.cc.o -MF CMakeFiles/common-msg-objs.dir/async/AsyncMessenger.cc.o.d -o CMakeFiles/common-msg-objs.dir/async/AsyncMessenger.cc.o -c /tmp/B.9grlomhr/BUILD/ceph-17.2.3/src/msg/async/AsyncMessenger.cc In file included from /tmp/B.9grlomhr/BUILD/ceph-17.2.3/src/msg/async/AsyncMessenger.h:23, from /tmp/B.9grlomhr/BUILD/ceph-17.2.3/src/msg/async/AsyncMessenger.cc:22: /tmp/B.9grlomhr/BUILD/ceph-17.2.3/src/include/xlist.h:162:24: warning: 'template<class _Category, class _Tp, class _Distance, class _Pointer, class _Reference> struct std::iterator' is deprecated [-Wdeprecated-declarations] 162 | class iterator: std::iterator<std::forward_iterator_tag, T> { | ^~~~~~~~ In file included from /usr/include/c++/12.2.0/string:45, from /usr/include/c++/12.2.0/bits/locale_classes.h:40, from /usr/include/c++/12.2.0/bits/ios_base.h:41, from /usr/include/c++/12.2.0/ios:42, from /usr/include/c++/12.2.0/ostream:38, from /usr/include/c++/12.2.0/iostream:39, from /tmp/B.9grlomhr/BUILD/ceph-17.2.3/src/msg/async/AsyncMessenger.cc:19: /usr/include/c++/12.2.0/bits/stl_iterator_base_types.h:127:34: note: declared here 127 | struct _GLIBCXX17_DEPRECATED iterator | ^~~~~~~~ /tmp/B.9grlomhr/BUILD/ceph-17.2.3/src/include/xlist.h:186:30: warning: 'template<class _Category, class _Tp, class _Distance, class _Pointer, class _Reference> struct std::iterator' is deprecated [-Wdeprecated-declarations] 186 | class const_iterator: std::iterator<std::forward_iterator_tag, T> { | ^~~~~~~~ /usr/include/c++/12.2.0/bits/stl_iterator_base_types.h:127:34: note: declared here 127 | struct _GLIBCXX17_DEPRECATED iterator | ^~~~~~~~ In file included from /tmp/B.9grlomhr/BUILD/ceph-17.2.3/src/librados/ListObjectImpl.h:19, from /tmp/B.9grlomhr/BUILD/ceph-17.2.3/src/osd/osd_types.h:51, from /tmp/B.9grlomhr/BUILD/ceph-17.2.3/src/messages/MOSDFastDispatchOp.h:8, from /tmp/B.9grlomhr/BUILD/ceph-17.2.3/src/messages/MOSDOp.h:21, from /tmp/B.9grlomhr/BUILD/ceph-17.2.3/src/msg/async/AsyncMessenger.cc:28: /tmp/B.9grlomhr/BUILD/ceph-17.2.3/src/include/rados/librados.hpp:107:54: warning: 'template<class _Category, class _Tp, class _Distance, class _Pointer, class _Reference> struct std::iterator' is deprecated [-Wdeprecated-declarations] 107 | class CEPH_RADOS_API NObjectIterator : public std::iterator <std::forward_iterator_tag, ListObject> { | ^~~~~~~~ /usr/include/c++/12.2.0/bits/stl_iterator_base_types.h:127:34: note: declared here 127 | struct _GLIBCXX17_DEPRECATED iterator | ^~~~~~~~ In file included from /tmp/B.9grlomhr/BUILD/ceph-17.2.3/src/include/Context.h:19, from /tmp/B.9grlomhr/BUILD/ceph-17.2.3/src/common/Cond.h:21, from /tmp/B.9grlomhr/BUILD/ceph-17.2.3/src/msg/async/AsyncMessenger.h:29: /tmp/B.9grlomhr/BUILD/ceph-17.2.3/src/osd/osd_types.h: In lambda function: /tmp/B.9grlomhr/BUILD/ceph-17.2.3/src/common/dout.h:185:56: error: call to non-'constexpr' function 'ceph::dout::dynamic_marker_t<T> ceph::dout::need_dynamic(T&&) [with T = unsigned int]' 185 | dout_impl(pdpp->get_cct(), ceph::dout::need_dynamic(pdpp->get_subsys()), v) \ | ~~~~~~~~~~~~~~~~~~~~~~~~^~~~~~~~~~~~~~~~~~~~ /tmp/B.9grlomhr/BUILD/ceph-17.2.3/src/common/dout.h:156:58: note: in definition of macro 'dout_impl' 156 | return (cctX->_conf->subsys.template should_gather<sub, v>()); \ | ^~~ /tmp/B.9grlomhr/BUILD/ceph-17.2.3/src/osd/osd_types.h:3651:3: note: in expansion of macro 'ldpp_dout' 3651 | ldpp_dout(dpp, 10) << "build_prior all_probe " << all_probe << dendl; | ^~~~~~~~~ /tmp/B.9grlomhr/BUILD/ceph-17.2.3/src/common/dout.h:106:21: note: 'ceph::dout::dynamic_marker_t<T> ceph::dout::need_dynamic(T&&) [with T = unsigned int]' declared here 106 | dynamic_marker_t<T> need_dynamic(T&& t) { | ^~~~~~~~~~~~ /tmp/B.9grlomhr/BUILD/ceph-17.2.3/src/osd/osd_types.h: In lambda function: /tmp/B.9grlomhr/BUILD/ceph-17.2.3/src/common/dout.h:185:56: error: call to non-'constexpr' function 'ceph::dout::dynamic_marker_t<T> ceph::dout::need_dynamic(T&&) [with T = unsigned int]' 185 | dout_impl(pdpp->get_cct(), ceph::dout::need_dynamic(pdpp->get_subsys()), v) \ | ~~~~~~~~~~~~~~~~~~~~~~~~^~~~~~~~~~~~~~~~~~~~ /tmp/B.9grlomhr/BUILD/ceph-17.2.3/src/common/dout.h:156:58: note: in definition of macro 'dout_impl' 156 | return (cctX->_conf->subsys.template should_gather<sub, v>()); \ | ^~~ /tmp/B.9grlomhr/BUILD/ceph-17.2.3/src/osd/osd_types.h:3670:7: note: in expansion of macro 'ldpp_dout' 3670 | ldpp_dout(dpp, 10) << "build_prior maybe_rw interval:" << start | ^~~~~~~~~ /tmp/B.9grlomhr/BUILD/ceph-17.2.3/src/common/dout.h:106:21: note: 'ceph::dout::dynamic_marker_t<T> ceph::dout::need_dynamic(T&&) [with T = unsigned int]' declared here 106 | dynamic_marker_t<T> need_dynamic(T&& t) { | ^~~~~~~~~~~~ /tmp/B.9grlomhr/BUILD/ceph-17.2.3/src/osd/osd_types.h: In lambda function: /tmp/B.9grlomhr/BUILD/ceph-17.2.3/src/common/dout.h:185:56: error: call to non-'constexpr' function 'ceph::dout::dynamic_marker_t<T> ceph::dout::need_dynamic(T&&) [with T = unsigned int]' 185 | dout_impl(pdpp->get_cct(), ceph::dout::need_dynamic(pdpp->get_subsys()), v) \ | ~~~~~~~~~~~~~~~~~~~~~~~~^~~~~~~~~~~~~~~~~~~~ /tmp/B.9grlomhr/BUILD/ceph-17.2.3/src/common/dout.h:156:58: note: in definition of macro 'dout_impl' 156 | return (cctX->_conf->subsys.template should_gather<sub, v>()); \ | ^~~ /tmp/B.9grlomhr/BUILD/ceph-17.2.3/src/osd/osd_types.h:3691:11: note: in expansion of macro 'ldpp_dout' 3691 | ldpp_dout(dpp, 10) << "build_prior prior osd." << so.osd | ^~~~~~~~~ /tmp/B.9grlomhr/BUILD/ceph-17.2.3/src/common/dout.h:106:21: note: 'ceph::dout::dynamic_marker_t<T> ceph::dout::need_dynamic(T&&) [with T = unsigned int]' declared here 106 | dynamic_marker_t<T> need_dynamic(T&& t) { | ^~~~~~~~~~~~ /tmp/B.9grlomhr/BUILD/ceph-17.2.3/src/osd/osd_types.h: In lambda function: /tmp/B.9grlomhr/BUILD/ceph-17.2.3/src/common/dout.h:185:56: error: call to non-'constexpr' function 'ceph::dout::dynamic_marker_t<T> ceph::dout::need_dynamic(T&&) [with T = unsigned int]' 185 | dout_impl(pdpp->get_cct(), ceph::dout::need_dynamic(pdpp->get_subsys()), v) \ | ~~~~~~~~~~~~~~~~~~~~~~~~^~~~~~~~~~~~~~~~~~~~ /tmp/B.9grlomhr/BUILD/ceph-17.2.3/src/common/dout.h:156:58: note: in definition of macro 'dout_impl' 156 | return (cctX->_conf->subsys.template should_gather<sub, v>()); \ | ^~~ /tmp/B.9grlomhr/BUILD/ceph-17.2.3/src/osd/osd_types.h:3696:11: note: in expansion of macro 'ldpp_dout' 3696 | ldpp_dout(dpp, 10) << "build_prior prior osd." << so.osd | ^~~~~~~~~ /tmp/B.9grlomhr/BUILD/ceph-17.2.3/src/common/dout.h:106:21: note: 'ceph::dout::dynamic_marker_t<T> ceph::dout::need_dynamic(T&&) [with T = unsigned int]' declared here 106 | dynamic_marker_t<T> need_dynamic(T&& t) { | ^~~~~~~~~~~~ /tmp/B.9grlomhr/BUILD/ceph-17.2.3/src/osd/osd_types.h: In lambda function: /tmp/B.9grlomhr/BUILD/ceph-17.2.3/src/common/dout.h:185:56: error: call to non-'constexpr' function 'ceph::dout::dynamic_marker_t<T> ceph::dout::need_dynamic(T&&) [with T = unsigned int]' 185 | dout_impl(pdpp->get_cct(), ceph::dout::need_dynamic(pdpp->get_subsys()), v) \ | ~~~~~~~~~~~~~~~~~~~~~~~~^~~~~~~~~~~~~~~~~~~~ /tmp/B.9grlomhr/BUILD/ceph-17.2.3/src/common/dout.h:156:58: note: in definition of macro 'dout_impl' 156 | return (cctX->_conf->subsys.template should_gather<sub, v>()); \ | ^~~ /tmp/B.9grlomhr/BUILD/ceph-17.2.3/src/osd/osd_types.h:3702:11: note: in expansion of macro 'ldpp_dout' 3702 | ldpp_dout(dpp, 10) << "build_prior prior osd." << so.osd | ^~~~~~~~~ /tmp/B.9grlomhr/BUILD/ceph-17.2.3/src/common/dout.h:106:21: note: 'ceph::dout::dynamic_marker_t<T> ceph::dout::need_dynamic(T&&) [with T = unsigned int]' declared here 106 | dynamic_marker_t<T> need_dynamic(T&& t) { | ^~~~~~~~~~~~ /tmp/B.9grlomhr/BUILD/ceph-17.2.3/src/osd/osd_types.h: In lambda function: /tmp/B.9grlomhr/BUILD/ceph-17.2.3/src/common/dout.h:185:56: error: call to non-'constexpr' function 'ceph::dout::dynamic_marker_t<T> ceph::dout::need_dynamic(T&&) [with T = unsigned int]' 185 | dout_impl(pdpp->get_cct(), ceph::dout::need_dynamic(pdpp->get_subsys()), v) \ | ~~~~~~~~~~~~~~~~~~~~~~~~^~~~~~~~~~~~~~~~~~~~ /tmp/B.9grlomhr/BUILD/ceph-17.2.3/src/common/dout.h:156:58: note: in definition of macro 'dout_impl' 156 | return (cctX->_conf->subsys.template should_gather<sub, v>()); \ | ^~~ /tmp/B.9grlomhr/BUILD/ceph-17.2.3/src/osd/osd_types.h:3716:9: note: in expansion of macro 'ldpp_dout' 3716 | ldpp_dout(dpp, 10) << "build_prior possibly went active+rw," | ^~~~~~~~~ /tmp/B.9grlomhr/BUILD/ceph-17.2.3/src/common/dout.h:106:21: note: 'ceph::dout::dynamic_marker_t<T> ceph::dout::need_dynamic(T&&) [with T = unsigned int]' declared here 106 | dynamic_marker_t<T> need_dynamic(T&& t) { | ^~~~~~~~~~~~ /tmp/B.9grlomhr/BUILD/ceph-17.2.3/src/osd/osd_types.h: In lambda function: /tmp/B.9grlomhr/BUILD/ceph-17.2.3/src/common/dout.h:185:56: error: call to non-'constexpr' function 'ceph::dout::dynamic_marker_t<T> ceph::dout::need_dynamic(T&&) [with T = unsigned int]' 185 | dout_impl(pdpp->get_cct(), ceph::dout::need_dynamic(pdpp->get_subsys()), v) \ | ~~~~~~~~~~~~~~~~~~~~~~~~^~~~~~~~~~~~~~~~~~~~ /tmp/B.9grlomhr/BUILD/ceph-17.2.3/src/common/dout.h:156:58: note: in definition of macro 'dout_impl' 156 | return (cctX->_conf->subsys.template should_gather<sub, v>()); \ | ^~~ /tmp/B.9grlomhr/BUILD/ceph-17.2.3/src/osd/osd_types.h:3726:3: note: in expansion of macro 'ldpp_dout' 3726 | ldpp_dout(dpp, 10) << "build_prior final: probe " << probe | ^~~~~~~~~ /tmp/B.9grlomhr/BUILD/ceph-17.2.3/src/common/dout.h:106:21: note: 'ceph::dout::dynamic_marker_t<T> ceph::dout::need_dynamic(T&&) [with T = unsigned int]' declared here 106 | dynamic_marker_t<T> need_dynamic(T&& t) { | ^~~~~~~~~~~~ make[2]: *** [src/msg/CMakeFiles/common-msg-objs.dir/build.make:177: src/msg/CMakeFiles/common-msg-objs.dir/async/AsyncMessenger.cc.o] Error 1 make[2]: Leaving directory '/tmp/B.9grlomhr/BUILD/ceph-17.2.3/build' make[2]: Entering directory '/tmp/B.9grlomhr/BUILD/ceph-17.2.3/build' [ 4%] Building CXX object src/msg/CMakeFiles/common-msg-objs.dir/Message.cc.o cd /tmp/B.9grlomhr/BUILD/ceph-17.2.3/build/src/msg && /usr/bin/x86_64-pld-linux-g++ -DBOOST_ASIO_DISABLE_THREAD_KEYWORD_EXTENSION -DBOOST_ASIO_USE_TS_EXECUTOR_AS_DEFAULT -DHAVE_CONFIG_H -D_FILE_OFFSET_BITS=64 -D_FORTIFY_SOURCE=2 -D_GNU_SOURCE -D_REENTRANT -D_THREAD_SAFE -D__CEPH__ -D__STDC_FORMAT_MACROS -D__linux__ -I/tmp/B.9grlomhr/BUILD/ceph-17.2.3/build/src/include -I/tmp/B.9grlomhr/BUILD/ceph-17.2.3/src -isystem /tmp/B.9grlomhr/BUILD/ceph-17.2.3/build/include -isystem /tmp/B.9grlomhr/BUILD/ceph-17.2.3/src/xxHash -isystem /tmp/B.9grlomhr/BUILD/ceph-17.2.3/src/rapidjson/include -O2 -fwrapv -pipe -Wformat -Werror=format-security -gdwarf-4 -fno-debug-types-section -fvar-tracking-assignments -g2 -Wp,-D_FORTIFY_SOURCE=2 -fstack-protector-strong --param=ssp-buffer-size=4 -Werror=trampolines -fPIC -march=x86-64 -mtune=generic -gdwarf-4 -fno-debug-types-section -fvar-tracking-assignments -g2 -DNDEBUG -DQT_NO_DEBUG -fPIC -U_FORTIFY_SOURCE -Wall -fno-strict-aliasing -fsigned-char -Wtype-limits -Wignored-qualifiers -Wpointer-arith -Werror=format-security -Winit-self -Wno-unknown-pragmas -Wnon-virtual-dtor -Wno-ignored-qualifiers -ftemplate-depth-1024 -Wpessimizing-move -Wredundant-move -Wstrict-null-sentinel -Woverloaded-virtual -fno-new-ttp-matching -fstack-protector-strong -fdiagnostics-color=auto -fno-builtin-malloc -fno-builtin-calloc -fno-builtin-realloc -fno-builtin-free -std=c++17 -MD -MT src/msg/CMakeFiles/common-msg-objs.dir/Message.cc.o -MF CMakeFiles/common-msg-objs.dir/Message.cc.o.d -o CMakeFiles/common-msg-objs.dir/Message.cc.o -c /tmp/B.9grlomhr/BUILD/ceph-17.2.3/src/msg/Message.cc In file included from /tmp/B.9grlomhr/BUILD/ceph-17.2.3/src/librados/ListObjectImpl.h:19, from /tmp/B.9grlomhr/BUILD/ceph-17.2.3/src/osd/osd_types.h:51, from /tmp/B.9grlomhr/BUILD/ceph-17.2.3/src/messages/MPGStats.h:18, from /tmp/B.9grlomhr/BUILD/ceph-17.2.3/src/msg/Message.cc:17: /tmp/B.9grlomhr/BUILD/ceph-17.2.3/src/include/rados/librados.hpp:107:54: warning: 'template<class _Category, class _Tp, class _Distance, class _Pointer, class _Reference> struct std::iterator' is deprecated [-Wdeprecated-declarations] 107 | class CEPH_RADOS_API NObjectIterator : public std::iterator <std::forward_iterator_tag, ListObject> { | ^~~~~~~~ In file included from /usr/include/c++/12.2.0/string:45, from /usr/include/c++/12.2.0/bits/locale_classes.h:40, from /usr/include/c++/12.2.0/bits/ios_base.h:41, from /usr/include/c++/12.2.0/ios:42, from /usr/include/c++/12.2.0/ostream:38, from /usr/include/c++/12.2.0/iostream:39, from /tmp/B.9grlomhr/BUILD/ceph-17.2.3/src/msg/Message.cc:9: /usr/include/c++/12.2.0/bits/stl_iterator_base_types.h:127:34: note: declared here 127 | struct _GLIBCXX17_DEPRECATED iterator | ^~~~~~~~ In file included from /tmp/B.9grlomhr/BUILD/ceph-17.2.3/src/include/Context.h:19, from /tmp/B.9grlomhr/BUILD/ceph-17.2.3/src/msg/Message.h:24, from /tmp/B.9grlomhr/BUILD/ceph-17.2.3/src/msg/Message.cc:15: /tmp/B.9grlomhr/BUILD/ceph-17.2.3/src/osd/osd_types.h: In lambda function: /tmp/B.9grlomhr/BUILD/ceph-17.2.3/src/common/dout.h:185:56: error: call to non-'constexpr' function 'ceph::dout::dynamic_marker_t<T> ceph::dout::need_dynamic(T&&) [with T = unsigned int]' 185 | dout_impl(pdpp->get_cct(), ceph::dout::need_dynamic(pdpp->get_subsys()), v) \ | ~~~~~~~~~~~~~~~~~~~~~~~~^~~~~~~~~~~~~~~~~~~~ /tmp/B.9grlomhr/BUILD/ceph-17.2.3/src/common/dout.h:156:58: note: in definition of macro 'dout_impl' 156 | return (cctX->_conf->subsys.template should_gather<sub, v>()); \ | ^~~ /tmp/B.9grlomhr/BUILD/ceph-17.2.3/src/osd/osd_types.h:3651:3: note: in expansion of macro 'ldpp_dout' 3651 | ldpp_dout(dpp, 10) << "build_prior all_probe " << all_probe << dendl; | ^~~~~~~~~ /tmp/B.9grlomhr/BUILD/ceph-17.2.3/src/common/dout.h:106:21: note: 'ceph::dout::dynamic_marker_t<T> ceph::dout::need_dynamic(T&&) [with T = unsigned int]' declared here 106 | dynamic_marker_t<T> need_dynamic(T&& t) { | ^~~~~~~~~~~~ /tmp/B.9grlomhr/BUILD/ceph-17.2.3/src/osd/osd_types.h: In lambda function: /tmp/B.9grlomhr/BUILD/ceph-17.2.3/src/common/dout.h:185:56: error: call to non-'constexpr' function 'ceph::dout::dynamic_marker_t<T> ceph::dout::need_dynamic(T&&) [with T = unsigned int]' 185 | dout_impl(pdpp->get_cct(), ceph::dout::need_dynamic(pdpp->get_subsys()), v) \ | ~~~~~~~~~~~~~~~~~~~~~~~~^~~~~~~~~~~~~~~~~~~~ /tmp/B.9grlomhr/BUILD/ceph-17.2.3/src/common/dout.h:156:58: note: in definition of macro 'dout_impl' 156 | return (cctX->_conf->subsys.template should_gather<sub, v>()); \ | ^~~ /tmp/B.9grlomhr/BUILD/ceph-17.2.3/src/osd/osd_types.h:3670:7: note: in expansion of macro 'ldpp_dout' 3670 | ldpp_dout(dpp, 10) << "build_prior maybe_rw interval:" << start | ^~~~~~~~~ /tmp/B.9grlomhr/BUILD/ceph-17.2.3/src/common/dout.h:106:21: note: 'ceph::dout::dynamic_marker_t<T> ceph::dout::need_dynamic(T&&) [with T = unsigned int]' declared here 106 | dynamic_marker_t<T> need_dynamic(T&& t) { | ^~~~~~~~~~~~ /tmp/B.9grlomhr/BUILD/ceph-17.2.3/src/osd/osd_types.h: In lambda function: /tmp/B.9grlomhr/BUILD/ceph-17.2.3/src/common/dout.h:185:56: error: call to non-'constexpr' function 'ceph::dout::dynamic_marker_t<T> ceph::dout::need_dynamic(T&&) [with T = unsigned int]' 185 | dout_impl(pdpp->get_cct(), ceph::dout::need_dynamic(pdpp->get_subsys()), v) \ | ~~~~~~~~~~~~~~~~~~~~~~~~^~~~~~~~~~~~~~~~~~~~ /tmp/B.9grlomhr/BUILD/ceph-17.2.3/src/common/dout.h:156:58: note: in definition of macro 'dout_impl' 156 | return (cctX->_conf->subsys.template should_gather<sub, v>()); \ | ^~~ /tmp/B.9grlomhr/BUILD/ceph-17.2.3/src/osd/osd_types.h:3691:11: note: in expansion of macro 'ldpp_dout' 3691 | ldpp_dout(dpp, 10) << "build_prior prior osd." << so.osd | ^~~~~~~~~ /tmp/B.9grlomhr/BUILD/ceph-17.2.3/src/common/dout.h:106:21: note: 'ceph::dout::dynamic_marker_t<T> ceph::dout::need_dynamic(T&&) [with T = unsigned int]' declared here 106 | dynamic_marker_t<T> need_dynamic(T&& t) { | ^~~~~~~~~~~~ /tmp/B.9grlomhr/BUILD/ceph-17.2.3/src/osd/osd_types.h: In lambda function: /tmp/B.9grlomhr/BUILD/ceph-17.2.3/src/common/dout.h:185:56: error: call to non-'constexpr' function 'ceph::dout::dynamic_marker_t<T> ceph::dout::need_dynamic(T&&) [with T = unsigned int]' 185 | dout_impl(pdpp->get_cct(), ceph::dout::need_dynamic(pdpp->get_subsys()), v) \ | ~~~~~~~~~~~~~~~~~~~~~~~~^~~~~~~~~~~~~~~~~~~~ /tmp/B.9grlomhr/BUILD/ceph-17.2.3/src/common/dout.h:156:58: note: in definition of macro 'dout_impl' 156 | return (cctX->_conf->subsys.template should_gather<sub, v>()); \ | ^~~ /tmp/B.9grlomhr/BUILD/ceph-17.2.3/src/osd/osd_types.h:3696:11: note: in expansion of macro 'ldpp_dout' 3696 | ldpp_dout(dpp, 10) << "build_prior prior osd." << so.osd | ^~~~~~~~~ /tmp/B.9grlomhr/BUILD/ceph-17.2.3/src/common/dout.h:106:21: note: 'ceph::dout::dynamic_marker_t<T> ceph::dout::need_dynamic(T&&) [with T = unsigned int]' declared here 106 | dynamic_marker_t<T> need_dynamic(T&& t) { | ^~~~~~~~~~~~ /tmp/B.9grlomhr/BUILD/ceph-17.2.3/src/osd/osd_types.h: In lambda function: /tmp/B.9grlomhr/BUILD/ceph-17.2.3/src/common/dout.h:185:56: error: call to non-'constexpr' function 'ceph::dout::dynamic_marker_t<T> ceph::dout::need_dynamic(T&&) [with T = unsigned int]' 185 | dout_impl(pdpp->get_cct(), ceph::dout::need_dynamic(pdpp->get_subsys()), v) \ | ~~~~~~~~~~~~~~~~~~~~~~~~^~~~~~~~~~~~~~~~~~~~ /tmp/B.9grlomhr/BUILD/ceph-17.2.3/src/common/dout.h:156:58: note: in definition of macro 'dout_impl' 156 | return (cctX->_conf->subsys.template should_gather<sub, v>()); \ | ^~~ /tmp/B.9grlomhr/BUILD/ceph-17.2.3/src/osd/osd_types.h:3702:11: note: in expansion of macro 'ldpp_dout' 3702 | ldpp_dout(dpp, 10) << "build_prior prior osd." << so.osd | ^~~~~~~~~ /tmp/B.9grlomhr/BUILD/ceph-17.2.3/src/common/dout.h:106:21: note: 'ceph::dout::dynamic_marker_t<T> ceph::dout::need_dynamic(T&&) [with T = unsigned int]' declared here 106 | dynamic_marker_t<T> need_dynamic(T&& t) { | ^~~~~~~~~~~~ /tmp/B.9grlomhr/BUILD/ceph-17.2.3/src/osd/osd_types.h: In lambda function: /tmp/B.9grlomhr/BUILD/ceph-17.2.3/src/common/dout.h:185:56: error: call to non-'constexpr' function 'ceph::dout::dynamic_marker_t<T> ceph::dout::need_dynamic(T&&) [with T = unsigned int]' 185 | dout_impl(pdpp->get_cct(), ceph::dout::need_dynamic(pdpp->get_subsys()), v) \ | ~~~~~~~~~~~~~~~~~~~~~~~~^~~~~~~~~~~~~~~~~~~~ /tmp/B.9grlomhr/BUILD/ceph-17.2.3/src/common/dout.h:156:58: note: in definition of macro 'dout_impl' 156 | return (cctX->_conf->subsys.template should_gather<sub, v>()); \ | ^~~ /tmp/B.9grlomhr/BUILD/ceph-17.2.3/src/osd/osd_types.h:3716:9: note: in expansion of macro 'ldpp_dout' 3716 | ldpp_dout(dpp, 10) << "build_prior possibly went active+rw," | ^~~~~~~~~ /tmp/B.9grlomhr/BUILD/ceph-17.2.3/src/common/dout.h:106:21: note: 'ceph::dout::dynamic_marker_t<T> ceph::dout::need_dynamic(T&&) [with T = unsigned int]' declared here 106 | dynamic_marker_t<T> need_dynamic(T&& t) { | ^~~~~~~~~~~~ /tmp/B.9grlomhr/BUILD/ceph-17.2.3/src/osd/osd_types.h: In lambda function: /tmp/B.9grlomhr/BUILD/ceph-17.2.3/src/common/dout.h:185:56: error: call to non-'constexpr' function 'ceph::dout::dynamic_marker_t<T> ceph::dout::need_dynamic(T&&) [with T = unsigned int]' 185 | dout_impl(pdpp->get_cct(), ceph::dout::need_dynamic(pdpp->get_subsys()), v) \ | ~~~~~~~~~~~~~~~~~~~~~~~~^~~~~~~~~~~~~~~~~~~~ /tmp/B.9grlomhr/BUILD/ceph-17.2.3/src/common/dout.h:156:58: note: in definition of macro 'dout_impl' 156 | return (cctX->_conf->subsys.template should_gather<sub, v>()); \ | ^~~ /tmp/B.9grlomhr/BUILD/ceph-17.2.3/src/osd/osd_types.h:3726:3: note: in expansion of macro 'ldpp_dout' 3726 | ldpp_dout(dpp, 10) << "build_prior final: probe " << probe | ^~~~~~~~~ /tmp/B.9grlomhr/BUILD/ceph-17.2.3/src/common/dout.h:106:21: note: 'ceph::dout::dynamic_marker_t<T> ceph::dout::need_dynamic(T&&) [with T = unsigned int]' declared here 106 | dynamic_marker_t<T> need_dynamic(T&& t) { | ^~~~~~~~~~~~ In file included from /tmp/B.9grlomhr/BUILD/ceph-17.2.3/src/mon/Session.h:22, from /tmp/B.9grlomhr/BUILD/ceph-17.2.3/src/messages/PaxosServiceMessage.h:7, from /tmp/B.9grlomhr/BUILD/ceph-17.2.3/src/messages/MPGStats.h:19: /tmp/B.9grlomhr/BUILD/ceph-17.2.3/src/include/xlist.h: At global scope: /tmp/B.9grlomhr/BUILD/ceph-17.2.3/src/include/xlist.h:162:24: warning: 'template<class _Category, class _Tp, class _Distance, class _Pointer, class _Reference> struct std::iterator' is deprecated [-Wdeprecated-declarations] 162 | class iterator: std::iterator<std::forward_iterator_tag, T> { | ^~~~~~~~ /usr/include/c++/12.2.0/bits/stl_iterator_base_types.h:127:34: note: declared here 127 | struct _GLIBCXX17_DEPRECATED iterator | ^~~~~~~~ /tmp/B.9grlomhr/BUILD/ceph-17.2.3/src/include/xlist.h:186:30: warning: 'template<class _Category, class _Tp, class _Distance, class _Pointer, class _Reference> struct std::iterator' is deprecated [-Wdeprecated-declarations] 186 | class const_iterator: std::iterator<std::forward_iterator_tag, T> { | ^~~~~~~~ /usr/include/c++/12.2.0/bits/stl_iterator_base_types.h:127:34: note: declared here 127 | struct _GLIBCXX17_DEPRECATED iterator | ^~~~~~~~ /tmp/B.9grlomhr/BUILD/ceph-17.2.3/src/msg/Message.cc: In lambda function: /tmp/B.9grlomhr/BUILD/ceph-17.2.3/src/msg/Message.cc:971:42: error: call to non-'constexpr' function 'ceph::dout::dynamic_marker_t<T> ceph::dout::need_dynamic(T&&) [with T = long int&]' 971 | ldout(cct, ceph::dout::need_dynamic( | ~~~~~~~~~~~~~~~~~~~~~~~~^ 972 | cct->_conf->ms_dump_corrupt_message_level)) << "dump: \n"; | ~~~~~~~~~~~~~~~~~~~~~~~~~~~~~~~~~~~~~~~~~~ /tmp/B.9grlomhr/BUILD/ceph-17.2.3/src/common/dout.h:156:63: note: in definition of macro 'dout_impl' 156 | return (cctX->_conf->subsys.template should_gather<sub, v>()); \ | ^ /tmp/B.9grlomhr/BUILD/ceph-17.2.3/src/msg/Message.cc:971:7: note: in expansion of macro 'ldout' 971 | ldout(cct, ceph::dout::need_dynamic( | ^~~~~ /tmp/B.9grlomhr/BUILD/ceph-17.2.3/src/common/dout.h:106:21: note: 'ceph::dout::dynamic_marker_t<T> ceph::dout::need_dynamic(T&&) [with T = long int&]' declared here 106 | dynamic_marker_t<T> need_dynamic(T&& t) { | ^~~~~~~~~~~~ make[2]: *** [src/msg/CMakeFiles/common-msg-objs.dir/build.make:93: src/msg/CMakeFiles/common-msg-objs.dir/Message.cc.o] Error 1 make[2]: Leaving directory '/tmp/B.9grlomhr/BUILD/ceph-17.2.3/build' make[2]: Entering directory '/tmp/B.9grlomhr/BUILD/ceph-17.2.3/build' [ 7%] Building CXX object src/common/options/CMakeFiles/common-options-objs.dir/osd_options.cc.o cd /tmp/B.9grlomhr/BUILD/ceph-17.2.3/build/src/common/options && /usr/bin/x86_64-pld-linux-g++ -DBOOST_ASIO_DISABLE_THREAD_KEYWORD_EXTENSION -DBOOST_ASIO_USE_TS_EXECUTOR_AS_DEFAULT -DHAVE_CONFIG_H -D_FILE_OFFSET_BITS=64 -D_FORTIFY_SOURCE=2 -D_GNU_SOURCE -D_REENTRANT -D_THREAD_SAFE -D__CEPH__ -D__STDC_FORMAT_MACROS -D__linux__ -I/tmp/B.9grlomhr/BUILD/ceph-17.2.3/build/src/include -I/tmp/B.9grlomhr/BUILD/ceph-17.2.3/src -isystem /tmp/B.9grlomhr/BUILD/ceph-17.2.3/build/include -isystem /tmp/B.9grlomhr/BUILD/ceph-17.2.3/src/xxHash -isystem /tmp/B.9grlomhr/BUILD/ceph-17.2.3/src/rapidjson/include -O2 -fwrapv -pipe -Wformat -Werror=format-security -gdwarf-4 -fno-debug-types-section -fvar-tracking-assignments -g2 -Wp,-D_FORTIFY_SOURCE=2 -fstack-protector-strong --param=ssp-buffer-size=4 -Werror=trampolines -fPIC -march=x86-64 -mtune=generic -gdwarf-4 -fno-debug-types-section -fvar-tracking-assignments -g2 -DNDEBUG -DQT_NO_DEBUG -fPIC -U_FORTIFY_SOURCE -Wall -fno-strict-aliasing -fsigned-char -Wtype-limits -Wignored-qualifiers -Wpointer-arith -Werror=format-security -Winit-self -Wno-unknown-pragmas -Wnon-virtual-dtor -Wno-ignored-qualifiers -ftemplate-depth-1024 -Wpessimizing-move -Wredundant-move -Wstrict-null-sentinel -Woverloaded-virtual -fno-new-ttp-matching -fstack-protector-strong -fdiagnostics-color=auto -fno-builtin-malloc -fno-builtin-calloc -fno-builtin-realloc -fno-builtin-free -std=c++17 -MD -MT src/common/options/CMakeFiles/common-options-objs.dir/osd_options.cc.o -MF CMakeFiles/common-options-objs.dir/osd_options.cc.o.d -o CMakeFiles/common-options-objs.dir/osd_options.cc.o -c /tmp/B.9grlomhr/BUILD/ceph-17.2.3/build/src/common/options/osd_options.cc make[2]: Leaving directory '/tmp/B.9grlomhr/BUILD/ceph-17.2.3/build' make[2]: Entering directory '/tmp/B.9grlomhr/BUILD/ceph-17.2.3/build' [ 7%] Building CXX object src/common/options/CMakeFiles/common-options-objs.dir/rbd-mirror_options.cc.o cd /tmp/B.9grlomhr/BUILD/ceph-17.2.3/build/src/common/options && /usr/bin/x86_64-pld-linux-g++ -DBOOST_ASIO_DISABLE_THREAD_KEYWORD_EXTENSION -DBOOST_ASIO_USE_TS_EXECUTOR_AS_DEFAULT -DHAVE_CONFIG_H -D_FILE_OFFSET_BITS=64 -D_FORTIFY_SOURCE=2 -D_GNU_SOURCE -D_REENTRANT -D_THREAD_SAFE -D__CEPH__ -D__STDC_FORMAT_MACROS -D__linux__ -I/tmp/B.9grlomhr/BUILD/ceph-17.2.3/build/src/include -I/tmp/B.9grlomhr/BUILD/ceph-17.2.3/src -isystem /tmp/B.9grlomhr/BUILD/ceph-17.2.3/build/include -isystem /tmp/B.9grlomhr/BUILD/ceph-17.2.3/src/xxHash -isystem /tmp/B.9grlomhr/BUILD/ceph-17.2.3/src/rapidjson/include -O2 -fwrapv -pipe -Wformat -Werror=format-security -gdwarf-4 -fno-debug-types-section -fvar-tracking-assignments -g2 -Wp,-D_FORTIFY_SOURCE=2 -fstack-protector-strong --param=ssp-buffer-size=4 -Werror=trampolines -fPIC -march=x86-64 -mtune=generic -gdwarf-4 -fno-debug-types-section -fvar-tracking-assignments -g2 -DNDEBUG -DQT_NO_DEBUG -fPIC -U_FORTIFY_SOURCE -Wall -fno-strict-aliasing -fsigned-char -Wtype-limits -Wignored-qualifiers -Wpointer-arith -Werror=format-security -Winit-self -Wno-unknown-pragmas -Wnon-virtual-dtor -Wno-ignored-qualifiers -ftemplate-depth-1024 -Wpessimizing-move -Wredundant-move -Wstrict-null-sentinel -Woverloaded-virtual -fno-new-ttp-matching -fstack-protector-strong -fdiagnostics-color=auto -fno-builtin-malloc -fno-builtin-calloc -fno-builtin-realloc -fno-builtin-free -std=c++17 -MD -MT src/common/options/CMakeFiles/common-options-objs.dir/rbd-mirror_options.cc.o -MF CMakeFiles/common-options-objs.dir/rbd-mirror_options.cc.o.d -o CMakeFiles/common-options-objs.dir/rbd-mirror_options.cc.o -c /tmp/B.9grlomhr/BUILD/ceph-17.2.3/build/src/common/options/rbd-mirror_options.cc make[2]: Leaving directory '/tmp/B.9grlomhr/BUILD/ceph-17.2.3/build' make[2]: Entering directory '/tmp/B.9grlomhr/BUILD/ceph-17.2.3/build' [ 7%] Building CXX object src/common/options/CMakeFiles/common-options-objs.dir/immutable-object-cache_options.cc.o cd /tmp/B.9grlomhr/BUILD/ceph-17.2.3/build/src/common/options && /usr/bin/x86_64-pld-linux-g++ -DBOOST_ASIO_DISABLE_THREAD_KEYWORD_EXTENSION -DBOOST_ASIO_USE_TS_EXECUTOR_AS_DEFAULT -DHAVE_CONFIG_H -D_FILE_OFFSET_BITS=64 -D_FORTIFY_SOURCE=2 -D_GNU_SOURCE -D_REENTRANT -D_THREAD_SAFE -D__CEPH__ -D__STDC_FORMAT_MACROS -D__linux__ -I/tmp/B.9grlomhr/BUILD/ceph-17.2.3/build/src/include -I/tmp/B.9grlomhr/BUILD/ceph-17.2.3/src -isystem /tmp/B.9grlomhr/BUILD/ceph-17.2.3/build/include -isystem /tmp/B.9grlomhr/BUILD/ceph-17.2.3/src/xxHash -isystem /tmp/B.9grlomhr/BUILD/ceph-17.2.3/src/rapidjson/include -O2 -fwrapv -pipe -Wformat -Werror=format-security -gdwarf-4 -fno-debug-types-section -fvar-tracking-assignments -g2 -Wp,-D_FORTIFY_SOURCE=2 -fstack-protector-strong --param=ssp-buffer-size=4 -Werror=trampolines -fPIC -march=x86-64 -mtune=generic -gdwarf-4 -fno-debug-types-section -fvar-tracking-assignments -g2 -DNDEBUG -DQT_NO_DEBUG -fPIC -U_FORTIFY_SOURCE -Wall -fno-strict-aliasing -fsigned-char -Wtype-limits -Wignored-qualifiers -Wpointer-arith -Werror=format-security -Winit-self -Wno-unknown-pragmas -Wnon-virtual-dtor -Wno-ignored-qualifiers -ftemplate-depth-1024 -Wpessimizing-move -Wredundant-move -Wstrict-null-sentinel -Woverloaded-virtual -fno-new-ttp-matching -fstack-protector-strong -fdiagnostics-color=auto -fno-builtin-malloc -fno-builtin-calloc -fno-builtin-realloc -fno-builtin-free -std=c++17 -MD -MT src/common/options/CMakeFiles/common-options-objs.dir/immutable-object-cache_options.cc.o -MF CMakeFiles/common-options-objs.dir/immutable-object-cache_options.cc.o.d -o CMakeFiles/common-options-objs.dir/immutable-object-cache_options.cc.o -c /tmp/B.9grlomhr/BUILD/ceph-17.2.3/build/src/common/options/immutable-object-cache_options.cc make[2]: Leaving directory '/tmp/B.9grlomhr/BUILD/ceph-17.2.3/build' make[2]: Entering directory '/tmp/B.9grlomhr/BUILD/ceph-17.2.3/build' [ 7%] Building CXX object src/common/options/CMakeFiles/common-options-objs.dir/rbd_options.cc.o cd /tmp/B.9grlomhr/BUILD/ceph-17.2.3/build/src/common/options && /usr/bin/x86_64-pld-linux-g++ -DBOOST_ASIO_DISABLE_THREAD_KEYWORD_EXTENSION -DBOOST_ASIO_USE_TS_EXECUTOR_AS_DEFAULT -DHAVE_CONFIG_H -D_FILE_OFFSET_BITS=64 -D_FORTIFY_SOURCE=2 -D_GNU_SOURCE -D_REENTRANT -D_THREAD_SAFE -D__CEPH__ -D__STDC_FORMAT_MACROS -D__linux__ -I/tmp/B.9grlomhr/BUILD/ceph-17.2.3/build/src/include -I/tmp/B.9grlomhr/BUILD/ceph-17.2.3/src -isystem /tmp/B.9grlomhr/BUILD/ceph-17.2.3/build/include -isystem /tmp/B.9grlomhr/BUILD/ceph-17.2.3/src/xxHash -isystem /tmp/B.9grlomhr/BUILD/ceph-17.2.3/src/rapidjson/include -O2 -fwrapv -pipe -Wformat -Werror=format-security -gdwarf-4 -fno-debug-types-section -fvar-tracking-assignments -g2 -Wp,-D_FORTIFY_SOURCE=2 -fstack-protector-strong --param=ssp-buffer-size=4 -Werror=trampolines -fPIC -march=x86-64 -mtune=generic -gdwarf-4 -fno-debug-types-section -fvar-tracking-assignments -g2 -DNDEBUG -DQT_NO_DEBUG -fPIC -U_FORTIFY_SOURCE -Wall -fno-strict-aliasing -fsigned-char -Wtype-limits -Wignored-qualifiers -Wpointer-arith -Werror=format-security -Winit-self -Wno-unknown-pragmas -Wnon-virtual-dtor -Wno-ignored-qualifiers -ftemplate-depth-1024 -Wpessimizing-move -Wredundant-move -Wstrict-null-sentinel -Woverloaded-virtual -fno-new-ttp-matching -fstack-protector-strong -fdiagnostics-color=auto -fno-builtin-malloc -fno-builtin-calloc -fno-builtin-realloc -fno-builtin-free -std=c++17 -MD -MT src/common/options/CMakeFiles/common-options-objs.dir/rbd_options.cc.o -MF CMakeFiles/common-options-objs.dir/rbd_options.cc.o.d -o CMakeFiles/common-options-objs.dir/rbd_options.cc.o -c /tmp/B.9grlomhr/BUILD/ceph-17.2.3/build/src/common/options/rbd_options.cc make[2]: Leaving directory '/tmp/B.9grlomhr/BUILD/ceph-17.2.3/build' make[2]: Entering directory '/tmp/B.9grlomhr/BUILD/ceph-17.2.3/build' [ 7%] Building CXX object src/msg/CMakeFiles/common-msg-objs.dir/async/ProtocolV1.cc.o cd /tmp/B.9grlomhr/BUILD/ceph-17.2.3/build/src/msg && /usr/bin/x86_64-pld-linux-g++ -DBOOST_ASIO_DISABLE_THREAD_KEYWORD_EXTENSION -DBOOST_ASIO_USE_TS_EXECUTOR_AS_DEFAULT -DHAVE_CONFIG_H -D_FILE_OFFSET_BITS=64 -D_FORTIFY_SOURCE=2 -D_GNU_SOURCE -D_REENTRANT -D_THREAD_SAFE -D__CEPH__ -D__STDC_FORMAT_MACROS -D__linux__ -I/tmp/B.9grlomhr/BUILD/ceph-17.2.3/build/src/include -I/tmp/B.9grlomhr/BUILD/ceph-17.2.3/src -isystem /tmp/B.9grlomhr/BUILD/ceph-17.2.3/build/include -isystem /tmp/B.9grlomhr/BUILD/ceph-17.2.3/src/xxHash -isystem /tmp/B.9grlomhr/BUILD/ceph-17.2.3/src/rapidjson/include -O2 -fwrapv -pipe -Wformat -Werror=format-security -gdwarf-4 -fno-debug-types-section -fvar-tracking-assignments -g2 -Wp,-D_FORTIFY_SOURCE=2 -fstack-protector-strong --param=ssp-buffer-size=4 -Werror=trampolines -fPIC -march=x86-64 -mtune=generic -gdwarf-4 -fno-debug-types-section -fvar-tracking-assignments -g2 -DNDEBUG -DQT_NO_DEBUG -fPIC -U_FORTIFY_SOURCE -Wall -fno-strict-aliasing -fsigned-char -Wtype-limits -Wignored-qualifiers -Wpointer-arith -Werror=format-security -Winit-self -Wno-unknown-pragmas -Wnon-virtual-dtor -Wno-ignored-qualifiers -ftemplate-depth-1024 -Wpessimizing-move -Wredundant-move -Wstrict-null-sentinel -Woverloaded-virtual -fno-new-ttp-matching -fstack-protector-strong -fdiagnostics-color=auto -fno-builtin-malloc -fno-builtin-calloc -fno-builtin-realloc -fno-builtin-free -std=c++17 -MD -MT src/msg/CMakeFiles/common-msg-objs.dir/async/ProtocolV1.cc.o -MF CMakeFiles/common-msg-objs.dir/async/ProtocolV1.cc.o.d -o CMakeFiles/common-msg-objs.dir/async/ProtocolV1.cc.o -c /tmp/B.9grlomhr/BUILD/ceph-17.2.3/src/msg/async/ProtocolV1.cc In file included from /tmp/B.9grlomhr/BUILD/ceph-17.2.3/src/msg/async/AsyncMessenger.h:23, from /tmp/B.9grlomhr/BUILD/ceph-17.2.3/src/msg/async/ProtocolV1.cc:9: /tmp/B.9grlomhr/BUILD/ceph-17.2.3/src/include/xlist.h:162:24: warning: 'template<class _Category, class _Tp, class _Distance, class _Pointer, class _Reference> struct std::iterator' is deprecated [-Wdeprecated-declarations] 162 | class iterator: std::iterator<std::forward_iterator_tag, T> { | ^~~~~~~~ In file included from /usr/include/c++/12.2.0/bits/stl_algobase.h:65, from /usr/include/c++/12.2.0/list:60, from /tmp/B.9grlomhr/BUILD/ceph-17.2.3/src/msg/async/Protocol.h:7, from /tmp/B.9grlomhr/BUILD/ceph-17.2.3/src/msg/async/ProtocolV1.h:7, from /tmp/B.9grlomhr/BUILD/ceph-17.2.3/src/msg/async/ProtocolV1.cc:4: /usr/include/c++/12.2.0/bits/stl_iterator_base_types.h:127:34: note: declared here 127 | struct _GLIBCXX17_DEPRECATED iterator | ^~~~~~~~ /tmp/B.9grlomhr/BUILD/ceph-17.2.3/src/include/xlist.h:186:30: warning: 'template<class _Category, class _Tp, class _Distance, class _Pointer, class _Reference> struct std::iterator' is deprecated [-Wdeprecated-declarations] 186 | class const_iterator: std::iterator<std::forward_iterator_tag, T> { | ^~~~~~~~ /usr/include/c++/12.2.0/bits/stl_iterator_base_types.h:127:34: note: declared here 127 | struct _GLIBCXX17_DEPRECATED iterator | ^~~~~~~~ make[2]: Leaving directory '/tmp/B.9grlomhr/BUILD/ceph-17.2.3/build' make[1]: *** [CMakeFiles/Makefile2:3093: src/msg/CMakeFiles/common-msg-objs.dir/all] Error 2 make[2]: Entering directory '/tmp/B.9grlomhr/BUILD/ceph-17.2.3/build' [ 7%] Building CXX object src/common/options/CMakeFiles/common-options-objs.dir/rgw_options.cc.o cd /tmp/B.9grlomhr/BUILD/ceph-17.2.3/build/src/common/options && /usr/bin/x86_64-pld-linux-g++ -DBOOST_ASIO_DISABLE_THREAD_KEYWORD_EXTENSION -DBOOST_ASIO_USE_TS_EXECUTOR_AS_DEFAULT -DHAVE_CONFIG_H -D_FILE_OFFSET_BITS=64 -D_FORTIFY_SOURCE=2 -D_GNU_SOURCE -D_REENTRANT -D_THREAD_SAFE -D__CEPH__ -D__STDC_FORMAT_MACROS -D__linux__ -I/tmp/B.9grlomhr/BUILD/ceph-17.2.3/build/src/include -I/tmp/B.9grlomhr/BUILD/ceph-17.2.3/src -isystem /tmp/B.9grlomhr/BUILD/ceph-17.2.3/build/include -isystem /tmp/B.9grlomhr/BUILD/ceph-17.2.3/src/xxHash -isystem /tmp/B.9grlomhr/BUILD/ceph-17.2.3/src/rapidjson/include -O2 -fwrapv -pipe -Wformat -Werror=format-security -gdwarf-4 -fno-debug-types-section -fvar-tracking-assignments -g2 -Wp,-D_FORTIFY_SOURCE=2 -fstack-protector-strong --param=ssp-buffer-size=4 -Werror=trampolines -fPIC -march=x86-64 -mtune=generic -gdwarf-4 -fno-debug-types-section -fvar-tracking-assignments -g2 -DNDEBUG -DQT_NO_DEBUG -fPIC -U_FORTIFY_SOURCE -Wall -fno-strict-aliasing -fsigned-char -Wtype-limits -Wignored-qualifiers -Wpointer-arith -Werror=format-security -Winit-self -Wno-unknown-pragmas -Wnon-virtual-dtor -Wno-ignored-qualifiers -ftemplate-depth-1024 -Wpessimizing-move -Wredundant-move -Wstrict-null-sentinel -Woverloaded-virtual -fno-new-ttp-matching -fstack-protector-strong -fdiagnostics-color=auto -fno-builtin-malloc -fno-builtin-calloc -fno-builtin-realloc -fno-builtin-free -std=c++17 -MD -MT src/common/options/CMakeFiles/common-options-objs.dir/rgw_options.cc.o -MF CMakeFiles/common-options-objs.dir/rgw_options.cc.o.d -o CMakeFiles/common-options-objs.dir/rgw_options.cc.o -c /tmp/B.9grlomhr/BUILD/ceph-17.2.3/build/src/common/options/rgw_options.cc make[2]: Leaving directory '/tmp/B.9grlomhr/BUILD/ceph-17.2.3/build' make[2]: Entering directory '/tmp/B.9grlomhr/BUILD/ceph-17.2.3/build' [ 4%] Building CXX object src/common/options/CMakeFiles/common-options-objs.dir/global_options.cc.o cd /tmp/B.9grlomhr/BUILD/ceph-17.2.3/build/src/common/options && /usr/bin/x86_64-pld-linux-g++ -DBOOST_ASIO_DISABLE_THREAD_KEYWORD_EXTENSION -DBOOST_ASIO_USE_TS_EXECUTOR_AS_DEFAULT -DHAVE_CONFIG_H -D_FILE_OFFSET_BITS=64 -D_FORTIFY_SOURCE=2 -D_GNU_SOURCE -D_REENTRANT -D_THREAD_SAFE -D__CEPH__ -D__STDC_FORMAT_MACROS -D__linux__ -I/tmp/B.9grlomhr/BUILD/ceph-17.2.3/build/src/include -I/tmp/B.9grlomhr/BUILD/ceph-17.2.3/src -isystem /tmp/B.9grlomhr/BUILD/ceph-17.2.3/build/include -isystem /tmp/B.9grlomhr/BUILD/ceph-17.2.3/src/xxHash -isystem /tmp/B.9grlomhr/BUILD/ceph-17.2.3/src/rapidjson/include -O2 -fwrapv -pipe -Wformat -Werror=format-security -gdwarf-4 -fno-debug-types-section -fvar-tracking-assignments -g2 -Wp,-D_FORTIFY_SOURCE=2 -fstack-protector-strong --param=ssp-buffer-size=4 -Werror=trampolines -fPIC -march=x86-64 -mtune=generic -gdwarf-4 -fno-debug-types-section -fvar-tracking-assignments -g2 -DNDEBUG -DQT_NO_DEBUG -fPIC -U_FORTIFY_SOURCE -Wall -fno-strict-aliasing -fsigned-char -Wtype-limits -Wignored-qualifiers -Wpointer-arith -Werror=format-security -Winit-self -Wno-unknown-pragmas -Wnon-virtual-dtor -Wno-ignored-qualifiers -ftemplate-depth-1024 -Wpessimizing-move -Wredundant-move -Wstrict-null-sentinel -Woverloaded-virtual -fno-new-ttp-matching -fstack-protector-strong -fdiagnostics-color=auto -fno-builtin-malloc -fno-builtin-calloc -fno-builtin-realloc -fno-builtin-free -std=c++17 -MD -MT src/common/options/CMakeFiles/common-options-objs.dir/global_options.cc.o -MF CMakeFiles/common-options-objs.dir/global_options.cc.o.d -o CMakeFiles/common-options-objs.dir/global_options.cc.o -c /tmp/B.9grlomhr/BUILD/ceph-17.2.3/build/src/common/options/global_options.cc /tmp/B.9grlomhr/BUILD/ceph-17.2.3/build/src/common/options/global_options.cc: In function 'std::vector<Option> get_global_options()': /tmp/B.9grlomhr/BUILD/ceph-17.2.3/build/src/common/options/global_options.cc:4:21: note: variable tracking size limit exceeded with '-fvar-tracking-assignments', retrying without 4 | std::vector<Option> get_global_options() { | ^~~~~~~~~~~~~~~~~~ make[2]: Leaving directory '/tmp/B.9grlomhr/BUILD/ceph-17.2.3/build' make[1]: Entering directory '/tmp/B.9grlomhr/BUILD/ceph-17.2.3/build' [ 9%] Built target common-options-objs make[1]: Leaving directory '/tmp/B.9grlomhr/BUILD/ceph-17.2.3/build' make: *** [Makefile:149: all] Error 2 error: Bad exit status from /tmp/B.9grlomhr/BUILD/tmp/rpm-tmp.egPAG8 (%build) RPM build warnings: Could not canonicalize hostname: ymir RPM build errors: Bad exit status from /tmp/B.9grlomhr/BUILD/tmp/rpm-tmp.egPAG8 (%build) ended at: Thu Sep 15 01:48:45 2022, done in 0:11:52.830736 error: No files produced. + chmod -R u+rwX /tmp/B.9grlomhr/BUILD + rm -rf /tmp/B.9grlomhr/tmp /tmp/B.9grlomhr/BUILD + rm -rf /tmp/B.9grlomhr Begin-PLD-Builder-Info Build-Time: user:1214.60s sys:55.85s real:733.32s (faults io:439 non-io:7621885) End-PLD-Builder-Info
[Back to list of logs] [View rpm -qa of builder]