FailedOk

th/SRPMS[OK]
th/x32[OK]
th/i686[OK]
th/x86_64[OK]

ac/SRPMS[OK]
ac/i386[OK]
ac/i586[OK]
ac/i686[OK]
ac/alpha[OK]
ac/amd64[OK]
ac/athlon[OK]
ac/ppc[OK]
ac/sparc[OK]
ac/sparc64[OK]

Advanced Search
main()
Powered by PLD Linux
(c) 2002-2018 PLD Team
$Revision: 1.37 $
Powered by /dev/null.
Your IP: 54.84.236.168

cvsnt 4ff00374-e4a4-4068-82e7-ec6f643d368e

Status:Failed
Source URL:ftp://buildlogs.pld-linux.org/th/x86_64/FAIL/cvsnt,4ff00374-e4a4-4068-82e7-ec6f643d368e.bz2
text/plain URL:View!
rpm -qa of builder:View!
Date:2018/03/07 10:58:46
Runtime:0:00:36.813360

Toc:

  • prep
  • Executing(%prep): /bin/sh -e /tmp/B.pteQEh/BUILD/tmp/rpm-tmp.90932
  • build
  • Executing(%build): /bin/sh -e /tmp/B.pteQEh/BUILD/tmp/rpm-tmp.90932
  • error 1
  • mdns.cpp:38:10: error: cannot convert 'bool' to 'CMdnsHelperBase*' in return
  • error 2
  • make[3]: *** [Makefile:769: mdns.lo] Error 1
  • error 3
  • make[2]: *** [Makefile:865: all-recursive] Error 1
  • error 4
  • make[1]: *** [Makefile:480: all-recursive] Error 1
  • error 5
  • error: Bad exit status from /tmp/B.pteQEh/BUILD/tmp/rpm-tmp.90932 (%build)
  • error 6
  • RPM build errors:
  • error 7
  • error: No files produced.

Content:

request from: baggins
checking if we should skip the build
started at: Wed Mar  7 10:58:06 2018
fetching https://srcbuilder.pld-linux.org/th//srpms/4ff00374-e4a4-4068-82e7-ec6f643d368e/cvsnt-2.5.05.3744-9.src.rpm
fetched 4601109 bytes, 4883.6 K/s
installing srpm: cvsnt-2.5.05.3744-9.src.rpm
mesg: ttyname failed: Inappropriate ioctl for device
+ install -d /tmp/B.pteQEh/BUILD /tmp/B.pteQEh/RPMS
+ LC_ALL=en_US.UTF-8
+ rpm -qp --changelog cvsnt-2.5.05.3744-9.src.rpm
* Wed Mar 07 2018 PLD Linux Team <feedback@pld-linux.org>
- For complete changelog see: http://git.pld-linux.org/?p=packages/cvsnt.git;a=log;h=master
+ rpm -Uhv --nodeps --define '_topdir /tmp/B.pteQEh' --define '_specdir %{_topdir}' --define '_sourcedir %{_specdir}' --define '_rpmdir %{_topdir}/RPMS' --define '_builddir %{_topdir}/BUILD' cvsnt-2.5.05.3744-9.src.rpm Preparing... ################################################## cvsnt ################################################## + rm -f cvsnt-2.5.05.3744-9.src.rpm mesg: ttyname failed: Inappropriate ioctl for device + install -m 700 -d /tmp/B.pteQEh/BUILD/tmp mesg: ttyname failed: Inappropriate ioctl for device + TMPDIR=/tmp/B.pteQEh/BUILD/tmp + exec nice -n 0 rpmbuild -bp --short-circuit --nodeps --define '_topdir /tmp/B.pteQEh' --define '_specdir %{_topdir}' --define '_sourcedir %{_specdir}' --define '_rpmdir %{_topdir}/RPMS' --define '_builddir %{_topdir}/BUILD' --target x86_64-pld-linux --define 'prep exit 0' /tmp/B.pteQEh/cvsnt.spec Building target platforms: x86_64-pld-linux checking BuildConflict-ing packages no BuildConflicts found checking BR rpm: Building target platforms: x86_64-pld-linux no BR needed building RPM using: set -ex; : build-id: 4ff00374-e4a4-4068-82e7-ec6f643d368e; TMPDIR=/tmp/B.pteQEh/BUILD/tmp exec nice -n 0 rpmbuild -bb --define '_smp_mflags -j5' --define '_make_opts -Otarget' --define '_pld_builder 1' --define '_topdir /tmp/B.pteQEh' --define '_specdir %{_topdir}' --define '_sourcedir %{_specdir}' --define '_rpmdir %{_topdir}/RPMS' --define '_builddir %{_topdir}/BUILD' --target x86_64-pld-linux /tmp/B.pteQEh/cvsnt.spec mesg: ttyname failed: Inappropriate ioctl for device + : build-id: 4ff00374-e4a4-4068-82e7-ec6f643d368e + TMPDIR=/tmp/B.pteQEh/BUILD/tmp + exec nice -n 0 rpmbuild -bb --define '_smp_mflags -j5' --define '_make_opts -Otarget' --define '_pld_builder 1' --define '_topdir /tmp/B.pteQEh' --define '_specdir %{_topdir}' --define '_sourcedir %{_specdir}' --define '_rpmdir %{_topdir}/RPMS' --define '_builddir %{_topdir}/BUILD' --target x86_64-pld-linux /tmp/B.pteQEh/cvsnt.spec Building target platforms: x86_64-pld-linux Executing(%prep): /bin/sh -e /tmp/B.pteQEh/BUILD/tmp/rpm-tmp.90932 + umask 022 + cd /tmp/B.pteQEh/BUILD + cd /tmp/B.pteQEh/BUILD + rm -rf cvsnt-2.5.05.3744 + /usr/bin/gzip -dc /tmp/B.pteQEh/cvsnt-2.5.05.3744.tar.gz + /bin/tar -xf - + STATUS=0 + '[' 0 -ne 0 ']' + cd cvsnt-2.5.05.3744 + /bin/id -u + '[' 1000 '=' 0 ']' + /bin/id -u + '[' 1000 '=' 0 ']' + /bin/chmod -Rf a+rX,u+w,g-w,o-w . + echo 'Patch #0 (cvsnt-system-pcre.patch):' Patch #0 (cvsnt-system-pcre.patch): + '[' -f /tmp/B.pteQEh/cvsnt-system-pcre.patch ']' + /bin/cat /tmp/B.pteQEh/cvsnt-system-pcre.patch + /usr/bin/patch -s -p1 + echo 'Patch #1 (cvsnt-system-ntlm.patch):' Patch #1 (cvsnt-system-ntlm.patch): + '[' -f /tmp/B.pteQEh/cvsnt-system-ntlm.patch ']' + /bin/cat /tmp/B.pteQEh/cvsnt-system-ntlm.patch + /usr/bin/patch -s -p1 + echo 'Patch #2 (cvsnt-build.patch):' Patch #2 (cvsnt-build.patch): + '[' -f /tmp/B.pteQEh/cvsnt-build.patch ']' + /bin/cat /tmp/B.pteQEh/cvsnt-build.patch + /usr/bin/patch -s -p1 + echo 'Patch #3 (cvsnt-nospam.patch):' Patch #3 (cvsnt-nospam.patch): + '[' -f /tmp/B.pteQEh/cvsnt-nospam.patch ']' + /bin/cat /tmp/B.pteQEh/cvsnt-nospam.patch + /usr/bin/patch -s -p1 + echo 'Patch #4 (cvsnt-fixes.patch):' Patch #4 (cvsnt-fixes.patch): + '[' -f /tmp/B.pteQEh/cvsnt-fixes.patch ']' + /bin/cat /tmp/B.pteQEh/cvsnt-fixes.patch + /usr/bin/patch -s -p1 + echo 'Patch #5 (cvsnt-gcc4.patch):' Patch #5 (cvsnt-gcc4.patch): + '[' -f /tmp/B.pteQEh/cvsnt-gcc4.patch ']' + /bin/cat /tmp/B.pteQEh/cvsnt-gcc4.patch + /usr/bin/patch -s -p1 + echo 'Patch #6 (format-security.patch):' Patch #6 (format-security.patch): + '[' -f /tmp/B.pteQEh/format-security.patch ']' + /bin/cat /tmp/B.pteQEh/format-security.patch + /usr/bin/patch -s -p1 + rm -r protocols/ntlm + exit 0 Executing(%build): /bin/sh -e /tmp/B.pteQEh/BUILD/tmp/rpm-tmp.90932 TMP=/home/users/builder/tmp HOME=/home/users/builder PATH=/home/users/builder/GNUstep/Tools:/usr/local/bin:/usr/bin:/bin:/home/users/builder/bin TMPDIR=/tmp/B.pteQEh/BUILD/tmp + umask 022 + cd /tmp/B.pteQEh/BUILD + cd cvsnt-2.5.05.3744 + libtoolize --copy --force --install libtoolize: putting auxiliary files in '.'. libtoolize: copying file './config.guess' libtoolize: copying file './config.sub' libtoolize: copying file './install-sh' libtoolize: copying file './ltmain.sh' libtoolize: putting macros in AC_CONFIG_MACRO_DIRS, 'm4'. libtoolize: copying file 'm4/libtool.m4' libtoolize: You should add the contents of 'm4/libtool.m4' to 'aclocal.m4'. libtoolize: copying file 'm4/ltargz.m4' libtoolize: You should add the contents of 'm4/ltargz.m4' to 'aclocal.m4'. libtoolize: copying file 'm4/ltdl.m4' libtoolize: You should add the contents of 'm4/ltdl.m4' to 'aclocal.m4'. libtoolize: copying file 'm4/ltoptions.m4' libtoolize: You should add the contents of 'm4/ltoptions.m4' to 'aclocal.m4'. libtoolize: copying file 'm4/ltsugar.m4' libtoolize: You should add the contents of 'm4/ltsugar.m4' to 'aclocal.m4'. libtoolize: copying file 'm4/ltversion.m4' libtoolize: copying file 'm4/lt~obsolete.m4' libtoolize: You should add the contents of 'm4/lt~obsolete.m4' to 'aclocal.m4'. libtoolize: putting libltdl files in 'libltdl'. libtoolize: copying file 'libltdl/COPYING.LIB' libtoolize: creating file 'libltdl/Makefile.am' libtoolize: copying file 'libltdl/README' libtoolize: creating file 'libltdl/Makefile.in' libtoolize: copying file 'libltdl/libltdl/lt__alloc.h' libtoolize: copying file 'libltdl/libltdl/lt__argz_.h' libtoolize: copying file 'libltdl/libltdl/lt__dirent.h' libtoolize: copying file 'libltdl/libltdl/lt__glibc.h' libtoolize: copying file 'libltdl/libltdl/lt__private.h' libtoolize: copying file 'libltdl/libltdl/lt__strl.h' libtoolize: copying file 'libltdl/libltdl/lt_dlloader.h' libtoolize: copying file 'libltdl/libltdl/lt_error.h' libtoolize: copying file 'libltdl/libltdl/lt_system.h' libtoolize: copying file 'libltdl/libltdl/slist.h' libtoolize: copying file 'libltdl/loaders/dld_link.c' libtoolize: copying file 'libltdl/loaders/dlopen.c' libtoolize: copying file 'libltdl/loaders/dyld.c' libtoolize: copying file 'libltdl/loaders/load_add_on.c' libtoolize: copying file 'libltdl/loaders/loadlibrary.c' libtoolize: copying file 'libltdl/loaders/preopen.c' libtoolize: copying file 'libltdl/loaders/shl_load.c' libtoolize: copying file 'libltdl/lt__alloc.c' libtoolize: copying file 'libltdl/lt__argz.c' libtoolize: copying file 'libltdl/lt__dirent.c' libtoolize: copying file 'libltdl/lt__strl.c' libtoolize: copying file 'libltdl/lt_dlloader.c' libtoolize: copying file 'libltdl/lt_error.c' libtoolize: copying file 'libltdl/ltdl.c' libtoolize: copying file 'libltdl/ltdl.h' libtoolize: copying file 'libltdl/slist.c' libtoolize: Remember to add 'LT_CONFIG_LTDL_DIR([libltdl])' to 'configure.in'. + aclocal aclocal: warning: autoconf input should be named 'configure.ac', not 'configure.in' acinclude.m4:11: warning: underquoted definition of ACX_WITH_GSSAPI acinclude.m4:11: run info Automake 'Extending aclocal' acinclude.m4:11: or see https://www.gnu.org/software/automake/manual/automake.html#Extending-aclocal configure.in:63: warning: AC_LANG_CONFTEST: no AC_LANG_SOURCE call detected in body ../../lib/autoconf/lang.m4:193: AC_LANG_CONFTEST is expanded from... configure.in:63: the top level configure.in:260: warning: AC_LANG_CONFTEST: no AC_LANG_SOURCE call detected in body ../../lib/autoconf/lang.m4:193: AC_LANG_CONFTEST is expanded from... ../../lib/autoconf/general.m4:2590: _AC_COMPILE_IFELSE is expanded from... ../../lib/autoconf/general.m4:2606: AC_COMPILE_IFELSE is expanded from... configure.in:260: the top level configure.in:276: warning: AC_LANG_CONFTEST: no AC_LANG_SOURCE call detected in body ../../lib/autoconf/lang.m4:193: AC_LANG_CONFTEST is expanded from... ../../lib/autoconf/general.m4:2590: _AC_COMPILE_IFELSE is expanded from... ../../lib/autoconf/general.m4:2606: AC_COMPILE_IFELSE is expanded from... configure.in:276: the top level configure.in:392: warning: AC_LANG_CONFTEST: no AC_LANG_SOURCE call detected in body ../../lib/autoconf/lang.m4:193: AC_LANG_CONFTEST is expanded from... ../../lib/autoconf/general.m4:2590: _AC_COMPILE_IFELSE is expanded from... ../../lib/autoconf/general.m4:2606: AC_COMPILE_IFELSE is expanded from... configure.in:392: the top level configure.in:63: warning: AC_LANG_CONFTEST: no AC_LANG_SOURCE call detected in body ../../lib/autoconf/lang.m4:193: AC_LANG_CONFTEST is expanded from... configure.in:63: the top level configure.in:260: warning: AC_LANG_CONFTEST: no AC_LANG_SOURCE call detected in body ../../lib/autoconf/lang.m4:193: AC_LANG_CONFTEST is expanded from... ../../lib/autoconf/general.m4:2590: _AC_COMPILE_IFELSE is expanded from... ../../lib/autoconf/general.m4:2606: AC_COMPILE_IFELSE is expanded from... configure.in:260: the top level configure.in:276: warning: AC_LANG_CONFTEST: no AC_LANG_SOURCE call detected in body ../../lib/autoconf/lang.m4:193: AC_LANG_CONFTEST is expanded from... ../../lib/autoconf/general.m4:2590: _AC_COMPILE_IFELSE is expanded from... ../../lib/autoconf/general.m4:2606: AC_COMPILE_IFELSE is expanded from... configure.in:276: the top level configure.in:392: warning: AC_LANG_CONFTEST: no AC_LANG_SOURCE call detected in body ../../lib/autoconf/lang.m4:193: AC_LANG_CONFTEST is expanded from... ../../lib/autoconf/general.m4:2590: _AC_COMPILE_IFELSE is expanded from... ../../lib/autoconf/general.m4:2606: AC_COMPILE_IFELSE is expanded from... configure.in:392: the top level + autoconf configure.in:63: warning: AC_LANG_CONFTEST: no AC_LANG_SOURCE call detected in body ../../lib/autoconf/lang.m4:193: AC_LANG_CONFTEST is expanded from... configure.in:63: the top level configure.in:260: warning: AC_LANG_CONFTEST: no AC_LANG_SOURCE call detected in body ../../lib/autoconf/lang.m4:193: AC_LANG_CONFTEST is expanded from... ../../lib/autoconf/general.m4:2590: _AC_COMPILE_IFELSE is expanded from... ../../lib/autoconf/general.m4:2606: AC_COMPILE_IFELSE is expanded from... configure.in:260: the top level configure.in:276: warning: AC_LANG_CONFTEST: no AC_LANG_SOURCE call detected in body ../../lib/autoconf/lang.m4:193: AC_LANG_CONFTEST is expanded from... ../../lib/autoconf/general.m4:2590: _AC_COMPILE_IFELSE is expanded from... ../../lib/autoconf/general.m4:2606: AC_COMPILE_IFELSE is expanded from... configure.in:276: the top level configure.in:392: warning: AC_LANG_CONFTEST: no AC_LANG_SOURCE call detected in body ../../lib/autoconf/lang.m4:193: AC_LANG_CONFTEST is expanded from... ../../lib/autoconf/general.m4:2590: _AC_COMPILE_IFELSE is expanded from... ../../lib/autoconf/general.m4:2606: AC_COMPILE_IFELSE is expanded from... configure.in:392: the top level + automake -a -c -f --foreign automake: warning: autoconf input should be named 'configure.ac', not 'configure.in' configure.in:63: warning: AC_LANG_CONFTEST: no AC_LANG_SOURCE call detected in body ../../lib/autoconf/lang.m4:193: AC_LANG_CONFTEST is expanded from... configure.in:63: the top level configure.in:260: warning: AC_LANG_CONFTEST: no AC_LANG_SOURCE call detected in body ../../lib/autoconf/lang.m4:193: AC_LANG_CONFTEST is expanded from... ../../lib/autoconf/general.m4:2590: _AC_COMPILE_IFELSE is expanded from... ../../lib/autoconf/general.m4:2606: AC_COMPILE_IFELSE is expanded from... configure.in:260: the top level configure.in:276: warning: AC_LANG_CONFTEST: no AC_LANG_SOURCE call detected in body ../../lib/autoconf/lang.m4:193: AC_LANG_CONFTEST is expanded from... ../../lib/autoconf/general.m4:2590: _AC_COMPILE_IFELSE is expanded from... ../../lib/autoconf/general.m4:2606: AC_COMPILE_IFELSE is expanded from... configure.in:276: the top level configure.in:392: warning: AC_LANG_CONFTEST: no AC_LANG_SOURCE call detected in body ../../lib/autoconf/lang.m4:193: AC_LANG_CONFTEST is expanded from... ../../lib/autoconf/general.m4:2590: _AC_COMPILE_IFELSE is expanded from... ../../lib/autoconf/general.m4:2606: AC_COMPILE_IFELSE is expanded from... configure.in:392: the top level configure.in:6: warning: AM_INIT_AUTOMAKE: two- and three-arguments forms are deprecated. For more info, see: configure.in:6: https://www.gnu.org/software/automake/manual/automake.html#Modernize-AM_005fINIT_005fAUTOMAKE-invocation configure.in:3: installing './compile' configure.in:6: installing './missing' automake: warning: autoconf input should be named 'configure.ac', not 'configure.in' cvsapi/Makefile.am:20: warning: source file 'diff/DiffBase.cpp' is in a subdirectory, cvsapi/Makefile.am:20: but option 'subdir-objects' is disabled automake: warning: possible forward-incompatibility. automake: At least a source file is in a subdirectory, but the 'subdir-objects' automake: automake option hasn't been enabled. For now, the corresponding output automake: object file(s) will be placed in the top-level directory. However, automake: this behaviour will change in future Automake versions: they will automake: unconditionally cause object files to be placed in the same subdirectory automake: of the corresponding sources. automake: You are advised to start using 'subdir-objects' option throughout your automake: project, to avoid future incompatibilities. cvsapi/Makefile.am:20: warning: source file 'diff/StringDiff.cpp' is in a subdirectory, cvsapi/Makefile.am:20: but option 'subdir-objects' is disabled cvsapi/Makefile.am:20: warning: source file 'lib/fncmp.c' is in a subdirectory, cvsapi/Makefile.am:20: but option 'subdir-objects' is disabled cvsapi/Makefile.am:20: warning: source file 'lib/fnmatch.c' is in a subdirectory, cvsapi/Makefile.am:20: but option 'subdir-objects' is disabled cvsapi/Makefile.am:20: warning: source file 'lib/getdate.c' is in a subdirectory, cvsapi/Makefile.am:20: but option 'subdir-objects' is disabled cvsapi/Makefile.am:20: warning: source file 'lib/getmode.c' is in a subdirectory, cvsapi/Makefile.am:20: but option 'subdir-objects' is disabled cvsapi/Makefile.am:20: warning: source file 'lib/md5.c' is in a subdirectory, cvsapi/Makefile.am:20: but option 'subdir-objects' is disabled cvsapi/Makefile.am:20: warning: source file 'lib/md5crypt.c' is in a subdirectory, cvsapi/Makefile.am:20: but option 'subdir-objects' is disabled cvsapi/Makefile.am:20: warning: source file 'lib/timegm.c' is in a subdirectory, cvsapi/Makefile.am:20: but option 'subdir-objects' is disabled cvsapi/Makefile.am:20: warning: source file 'lib/GetOsVersion.cpp' is in a subdirectory, cvsapi/Makefile.am:20: but option 'subdir-objects' is disabled cvsapi/Makefile.am:20: warning: source file 'unix/DirectoryAccess.cpp' is in a subdirectory, cvsapi/Makefile.am:20: but option 'subdir-objects' is disabled cvsapi/Makefile.am:20: warning: source file 'unix/DnsApi.cpp' is in a subdirectory, cvsapi/Makefile.am:20: but option 'subdir-objects' is disabled cvsapi/Makefile.am:20: warning: source file 'unix/FileAccess.cpp' is in a subdirectory, cvsapi/Makefile.am:20: but option 'subdir-objects' is disabled cvsapi/Makefile.am:20: warning: source file 'unix/HttpSocket.cpp' is in a subdirectory, cvsapi/Makefile.am:20: but option 'subdir-objects' is disabled cvsapi/Makefile.am:20: warning: source file 'unix/LibraryAccess.cpp' is in a subdirectory, cvsapi/Makefile.am:20: but option 'subdir-objects' is disabled cvsapi/Makefile.am:20: warning: source file 'unix/RunFile.cpp' is in a subdirectory, cvsapi/Makefile.am:20: but option 'subdir-objects' is disabled cvsapi/Makefile.am:20: warning: source file 'unix/SocketIO.cpp' is in a subdirectory, cvsapi/Makefile.am:20: but option 'subdir-objects' is disabled cvsapi/Makefile.am:20: warning: source file 'unix/SSPIHandler.cpp' is in a subdirectory, cvsapi/Makefile.am:20: but option 'subdir-objects' is disabled cvsapi/Makefile.am: installing './depcomp' cvsapi/db/Makefile.am:6: warning: source file 'mysql/MySqlConnection.cpp' is in a subdirectory, cvsapi/db/Makefile.am:6: but option 'subdir-objects' is disabled cvsapi/db/Makefile.am:6: warning: source file 'mysql/MySqlConnectionInformation.cpp' is in a subdirectory, cvsapi/db/Makefile.am:6: but option 'subdir-objects' is disabled cvsapi/db/Makefile.am:6: warning: source file 'mysql/MySqlRecordset.cpp' is in a subdirectory, cvsapi/db/Makefile.am:6: but option 'subdir-objects' is disabled cvsapi/db/Makefile.am:51: warning: source file 'odbc/OdbcConnection.cpp' is in a subdirectory, cvsapi/db/Makefile.am:51: but option 'subdir-objects' is disabled cvsapi/db/Makefile.am:51: warning: source file 'odbc/OdbcConnectionInformation.cpp' is in a subdirectory, cvsapi/db/Makefile.am:51: but option 'subdir-objects' is disabled cvsapi/db/Makefile.am:51: warning: source file 'odbc/OdbcRecordset.cpp' is in a subdirectory, cvsapi/db/Makefile.am:51: but option 'subdir-objects' is disabled cvsapi/db/Makefile.am:36: warning: source file 'postgres/PostgresConnection.cpp' is in a subdirectory, cvsapi/db/Makefile.am:36: but option 'subdir-objects' is disabled cvsapi/db/Makefile.am:36: warning: source file 'postgres/PostgresConnectionInformation.cpp' is in a subdirectory, cvsapi/db/Makefile.am:36: but option 'subdir-objects' is disabled cvsapi/db/Makefile.am:36: warning: source file 'postgres/PostgresRecordset.cpp' is in a subdirectory, cvsapi/db/Makefile.am:36: but option 'subdir-objects' is disabled cvsapi/db/Makefile.am:21: warning: source file 'sqlite/SQLiteConnection.cpp' is in a subdirectory, cvsapi/db/Makefile.am:21: but option 'subdir-objects' is disabled cvsapi/db/Makefile.am:21: warning: source file 'sqlite/SQLiteConnectionInformation.cpp' is in a subdirectory, cvsapi/db/Makefile.am:21: but option 'subdir-objects' is disabled cvsapi/db/Makefile.am:21: warning: source file 'sqlite/SQLiteRecordset.cpp' is in a subdirectory, cvsapi/db/Makefile.am:21: but option 'subdir-objects' is disabled cvsapi/mdns/Makefile.am:6: warning: source file 'apple/mdns_apple.cpp' is in a subdirectory, cvsapi/mdns/Makefile.am:6: but option 'subdir-objects' is disabled cvsapi/mdns/Makefile.am:17: warning: source file 'mini/mdns_mini.cpp' is in a subdirectory, cvsapi/mdns/Makefile.am:17: but option 'subdir-objects' is disabled cvstools/Makefile.am:5: warning: source file 'unix/GlobalSettings.cpp' is in a subdirectory, cvstools/Makefile.am:5: but option 'subdir-objects' is disabled diff/Makefile.am:16: warning: 'INCLUDES' is the old name for 'AM_CPPFLAGS' (or '*_CPPFLAGS') osx/Makefile.am:2: warning: 'INCLUDES' is the old name for 'AM_CPPFLAGS' (or '*_CPPFLAGS') + ./configure 'LDFLAGS=-Wl,--as-needed -Wl,--no-copy-dt-needed-entries -Wl,-z,relro -Wl,-z,combreloc ' 'CFLAGS=-O2 -fwrapv -pipe -Wformat -Werror=format-security -gdwarf-4 -fno-debug-types-section -fvar-tracking-assignments -g2 -Wp,-D_FORTIFY_SOURCE=2 -fstack-protector-strong --param=ssp-buffer-size=4 -fPIC -march=x86-64 -gdwarf-4 -fno-debug-types-section -fvar-tracking-assignments -g2 ' 'CXXFLAGS=-O2 -fwrapv -pipe -Wformat -Werror=format-security -gdwarf-4 -fno-debug-types-section -fvar-tracking-assignments -g2 -Wp,-D_FORTIFY_SOURCE=2 -fstack-protector-strong --param=ssp-buffer-size=4 -fPIC -march=x86-64 -gdwarf-4 -fno-debug-types-section -fvar-tracking-assignments -g2 ' 'FFLAGS=-O2 -fwrapv -pipe -Wformat -Werror=format-security -gdwarf-4 -fno-debug-types-section -fvar-tracking-assignments -g2 -Wp,-D_FORTIFY_SOURCE=2 -fstack-protector-strong --param=ssp-buffer-size=4 -fPIC -march=x86-64 -gdwarf-4 -fno-debug-types-section -fvar-tracking-assignments -g2 ' 'FCFLAGS=-O2 -fwrapv -pipe -Wformat -Werror=format-security -gdwarf-4 -fno-debug-types-section -fvar-tracking-assignments -g2 -Wp,-D_FORTIFY_SOURCE=2 -fstack-protector-strong --param=ssp-buffer-size=4 -fPIC -march=x86-64 -gdwarf-4 -fno-debug-types-section -fvar-tracking-assignments -g2 ' 'CPPFLAGS=' 'CC=x86_64-pld-linux-gcc' 'CXX=x86_64-pld-linux-g++' '--host=x86_64-pld-linux' '--build=x86_64-pld-linux' '--prefix=/usr' '--exec-prefix=/usr' '--bindir=/usr/bin' '--sbindir=/usr/sbin' '--sysconfdir=/etc' '--datadir=/usr/share' '--includedir=/usr/include' '--libdir=/usr/lib64' '--libexecdir=/usr/libexec' '--localstatedir=/var' '--sharedstatedir=/var/lib' '--mandir=/usr/share/man' '--infodir=/usr/share/info' '--x-libraries=/usr/lib64' --enable-mdns --enable-sqlite --enable-mysql --enable-odbc --enable-postgres --enable-pam --enable-server --enable-lockserver --enable-pserver --enable-ext --enable-rsh --enable-gserver --enable-sserver --enable-sspi --enable-enum --enable-rcs configure: WARNING: unrecognized options: --enable-lockserver, --enable-enum checking for x86_64-pld-linux-gcc... x86_64-pld-linux-gcc checking whether the C compiler works... yes checking for C compiler default output file name... a.out checking for suffix of executables... checking whether we are cross compiling... no checking for suffix of object files... o checking whether we are using the GNU C compiler... yes checking whether x86_64-pld-linux-gcc accepts -g... yes checking for x86_64-pld-linux-gcc option to accept ISO C89... none needed checking whether x86_64-pld-linux-gcc understands -c and -o together... yes checking build system type... x86_64-pld-linux-gnu checking host system type... x86_64-pld-linux-gnu checking target system type... x86_64-pld-linux-gnu checking for a BSD-compatible install... /usr/bin/install -c checking whether build environment is sane... yes checking for a thread-safe mkdir -p... /bin/mkdir -p checking for mawk... mawk checking whether make sets $(MAKE)... yes checking whether make supports the include directive... yes (GNU style) checking whether make supports nested variables... yes checking dependency style of x86_64-pld-linux-gcc... gcc3 checking whether to enable maintainer-specific portions of Makefiles... no checking for mawk... (cached) mawk checking whether we are using the GNU C++ compiler... yes checking whether x86_64-pld-linux-g++ accepts -g... yes checking dependency style of x86_64-pld-linux-g++... gcc3 checking how to run the C preprocessor... x86_64-pld-linux-gcc -E checking whether make sets $(MAKE)... (cached) yes checking for bison... bison -y checking whether ln -s works... yes checking for C compiler vendor... gnu checking how to print strings... print -r checking for a sed that does not truncate output... /bin/sed checking for grep that handles long lines and -e... /bin/grep checking for egrep... /bin/grep -E checking for fgrep... /bin/grep -F checking for ld used by x86_64-pld-linux-gcc... /usr/bin/ld checking if the linker (/usr/bin/ld) is GNU ld... yes checking for BSD- or MS-compatible name lister (nm)... /usr/bin/nm -B checking the name lister (/usr/bin/nm -B) interface... BSD nm checking the maximum length of command line arguments... 1572864 checking how to convert x86_64-pld-linux-gnu file names to x86_64-pld-linux-gnu format... func_convert_file_noop checking how to convert x86_64-pld-linux-gnu file names to toolchain format... func_convert_file_noop checking for /usr/bin/ld option to reload object files... -r checking for x86_64-pld-linux-objdump... no checking for objdump... objdump checking how to recognize dependent libraries... pass_all checking for x86_64-pld-linux-dlltool... no checking for dlltool... no checking how to associate runtime and link libraries... print -r -- checking for x86_64-pld-linux-ar... no checking for ar... ar checking for archiver @FILE support... @ checking for x86_64-pld-linux-strip... no checking for strip... strip checking for x86_64-pld-linux-ranlib... no checking for ranlib... ranlib checking command to parse /usr/bin/nm -B output from x86_64-pld-linux-gcc object... ok checking for sysroot... no checking for a working dd... /bin/dd checking how to truncate binary pipes... /bin/dd bs=4096 count=1 checking for x86_64-pld-linux-mt... no checking for mt... no checking if : is a manifest tool... no checking for ANSI C header files... yes checking for sys/types.h... yes checking for sys/stat.h... yes checking for stdlib.h... yes checking for string.h... yes checking for memory.h... yes checking for strings.h... yes checking for inttypes.h... yes checking for stdint.h... yes checking for unistd.h... yes checking for dlfcn.h... yes checking for objdir... .libs checking if x86_64-pld-linux-gcc supports -fno-rtti -fno-exceptions... no checking for x86_64-pld-linux-gcc option to produce PIC... -fPIC -DPIC checking if x86_64-pld-linux-gcc PIC flag -fPIC -DPIC works... yes checking if x86_64-pld-linux-gcc static flag -static works... yes checking if x86_64-pld-linux-gcc supports -c -o file.o... yes checking if x86_64-pld-linux-gcc supports -c -o file.o... (cached) yes checking whether the x86_64-pld-linux-gcc linker (/usr/bin/ld -m elf_x86_64) supports shared libraries... yes checking whether -lc should be explicitly linked in... no checking dynamic linker characteristics... GNU/Linux ld.so checking how to hardcode library paths into programs... immediate checking for shl_load... no checking for shl_load in -ldld... no checking for dlopen... no checking for dlopen in -ldl... yes checking whether a program can dlopen itself... yes checking whether a statically linked program can dlopen itself... no checking whether stripping libraries is possible... yes checking if libtool supports shared libraries... yes checking whether to build shared libraries... yes checking whether to build static libraries... no checking how to run the C++ preprocessor... x86_64-pld-linux-g++ -E checking for ld used by x86_64-pld-linux-g++... /usr/bin/ld -m elf_x86_64 checking if the linker (/usr/bin/ld -m elf_x86_64) is GNU ld... yes checking whether the x86_64-pld-linux-g++ linker (/usr/bin/ld -m elf_x86_64) supports shared libraries... yes checking for x86_64-pld-linux-g++ option to produce PIC... -fPIC -DPIC checking if x86_64-pld-linux-g++ PIC flag -fPIC -DPIC works... yes checking if x86_64-pld-linux-g++ static flag -static works... yes checking if x86_64-pld-linux-g++ supports -c -o file.o... yes checking if x86_64-pld-linux-g++ supports -c -o file.o... (cached) yes checking whether the x86_64-pld-linux-g++ linker (/usr/bin/ld -m elf_x86_64) supports shared libraries... yes checking dynamic linker characteristics... (cached) GNU/Linux ld.so checking how to hardcode library paths into programs... immediate checking what extension is used for runtime loadable modules... .so checking what variable specifies run-time module search path... LD_LIBRARY_PATH checking for the default library search path... /lib64 /usr/lib64 checking for library containing dlopen... -ldl checking for dlerror... yes checking for shl_load... (cached) no checking for shl_load in -ldld... (cached) no checking for dld_link in -ldld... no checking for _ prefix in compiled symbols... no checking whether deplibs are loaded by dlopen... yes checking for argz.h... yes checking for error_t... yes checking for argz_add... yes checking for argz_append... yes checking for argz_count... yes checking for argz_create_sep... yes checking for argz_insert... yes checking for argz_next... yes checking for argz_stringify... yes checking if argz actually works... yes checking whether libtool supports -dlopen/-dlpreopen... yes checking for ltdl.h... yes checking whether lt_dlinterface_register is declared... yes checking for lt_dladvise_preload in -lltdl... yes checking where to find libltdl headers... checking where to find libltdl library... -lltdl checking for unistd.h... (cached) yes checking for dl.h... no checking for sys/dl.h... no checking for dld.h... no checking for mach-o/dyld.h... no checking for dirent.h... yes checking for closedir... yes checking for opendir... yes checking for readdir... yes checking for strlcat... no checking for strlcpy... no checking whether GNUC visibility support... yes checking for GNUC visibility attribute... checking for groff... /usr/bin/groff checking for ps2pdf... /usr/bin/ps2pdf checking for texi2dvi... /usr/bin/texi2dvi checking whether #! works in shell scripts... yes checking for BSD VPATH bug in make... no checking for library containing strerror... none required checking support for mdns... yes checking dns_sd.h usability... yes checking dns_sd.h presence... yes checking for dns_sd.h... yes checking for DNSServiceRegister in -ldns_sd... yes checking avahi-client/client.h usability... yes checking avahi-client/client.h presence... yes checking for avahi-client/client.h... yes checking for avahi_client_new in -lavahi-client... yes checking for ANSI C header files... (cached) yes checking for dirent.h that defines DIR... yes checking for library containing opendir... none required checking for sys/wait.h that is POSIX.1 compatible... yes checking errno.h usability... yes checking errno.h presence... yes checking for errno.h... yes checking for unistd.h... (cached) yes checking for string.h... (cached) yes checking for memory.h... (cached) yes checking utime.h usability... yes checking utime.h presence... yes checking for utime.h... yes checking fcntl.h usability... yes checking fcntl.h presence... yes checking for fcntl.h... yes checking ndbm.h usability... yes checking ndbm.h presence... yes checking for ndbm.h... yes checking limits.h usability... yes checking limits.h presence... yes checking for limits.h... yes checking sys/file.h usability... yes checking sys/file.h presence... yes checking for sys/file.h... yes checking grp.h usability... yes checking grp.h presence... yes checking for grp.h... yes checking stdio.h usability... yes checking stdio.h presence... yes checking for stdio.h... yes checking stdarg.h usability... yes checking stdarg.h presence... yes checking for stdarg.h... yes checking sys/un.h usability... yes checking sys/un.h presence... yes checking for sys/un.h... yes checking sys/param.h usability... yes checking sys/param.h presence... yes checking for sys/param.h... yes checking sys/select.h usability... yes checking sys/select.h presence... yes checking for sys/select.h... yes checking sys/time.h usability... yes checking sys/time.h presence... yes checking for sys/time.h... yes checking sys/timeb.h usability... yes checking sys/timeb.h presence... yes checking for sys/timeb.h... yes checking sys/socket.h usability... yes checking sys/socket.h presence... yes checking for sys/socket.h... yes checking io.h usability... no checking io.h presence... no checking for io.h... no checking direct.h usability... no checking direct.h presence... no checking for direct.h... no checking sys/bsdtypes.h usability... no checking sys/bsdtypes.h presence... no checking for sys/bsdtypes.h... no checking sys/resource.h usability... yes checking sys/resource.h presence... yes checking for sys/resource.h... yes checking syslog.h usability... yes checking syslog.h presence... yes checking for syslog.h... yes checking glob.h usability... yes checking glob.h presence... yes checking for glob.h... yes checking paths.h usability... yes checking paths.h presence... yes checking for paths.h... yes checking getopt.h usability... yes checking getopt.h presence... yes checking for getopt.h... yes checking malloc.h usability... yes checking malloc.h presence... yes checking for malloc.h... yes checking stddef.h usability... yes checking stddef.h presence... yes checking for stddef.h... yes checking sys/uio.h usability... yes checking sys/uio.h presence... yes checking for sys/uio.h... yes checking security/pam_misc.h usability... yes checking security/pam_misc.h presence... yes checking for security/pam_misc.h... yes checking pam/pam_misc.h usability... no checking pam/pam_misc.h presence... no checking for pam/pam_misc.h... no checking security/pam_appl.h usability... yes checking security/pam_appl.h presence... yes checking for security/pam_appl.h... yes checking pam/pam_appl.h usability... no checking pam/pam_appl.h presence... no checking for pam/pam_appl.h... no checking netinet/in.h usability... yes checking netinet/in.h presence... yes checking for netinet/in.h... yes checking arpa/inet.h usability... yes checking arpa/inet.h presence... yes checking for arpa/inet.h... yes checking iconv.h usability... yes checking iconv.h presence... yes checking for iconv.h... yes checking libcharset.h usability... no checking libcharset.h presence... no checking for libcharset.h... no checking locale.h usability... yes checking locale.h presence... yes checking for locale.h... yes checking localcharset.h usability... no checking localcharset.h presence... no checking for localcharset.h... no checking langinfo.h usability... yes checking langinfo.h presence... yes checking for langinfo.h... yes checking regex.h usability... yes checking regex.h presence... yes checking for regex.h... yes checking pthread.h usability... yes checking pthread.h presence... yes checking for pthread.h... yes checking sys/times.h usability... yes checking sys/times.h presence... yes checking for sys/times.h... yes checking for dns_sd.h... (cached) yes checking termios.h usability... yes checking termios.h presence... yes checking for termios.h... yes checking sys/termios.h usability... yes checking sys/termios.h presence... yes checking for sys/termios.h... yes checking wchar.h usability... yes checking wchar.h presence... yes checking for wchar.h... yes checking idna.h usability... yes checking idna.h presence... yes checking for idna.h... yes checking whether stat file-mode macros are broken... no checking whether time.h and sys/time.h may both be included... yes checking size of int... 4 checking size of long... 8 checking size of short... 2 checking return type of signal handlers... void checking for uid_t in sys/types.h... yes checking for mode_t... yes checking for off_t... yes checking for size_t... yes checking for pid_t... yes checking for socklen_t... yes checking for ptrdiff_t... yes checking for struct stat.st_rdev... yes checking for struct stat.st_blksize... yes checking for ino_t... yes checking for loff_t... yes checking for special C compiler options needed for large files... no checking for _FILE_OFFSET_BITS value needed for large files... no checking for broken char_traits... no checking for std::wstring... yes checking whether va_list assignments need array notation... yes checking for the pthreads library -lpthreads... no checking whether pthreads work without any flags... no checking whether pthreads work with -Kthread... no checking whether pthreads work with -kthread... no checking for the pthreads library -llthread... no checking whether pthreads work with -pthread... yes checking for joinable pthread attribute... PTHREAD_CREATE_JOINABLE checking if more special flags are required for pthreads... no checking for cc_r... x86_64-pld-linux-gcc checking for mkdir... yes checking for rename... yes checking for strstr... yes checking for dup2... yes checking for strerror... yes checking for waitpid... yes checking for memmove... yes checking for strtoul... yes checking for daemon... yes checking for timegm... yes checking for getdelim... yes checking for getline... yes checking for ftruncate... yes checking for regcomp... yes checking for getopt_long... yes checking for library containing libiconv_open... no checking for library containing iconv_open... none required checking for getaddrinfo in -lsocket... no checking for library containing res_query... no checking for library containing __res_query... -lresolv checking for library containing res_query... (cached) no checking for getaddrinfo... yes checking for getnameinfo... yes checking for inet_aton... yes checking for idna_to_ascii_lz in -lidn... yes checking for xml2-config... /usr/bin/xml2-config checking for libxml2... yes checking for xmlSchemaValidCtxtGetParserCtxt in -lxml2... yes checking for PCRE posix library... yes checking whether iconv uses const... no checking for fchdir... yes checking for fchmod... yes checking for fsync... yes checking for ftime... yes checking for ftruncate... (cached) yes checking for getgroups... yes checking for getpagesize... yes checking for getpass... yes checking for getpassphrase... no checking for gettimeofday... yes checking for initgroups... yes checking for mknod... yes checking for mkstemp... yes checking for mktemp... yes checking for putenv... yes checking for readlink... yes checking for sigaction... yes checking for sigblock... yes checking for sigprocmask... yes checking for sigsetmask... yes checking for sigvec... no checking for snprintf... yes checking for tempnam... yes checking for timezone... yes checking for tzset... yes checking for vprintf... yes checking for wait3... yes checking for strdup... yes checking for getaddrinfo... (cached) yes checking for inet_aton... (cached) yes checking for memchr... yes checking for strchr... yes checking for getopt... yes checking for iconv_open... yes checking for libiconv_open... no checking for locale_charset... no checking for nl_langinfo... yes checking for setlocale... yes checking for res_query... no checking for nanosleep... yes checking for fseeko... yes checking for ftello... yes checking for broken getopt()... no checking vfork.h usability... no checking vfork.h presence... no checking for vfork.h... no checking for fork... yes checking for vfork... yes checking for working fork... yes checking for working vfork... (cached) yes checking whether closedir returns void... no checking for library containing getspnam... none required checking for utime.h... (cached) yes checking whether utime accepts a null argument... yes checking for long file names... yes checking for working POSIX fnmatch... yes checking for main in -lnsl... yes checking for library containing connect... none required checking for library containing gethostbyname... none required checking for gethostname... yes checking for library containing zlibVersion... -lz checking for zlib > 1.2.0... yes checking support for sqlite... yes checking for library containing sqlite3_open... -lsqlite3 checking for sqlite... yes checking support for mysql 3.23... yes checking for mysql_config... /usr/bin/mysql_config checking for library containing mysql_init... none required checking for mysql... yes checking support for ODBC... yes checking for library containing SQLConnect... -lodbc checking for ODBC... yes checking support for Postgres... yes checking for pg_config... /usr/bin/pg_config checking for library containing PQconnectdb... -lpq checking for Postgres... yes checking sqlite3.h usability... yes checking sqlite3.h presence... yes checking for sqlite3.h... yes checking mysql.h usability... yes checking mysql.h presence... yes checking for mysql.h... yes checking libpq-fe.h usability... yes checking libpq-fe.h presence... yes checking for libpq-fe.h... yes checking sql.h usability... yes checking sql.h presence... yes checking for sql.h... yes checking sqlext.h usability... yes checking sqlext.h presence... yes checking for sqlext.h... yes checking support for Mac HFS... no checking for krb5-config... /usr/bin/krb5-config checking gssapi.h usability... yes checking gssapi.h presence... yes checking for gssapi.h... yes checking gssapi/gssapi.h usability... yes checking gssapi/gssapi.h presence... yes checking for gssapi/gssapi.h... yes checking gssapi/gssapi_generic.h usability... no checking gssapi/gssapi_generic.h presence... no checking for gssapi/gssapi_generic.h... no checking for GSS_C_NT_HOSTBASED_SERVICE... no checking for library containing des_set_odd_parity... no checking for library containing com_err... -lcom_err checking for library containing initialize_asn1_error_table_r... -lasn1 checking for library containing __dn_expand... -lresolv checking for library containing roken_gethostbyaddr... -lroken checking for library containing valid_enctype... no checking for library containing compile... no checking for library containing krb5_free_context... -lkrb5 checking for library containing gss_import_name... none required checking for library containing ERR_get_error... -lcrypto checking for library containing SSL_CTX_new... -lssl checking for openssl... yes checking for security/pam_appl.h... (cached) yes checking for pam/pam_appl.h... (cached) no checking for library containing pam_open_session... -lpam checking for PAM availability... yes checking for crypt in -lcrypt... yes checking support for PAM... yes checking support for server... yes checking support for pserver protocol... yes checking support for ext protocol... yes checking support for fork protocol... no checking support for rsh server protocol... yes checking support for gserver protocol... yes checking support for sserver protocol... yes checking support for sspi protocol... yes checking support for enum protocol... yes checking whether to compile RCS tools... yes checking that generated files are newer than configure... done configure: creating ./config.status config.status: creating Makefile config.status: creating diff/Makefile config.status: creating lib/Makefile config.status: creating cvsgui/Makefile config.status: creating cvsdelta/Makefile config.status: creating man/Makefile config.status: creating src/Makefile config.status: creating protocols/Makefile config.status: creating triggers/Makefile config.status: creating lockservice/Makefile config.status: creating rcs/Makefile config.status: creating cvsapi/Makefile config.status: creating cvsapi/db/Makefile config.status: creating cvsapi/mdns/Makefile config.status: creating cvstools/Makefile config.status: creating xdiff/Makefile config.status: creating mdnsclient/Makefile config.status: creating run_script/Makefile config.status: creating redhat/cvsnt.spec config.status: creating osx/Makefile config.status: creating config.h config.status: creating src/options.h config.status: executing depfiles commands config.status: executing libtool commands configure: WARNING: unrecognized options: --enable-lockserver, --enable-enum + /usr/bin/make -Otarget -j5 /usr/bin/make all-recursive Making all in lib make[2]: Entering directory '/tmp/B.pteQEh/BUILD/cvsnt-2.5.05.3744/lib' x86_64-pld-linux-gcc -DHAVE_CONFIG_H -I. -I.. -I../src -I../src -I/usr/include/libxml2 -I/usr/include/mysql -I/usr/include -DCVS_CONFIG_DIR=\"/etc/cvsnt\" -DCVS_LIBRARY_DIR=\"/usr/lib64/cvsnt\" -O2 -fwrapv -pipe -Wformat -Werror=format-security -gdwarf-4 -fno-debug-types-section -fvar-tracking-assignments -g2 -Wp,-D_FORTIFY_SOURCE=2 -fstack-protector-strong --param=ssp-buffer-size=4 -fPIC -march=x86-64 -gdwarf-4 -fno-debug-types-section -fvar-tracking-assignments -g2 -MT argmatch.o -MD -MP -MF .deps/argmatch.Tpo -c -o argmatch.o argmatch.c mv -f .deps/argmatch.Tpo .deps/argmatch.Po make[2]: Leaving directory '/tmp/B.pteQEh/BUILD/cvsnt-2.5.05.3744/lib' make[2]: Entering directory '/tmp/B.pteQEh/BUILD/cvsnt-2.5.05.3744/lib' x86_64-pld-linux-gcc -DHAVE_CONFIG_H -I. -I.. -I../src -I../src -I/usr/include/libxml2 -I/usr/include/mysql -I/usr/include -DCVS_CONFIG_DIR=\"/etc/cvsnt\" -DCVS_LIBRARY_DIR=\"/usr/lib64/cvsnt\" -O2 -fwrapv -pipe -Wformat -Werror=format-security -gdwarf-4 -fno-debug-types-section -fvar-tracking-assignments -g2 -Wp,-D_FORTIFY_SOURCE=2 -fstack-protector-strong --param=ssp-buffer-size=4 -fPIC -march=x86-64 -gdwarf-4 -fno-debug-types-section -fvar-tracking-assignments -g2 -MT getpass.o -MD -MP -MF .deps/getpass.Tpo -c -o getpass.o getpass.c mv -f .deps/getpass.Tpo .deps/getpass.Po make[2]: Leaving directory '/tmp/B.pteQEh/BUILD/cvsnt-2.5.05.3744/lib' make[2]: Entering directory '/tmp/B.pteQEh/BUILD/cvsnt-2.5.05.3744/lib' x86_64-pld-linux-gcc -DHAVE_CONFIG_H -I. -I.. -I../src -I../src -I/usr/include/libxml2 -I/usr/include/mysql -I/usr/include -DCVS_CONFIG_DIR=\"/etc/cvsnt\" -DCVS_LIBRARY_DIR=\"/usr/lib64/cvsnt\" -O2 -fwrapv -pipe -Wformat -Werror=format-security -gdwarf-4 -fno-debug-types-section -fvar-tracking-assignments -g2 -Wp,-D_FORTIFY_SOURCE=2 -fstack-protector-strong --param=ssp-buffer-size=4 -fPIC -march=x86-64 -gdwarf-4 -fno-debug-types-section -fvar-tracking-assignments -g2 -MT sighandle.o -MD -MP -MF .deps/sighandle.Tpo -c -o sighandle.o sighandle.c mv -f .deps/sighandle.Tpo .deps/sighandle.Po make[2]: Leaving directory '/tmp/B.pteQEh/BUILD/cvsnt-2.5.05.3744/lib' make[2]: Entering directory '/tmp/B.pteQEh/BUILD/cvsnt-2.5.05.3744/lib' rm -f libcvs.a ar cru libcvs.a argmatch.o getpass.o sighandle.o ranlib libcvs.a make[2]: Leaving directory '/tmp/B.pteQEh/BUILD/cvsnt-2.5.05.3744/lib' Making all in mdnsclient make[2]: Entering directory '/tmp/B.pteQEh/BUILD/cvsnt-2.5.05.3744/mdnsclient' /bin/sh ../libtool --tag=CC --mode=compile x86_64-pld-linux-gcc -DHAVE_CONFIG_H -I. -I.. -I../src -I../lib -D_MDNS_EXPORT -I/usr/include/libxml2 -I/usr/include/mysql -I/usr/include -O2 -fwrapv -pipe -Wformat -Werror=format-security -gdwarf-4 -fno-debug-types-section -fvar-tracking-assignments -g2 -Wp,-D_FORTIFY_SOURCE=2 -fstack-protector-strong --param=ssp-buffer-size=4 -fPIC -march=x86-64 -gdwarf-4 -fno-debug-types-section -fvar-tracking-assignments -g2 -MT util.lo -MD -MP -MF .deps/util.Tpo -c -o util.lo util.c libtool: compile: x86_64-pld-linux-gcc -DHAVE_CONFIG_H -I. -I.. -I../src -I../lib -D_MDNS_EXPORT -I/usr/include/libxml2 -I/usr/include/mysql -I/usr/include -O2 -fwrapv -pipe -Wformat -Werror=format-security -gdwarf-4 -fno-debug-types-section -fvar-tracking-assignments -g2 -Wp,-D_FORTIFY_SOURCE=2 -fstack-protector-strong --param=ssp-buffer-size=4 -fPIC -march=x86-64 -gdwarf-4 -fno-debug-types-section -fvar-tracking-assignments -g2 -MT util.lo -MD -MP -MF .deps/util.Tpo -c util.c -fPIC -DPIC -o .libs/util.o mv -f .deps/util.Tpo .deps/util.Plo make[2]: Leaving directory '/tmp/B.pteQEh/BUILD/cvsnt-2.5.05.3744/mdnsclient' make[2]: Entering directory '/tmp/B.pteQEh/BUILD/cvsnt-2.5.05.3744/mdnsclient' /bin/sh ../libtool --tag=CC --mode=compile x86_64-pld-linux-gcc -DHAVE_CONFIG_H -I. -I.. -I../src -I../lib -D_MDNS_EXPORT -I/usr/include/libxml2 -I/usr/include/mysql -I/usr/include -O2 -fwrapv -pipe -Wformat -Werror=format-security -gdwarf-4 -fno-debug-types-section -fvar-tracking-assignments -g2 -Wp,-D_FORTIFY_SOURCE=2 -fstack-protector-strong --param=ssp-buffer-size=4 -fPIC -march=x86-64 -gdwarf-4 -fno-debug-types-section -fvar-tracking-assignments -g2 -MT dns.lo -MD -MP -MF .deps/dns.Tpo -c -o dns.lo dns.c libtool: compile: x86_64-pld-linux-gcc -DHAVE_CONFIG_H -I. -I.. -I../src -I../lib -D_MDNS_EXPORT -I/usr/include/libxml2 -I/usr/include/mysql -I/usr/include -O2 -fwrapv -pipe -Wformat -Werror=format-security -gdwarf-4 -fno-debug-types-section -fvar-tracking-assignments -g2 -Wp,-D_FORTIFY_SOURCE=2 -fstack-protector-strong --param=ssp-buffer-size=4 -fPIC -march=x86-64 -gdwarf-4 -fno-debug-types-section -fvar-tracking-assignments -g2 -MT dns.lo -MD -MP -MF .deps/dns.Tpo -c dns.c -fPIC -DPIC -o .libs/dns.o mv -f .deps/dns.Tpo .deps/dns.Plo make[2]: Leaving directory '/tmp/B.pteQEh/BUILD/cvsnt-2.5.05.3744/mdnsclient' make[2]: Entering directory '/tmp/B.pteQEh/BUILD/cvsnt-2.5.05.3744/mdnsclient' /bin/sh ../libtool --tag=CC --mode=compile x86_64-pld-linux-gcc -DHAVE_CONFIG_H -I. -I.. -I../src -I../lib -D_MDNS_EXPORT -I/usr/include/libxml2 -I/usr/include/mysql -I/usr/include -O2 -fwrapv -pipe -Wformat -Werror=format-security -gdwarf-4 -fno-debug-types-section -fvar-tracking-assignments -g2 -Wp,-D_FORTIFY_SOURCE=2 -fstack-protector-strong --param=ssp-buffer-size=4 -fPIC -march=x86-64 -gdwarf-4 -fno-debug-types-section -fvar-tracking-assignments -g2 -MT mdnsclient.lo -MD -MP -MF .deps/mdnsclient.Tpo -c -o mdnsclient.lo mdnsclient.c libtool: compile: x86_64-pld-linux-gcc -DHAVE_CONFIG_H -I. -I.. -I../src -I../lib -D_MDNS_EXPORT -I/usr/include/libxml2 -I/usr/include/mysql -I/usr/include -O2 -fwrapv -pipe -Wformat -Werror=format-security -gdwarf-4 -fno-debug-types-section -fvar-tracking-assignments -g2 -Wp,-D_FORTIFY_SOURCE=2 -fstack-protector-strong --param=ssp-buffer-size=4 -fPIC -march=x86-64 -gdwarf-4 -fno-debug-types-section -fvar-tracking-assignments -g2 -MT mdnsclient.lo -MD -MP -MF .deps/mdnsclient.Tpo -c mdnsclient.c -fPIC -DPIC -o .libs/mdnsclient.o mdnsclient.c: In function 'mdns_open': mdnsclient.c:183:12: warning: cast to pointer from integer of different size [-Wint-to-pointer-cast] return (mdnshandle_t)fd; ^ mdnsclient.c: In function 'mdns_close': mdnsclient.c:194:21: warning: cast from pointer to integer of different size [-Wpointer-to-int-cast] return closesocket((sock_t)sock); ^ mdnsclient.c: In function 'process_server': mdnsclient.c:936:7: warning: implicit declaration of function 'qsort' [-Wimplicit-function-declaration] qsort(service_list,count,sizeof(service_list[0]),strcmp); ^~~~~ mdnsclient.c: In function 'mdns_query_name': mdnsclient.c:1070:14: warning: cast from pointer to integer of different size [-Wpointer-to-int-cast] sock_t fd = (sock_t)handle; ^ mdnsclient.c: In function 'mdns_query_services': mdnsclient.c:1091:14: warning: cast from pointer to integer of different size [-Wpointer-to-int-cast] sock_t fd = (sock_t)handle; ^ mdnsclient.c: In function 'query_reverse': mdnsclient.c:1147:14: warning: cast from pointer to integer of different size [-Wpointer-to-int-cast] sock_t fd = (sock_t)handle; ^ mdnsclient.c: In function 'mdns_server_step': mdnsclient.c:1205:14: warning: cast from pointer to integer of different size [-Wpointer-to-int-cast] sock_t fd = (sock_t)handle; ^ mv -f .deps/mdnsclient.Tpo .deps/mdnsclient.Plo make[2]: Leaving directory '/tmp/B.pteQEh/BUILD/cvsnt-2.5.05.3744/mdnsclient' make[2]: Entering directory '/tmp/B.pteQEh/BUILD/cvsnt-2.5.05.3744/mdnsclient' /bin/sh ../libtool --tag=CC --mode=link x86_64-pld-linux-gcc -O2 -fwrapv -pipe -Wformat -Werror=format-security -gdwarf-4 -fno-debug-types-section -fvar-tracking-assignments -g2 -Wp,-D_FORTIFY_SOURCE=2 -fstack-protector-strong --param=ssp-buffer-size=4 -fPIC -march=x86-64 -gdwarf-4 -fno-debug-types-section -fvar-tracking-assignments -g2 -release 2.5.05.3744 -Wl,--as-needed -Wl,--no-copy-dt-needed-entries -Wl,-z,relro -Wl,-z,combreloc -o libmdnsclient.la -rpath /usr/lib64 dns.lo mdnsclient.lo util.lo -lcrypt -lxml2 -lidn -lresolv libtool: link: x86_64-pld-linux-gcc -shared -fPIC -DPIC -O2 -gdwarf-4 -g2 -fstack-protector-strong -march=x86-64 -gdwarf-4 -g2 -Wl,--as-needed -Wl,--no-copy-dt-needed-entries -Wl,-z -Wl,relro -Wl,-z -Wl,combreloc -pthread .libs/dns.o .libs/mdnsclient.o .libs/util.o -lcrypt /usr/lib64/libxml2.so -L/usr/lib64 -ldl -lz /usr/lib64/liblzma.so -lm /usr/lib64/libidn.so -lresolv -Wl,-soname -Wl,libmdnsclient-2.5.05.3744.so -o .libs/libmdnsclient-2.5.05.3744.so libtool: link: (cd ".libs" && rm -f "libmdnsclient.so" && ln -s "libmdnsclient-2.5.05.3744.so" "libmdnsclient.so") libtool: link: ( cd ".libs" && rm -f "libmdnsclient.la" && ln -s "../libmdnsclient.la" "libmdnsclient.la" ) make[2]: Leaving directory '/tmp/B.pteQEh/BUILD/cvsnt-2.5.05.3744/mdnsclient' Making all in cvsapi Making all in db make[3]: Entering directory '/tmp/B.pteQEh/BUILD/cvsnt-2.5.05.3744/cvsapi/db' /bin/sh ../../libtool --tag=CXX --mode=compile x86_64-pld-linux-g++ -DHAVE_CONFIG_H -I. -I../.. -I../../src -I../../lib -I../../cvsapi -I/usr/include/libxml2 -I/usr/include/mysql -I/usr/include -O2 -fwrapv -pipe -Wformat -Werror=format-security -gdwarf-4 -fno-debug-types-section -fvar-tracking-assignments -g2 -Wp,-D_FORTIFY_SOURCE=2 -fstack-protector-strong --param=ssp-buffer-size=4 -fPIC -march=x86-64 -gdwarf-4 -fno-debug-types-section -fvar-tracking-assignments -g2 -MT MySqlConnectionInformation.lo -MD -MP -MF .deps/MySqlConnectionInformation.Tpo -c -o MySqlConnectionInformation.lo `test -f 'mysql/MySqlConnectionInformation.cpp' || echo './'`mysql/MySqlConnectionInformation.cpp libtool: compile: x86_64-pld-linux-g++ -DHAVE_CONFIG_H -I. -I../.. -I../../src -I../../lib -I../../cvsapi -I/usr/include/libxml2 -I/usr/include/mysql -I/usr/include -O2 -fwrapv -pipe -Wformat -Werror=format-security -gdwarf-4 -fno-debug-types-section -fvar-tracking-assignments -g2 -Wp,-D_FORTIFY_SOURCE=2 -fstack-protector-strong --param=ssp-buffer-size=4 -fPIC -march=x86-64 -gdwarf-4 -fno-debug-types-section -fvar-tracking-assignments -g2 -MT MySqlConnectionInformation.lo -MD -MP -MF .deps/MySqlConnectionInformation.Tpo -c mysql/MySqlConnectionInformation.cpp -fPIC -DPIC -o .libs/MySqlConnectionInformation.o mv -f .deps/MySqlConnectionInformation.Tpo .deps/MySqlConnectionInformation.Plo make[3]: Leaving directory '/tmp/B.pteQEh/BUILD/cvsnt-2.5.05.3744/cvsapi/db' make[3]: Entering directory '/tmp/B.pteQEh/BUILD/cvsnt-2.5.05.3744/cvsapi/db' /bin/sh ../../libtool --tag=CXX --mode=compile x86_64-pld-linux-g++ -DHAVE_CONFIG_H -I. -I../.. -I../../src -I../../lib -I../../cvsapi -I/usr/include/libxml2 -I/usr/include/mysql -I/usr/include -O2 -fwrapv -pipe -Wformat -Werror=format-security -gdwarf-4 -fno-debug-types-section -fvar-tracking-assignments -g2 -Wp,-D_FORTIFY_SOURCE=2 -fstack-protector-strong --param=ssp-buffer-size=4 -fPIC -march=x86-64 -gdwarf-4 -fno-debug-types-section -fvar-tracking-assignments -g2 -MT SQLiteConnectionInformation.lo -MD -MP -MF .deps/SQLiteConnectionInformation.Tpo -c -o SQLiteConnectionInformation.lo `test -f 'sqlite/SQLiteConnectionInformation.cpp' || echo './'`sqlite/SQLiteConnectionInformation.cpp libtool: compile: x86_64-pld-linux-g++ -DHAVE_CONFIG_H -I. -I../.. -I../../src -I../../lib -I../../cvsapi -I/usr/include/libxml2 -I/usr/include/mysql -I/usr/include -O2 -fwrapv -pipe -Wformat -Werror=format-security -gdwarf-4 -fno-debug-types-section -fvar-tracking-assignments -g2 -Wp,-D_FORTIFY_SOURCE=2 -fstack-protector-strong --param=ssp-buffer-size=4 -fPIC -march=x86-64 -gdwarf-4 -fno-debug-types-section -fvar-tracking-assignments -g2 -MT SQLiteConnectionInformation.lo -MD -MP -MF .deps/SQLiteConnectionInformation.Tpo -c sqlite/SQLiteConnectionInformation.cpp -fPIC -DPIC -o .libs/SQLiteConnectionInformation.o mv -f .deps/SQLiteConnectionInformation.Tpo .deps/SQLiteConnectionInformation.Plo make[3]: Leaving directory '/tmp/B.pteQEh/BUILD/cvsnt-2.5.05.3744/cvsapi/db' make[3]: Entering directory '/tmp/B.pteQEh/BUILD/cvsnt-2.5.05.3744/cvsapi/db' /bin/sh ../../libtool --tag=CXX --mode=compile x86_64-pld-linux-g++ -DHAVE_CONFIG_H -I. -I../.. -I../../src -I../../lib -I../../cvsapi -I/usr/include/libxml2 -I/usr/include/mysql -I/usr/include -O2 -fwrapv -pipe -Wformat -Werror=format-security -gdwarf-4 -fno-debug-types-section -fvar-tracking-assignments -g2 -Wp,-D_FORTIFY_SOURCE=2 -fstack-protector-strong --param=ssp-buffer-size=4 -fPIC -march=x86-64 -gdwarf-4 -fno-debug-types-section -fvar-tracking-assignments -g2 -MT MySqlRecordset.lo -MD -MP -MF .deps/MySqlRecordset.Tpo -c -o MySqlRecordset.lo `test -f 'mysql/MySqlRecordset.cpp' || echo './'`mysql/MySqlRecordset.cpp libtool: compile: x86_64-pld-linux-g++ -DHAVE_CONFIG_H -I. -I../.. -I../../src -I../../lib -I../../cvsapi -I/usr/include/libxml2 -I/usr/include/mysql -I/usr/include -O2 -fwrapv -pipe -Wformat -Werror=format-security -gdwarf-4 -fno-debug-types-section -fvar-tracking-assignments -g2 -Wp,-D_FORTIFY_SOURCE=2 -fstack-protector-strong --param=ssp-buffer-size=4 -fPIC -march=x86-64 -gdwarf-4 -fno-debug-types-section -fvar-tracking-assignments -g2 -MT MySqlRecordset.lo -MD -MP -MF .deps/MySqlRecordset.Tpo -c mysql/MySqlRecordset.cpp -fPIC -DPIC -o .libs/MySqlRecordset.o mv -f .deps/MySqlRecordset.Tpo .deps/MySqlRecordset.Plo make[3]: Leaving directory '/tmp/B.pteQEh/BUILD/cvsnt-2.5.05.3744/cvsapi/db' make[3]: Entering directory '/tmp/B.pteQEh/BUILD/cvsnt-2.5.05.3744/cvsapi/db' /bin/sh ../../libtool --tag=CXX --mode=compile x86_64-pld-linux-g++ -DHAVE_CONFIG_H -I. -I../.. -I../../src -I../../lib -I../../cvsapi -I/usr/include/libxml2 -I/usr/include/mysql -I/usr/include -O2 -fwrapv -pipe -Wformat -Werror=format-security -gdwarf-4 -fno-debug-types-section -fvar-tracking-assignments -g2 -Wp,-D_FORTIFY_SOURCE=2 -fstack-protector-strong --param=ssp-buffer-size=4 -fPIC -march=x86-64 -gdwarf-4 -fno-debug-types-section -fvar-tracking-assignments -g2 -MT SQLiteConnection.lo -MD -MP -MF .deps/SQLiteConnection.Tpo -c -o SQLiteConnection.lo `test -f 'sqlite/SQLiteConnection.cpp' || echo './'`sqlite/SQLiteConnection.cpp libtool: compile: x86_64-pld-linux-g++ -DHAVE_CONFIG_H -I. -I../.. -I../../src -I../../lib -I../../cvsapi -I/usr/include/libxml2 -I/usr/include/mysql -I/usr/include -O2 -fwrapv -pipe -Wformat -Werror=format-security -gdwarf-4 -fno-debug-types-section -fvar-tracking-assignments -g2 -Wp,-D_FORTIFY_SOURCE=2 -fstack-protector-strong --param=ssp-buffer-size=4 -fPIC -march=x86-64 -gdwarf-4 -fno-debug-types-section -fvar-tracking-assignments -g2 -MT SQLiteConnection.lo -MD -MP -MF .deps/SQLiteConnection.Tpo -c sqlite/SQLiteConnection.cpp -fPIC -DPIC -o .libs/SQLiteConnection.o mv -f .deps/SQLiteConnection.Tpo .deps/SQLiteConnection.Plo make[3]: Leaving directory '/tmp/B.pteQEh/BUILD/cvsnt-2.5.05.3744/cvsapi/db' make[3]: Entering directory '/tmp/B.pteQEh/BUILD/cvsnt-2.5.05.3744/cvsapi/db' /bin/sh ../../libtool --tag=CXX --mode=compile x86_64-pld-linux-g++ -DHAVE_CONFIG_H -I. -I../.. -I../../src -I../../lib -I../../cvsapi -I/usr/include/libxml2 -I/usr/include/mysql -I/usr/include -O2 -fwrapv -pipe -Wformat -Werror=format-security -gdwarf-4 -fno-debug-types-section -fvar-tracking-assignments -g2 -Wp,-D_FORTIFY_SOURCE=2 -fstack-protector-strong --param=ssp-buffer-size=4 -fPIC -march=x86-64 -gdwarf-4 -fno-debug-types-section -fvar-tracking-assignments -g2 -MT MySqlConnection.lo -MD -MP -MF .deps/MySqlConnection.Tpo -c -o MySqlConnection.lo `test -f 'mysql/MySqlConnection.cpp' || echo './'`mysql/MySqlConnection.cpp libtool: compile: x86_64-pld-linux-g++ -DHAVE_CONFIG_H -I. -I../.. -I../../src -I../../lib -I../../cvsapi -I/usr/include/libxml2 -I/usr/include/mysql -I/usr/include -O2 -fwrapv -pipe -Wformat -Werror=format-security -gdwarf-4 -fno-debug-types-section -fvar-tracking-assignments -g2 -Wp,-D_FORTIFY_SOURCE=2 -fstack-protector-strong --param=ssp-buffer-size=4 -fPIC -march=x86-64 -gdwarf-4 -fno-debug-types-section -fvar-tracking-assignments -g2 -MT MySqlConnection.lo -MD -MP -MF .deps/MySqlConnection.Tpo -c mysql/MySqlConnection.cpp -fPIC -DPIC -o .libs/MySqlConnection.o mv -f .deps/MySqlConnection.Tpo .deps/MySqlConnection.Plo make[3]: Leaving directory '/tmp/B.pteQEh/BUILD/cvsnt-2.5.05.3744/cvsapi/db' make[3]: Entering directory '/tmp/B.pteQEh/BUILD/cvsnt-2.5.05.3744/cvsapi/db' /bin/sh ../../libtool --tag=CXX --mode=compile x86_64-pld-linux-g++ -DHAVE_CONFIG_H -I. -I../.. -I../../src -I../../lib -I../../cvsapi -I/usr/include/libxml2 -I/usr/include/mysql -I/usr/include -O2 -fwrapv -pipe -Wformat -Werror=format-security -gdwarf-4 -fno-debug-types-section -fvar-tracking-assignments -g2 -Wp,-D_FORTIFY_SOURCE=2 -fstack-protector-strong --param=ssp-buffer-size=4 -fPIC -march=x86-64 -gdwarf-4 -fno-debug-types-section -fvar-tracking-assignments -g2 -MT SQLiteRecordset.lo -MD -MP -MF .deps/SQLiteRecordset.Tpo -c -o SQLiteRecordset.lo `test -f 'sqlite/SQLiteRecordset.cpp' || echo './'`sqlite/SQLiteRecordset.cpp libtool: compile: x86_64-pld-linux-g++ -DHAVE_CONFIG_H -I. -I../.. -I../../src -I../../lib -I../../cvsapi -I/usr/include/libxml2 -I/usr/include/mysql -I/usr/include -O2 -fwrapv -pipe -Wformat -Werror=format-security -gdwarf-4 -fno-debug-types-section -fvar-tracking-assignments -g2 -Wp,-D_FORTIFY_SOURCE=2 -fstack-protector-strong --param=ssp-buffer-size=4 -fPIC -march=x86-64 -gdwarf-4 -fno-debug-types-section -fvar-tracking-assignments -g2 -MT SQLiteRecordset.lo -MD -MP -MF .deps/SQLiteRecordset.Tpo -c sqlite/SQLiteRecordset.cpp -fPIC -DPIC -o .libs/SQLiteRecordset.o mv -f .deps/SQLiteRecordset.Tpo .deps/SQLiteRecordset.Plo make[3]: Leaving directory '/tmp/B.pteQEh/BUILD/cvsnt-2.5.05.3744/cvsapi/db' make[3]: Entering directory '/tmp/B.pteQEh/BUILD/cvsnt-2.5.05.3744/cvsapi/db' /bin/sh ../../libtool --tag=CXX --mode=compile x86_64-pld-linux-g++ -DHAVE_CONFIG_H -I. -I../.. -I../../src -I../../lib -I../../cvsapi -I/usr/include/libxml2 -I/usr/include/mysql -I/usr/include -O2 -fwrapv -pipe -Wformat -Werror=format-security -gdwarf-4 -fno-debug-types-section -fvar-tracking-assignments -g2 -Wp,-D_FORTIFY_SOURCE=2 -fstack-protector-strong --param=ssp-buffer-size=4 -fPIC -march=x86-64 -gdwarf-4 -fno-debug-types-section -fvar-tracking-assignments -g2 -MT PostgresConnectionInformation.lo -MD -MP -MF .deps/PostgresConnectionInformation.Tpo -c -o PostgresConnectionInformation.lo `test -f 'postgres/PostgresConnectionInformation.cpp' || echo './'`postgres/PostgresConnectionInformation.cpp libtool: compile: x86_64-pld-linux-g++ -DHAVE_CONFIG_H -I. -I../.. -I../../src -I../../lib -I../../cvsapi -I/usr/include/libxml2 -I/usr/include/mysql -I/usr/include -O2 -fwrapv -pipe -Wformat -Werror=format-security -gdwarf-4 -fno-debug-types-section -fvar-tracking-assignments -g2 -Wp,-D_FORTIFY_SOURCE=2 -fstack-protector-strong --param=ssp-buffer-size=4 -fPIC -march=x86-64 -gdwarf-4 -fno-debug-types-section -fvar-tracking-assignments -g2 -MT PostgresConnectionInformation.lo -MD -MP -MF .deps/PostgresConnectionInformation.Tpo -c postgres/PostgresConnectionInformation.cpp -fPIC -DPIC -o .libs/PostgresConnectionInformation.o mv -f .deps/PostgresConnectionInformation.Tpo .deps/PostgresConnectionInformation.Plo make[3]: Leaving directory '/tmp/B.pteQEh/BUILD/cvsnt-2.5.05.3744/cvsapi/db' make[3]: Entering directory '/tmp/B.pteQEh/BUILD/cvsnt-2.5.05.3744/cvsapi/db' /bin/sh ../../libtool --tag=CXX --mode=compile x86_64-pld-linux-g++ -DHAVE_CONFIG_H -I. -I../.. -I../../src -I../../lib -I../../cvsapi -I/usr/include/libxml2 -I/usr/include/mysql -I/usr/include -O2 -fwrapv -pipe -Wformat -Werror=format-security -gdwarf-4 -fno-debug-types-section -fvar-tracking-assignments -g2 -Wp,-D_FORTIFY_SOURCE=2 -fstack-protector-strong --param=ssp-buffer-size=4 -fPIC -march=x86-64 -gdwarf-4 -fno-debug-types-section -fvar-tracking-assignments -g2 -MT PostgresConnection.lo -MD -MP -MF .deps/PostgresConnection.Tpo -c -o PostgresConnection.lo `test -f 'postgres/PostgresConnection.cpp' || echo './'`postgres/PostgresConnection.cpp libtool: compile: x86_64-pld-linux-g++ -DHAVE_CONFIG_H -I. -I../.. -I../../src -I../../lib -I../../cvsapi -I/usr/include/libxml2 -I/usr/include/mysql -I/usr/include -O2 -fwrapv -pipe -Wformat -Werror=format-security -gdwarf-4 -fno-debug-types-section -fvar-tracking-assignments -g2 -Wp,-D_FORTIFY_SOURCE=2 -fstack-protector-strong --param=ssp-buffer-size=4 -fPIC -march=x86-64 -gdwarf-4 -fno-debug-types-section -fvar-tracking-assignments -g2 -MT PostgresConnection.lo -MD -MP -MF .deps/PostgresConnection.Tpo -c postgres/PostgresConnection.cpp -fPIC -DPIC -o .libs/PostgresConnection.o mv -f .deps/PostgresConnection.Tpo .deps/PostgresConnection.Plo make[3]: Leaving directory '/tmp/B.pteQEh/BUILD/cvsnt-2.5.05.3744/cvsapi/db' make[3]: Entering directory '/tmp/B.pteQEh/BUILD/cvsnt-2.5.05.3744/cvsapi/db' /bin/sh ../../libtool --tag=CXX --mode=compile x86_64-pld-linux-g++ -DHAVE_CONFIG_H -I. -I../.. -I../../src -I../../lib -I../../cvsapi -I/usr/include/libxml2 -I/usr/include/mysql -I/usr/include -O2 -fwrapv -pipe -Wformat -Werror=format-security -gdwarf-4 -fno-debug-types-section -fvar-tracking-assignments -g2 -Wp,-D_FORTIFY_SOURCE=2 -fstack-protector-strong --param=ssp-buffer-size=4 -fPIC -march=x86-64 -gdwarf-4 -fno-debug-types-section -fvar-tracking-assignments -g2 -MT PostgresRecordset.lo -MD -MP -MF .deps/PostgresRecordset.Tpo -c -o PostgresRecordset.lo `test -f 'postgres/PostgresRecordset.cpp' || echo './'`postgres/PostgresRecordset.cpp libtool: compile: x86_64-pld-linux-g++ -DHAVE_CONFIG_H -I. -I../.. -I../../src -I../../lib -I../../cvsapi -I/usr/include/libxml2 -I/usr/include/mysql -I/usr/include -O2 -fwrapv -pipe -Wformat -Werror=format-security -gdwarf-4 -fno-debug-types-section -fvar-tracking-assignments -g2 -Wp,-D_FORTIFY_SOURCE=2 -fstack-protector-strong --param=ssp-buffer-size=4 -fPIC -march=x86-64 -gdwarf-4 -fno-debug-types-section -fvar-tracking-assignments -g2 -MT PostgresRecordset.lo -MD -MP -MF .deps/PostgresRecordset.Tpo -c postgres/PostgresRecordset.cpp -fPIC -DPIC -o .libs/PostgresRecordset.o postgres/PostgresRecordset.cpp: In member function 'virtual CPostgresField::operator int()': postgres/PostgresRecordset.cpp:52:65: warning: format '%ld' expects argument of type 'long int*', but argument 3 has type 'int*' [-Wformat=] sscanf(PQgetvalue(rs->m_pStmt,rs->m_current_row,field),"%ld",&r); ~~^ mv -f .deps/PostgresRecordset.Tpo .deps/PostgresRecordset.Plo make[3]: Leaving directory '/tmp/B.pteQEh/BUILD/cvsnt-2.5.05.3744/cvsapi/db' make[3]: Entering directory '/tmp/B.pteQEh/BUILD/cvsnt-2.5.05.3744/cvsapi/db' /bin/sh ../../libtool --tag=CXX --mode=compile x86_64-pld-linux-g++ -DHAVE_CONFIG_H -I. -I../.. -I../../src -I../../lib -I../../cvsapi -I/usr/include/libxml2 -I/usr/include/mysql -I/usr/include -O2 -fwrapv -pipe -Wformat -Werror=format-security -gdwarf-4 -fno-debug-types-section -fvar-tracking-assignments -g2 -Wp,-D_FORTIFY_SOURCE=2 -fstack-protector-strong --param=ssp-buffer-size=4 -fPIC -march=x86-64 -gdwarf-4 -fno-debug-types-section -fvar-tracking-assignments -g2 -MT OdbcConnectionInformation.lo -MD -MP -MF .deps/OdbcConnectionInformation.Tpo -c -o OdbcConnectionInformation.lo `test -f 'odbc/OdbcConnectionInformation.cpp' || echo './'`odbc/OdbcConnectionInformation.cpp libtool: compile: x86_64-pld-linux-g++ -DHAVE_CONFIG_H -I. -I../.. -I../../src -I../../lib -I../../cvsapi -I/usr/include/libxml2 -I/usr/include/mysql -I/usr/include -O2 -fwrapv -pipe -Wformat -Werror=format-security -gdwarf-4 -fno-debug-types-section -fvar-tracking-assignments -g2 -Wp,-D_FORTIFY_SOURCE=2 -fstack-protector-strong --param=ssp-buffer-size=4 -fPIC -march=x86-64 -gdwarf-4 -fno-debug-types-section -fvar-tracking-assignments -g2 -MT OdbcConnectionInformation.lo -MD -MP -MF .deps/OdbcConnectionInformation.Tpo -c odbc/OdbcConnectionInformation.cpp -fPIC -DPIC -o .libs/OdbcConnectionInformation.o mv -f .deps/OdbcConnectionInformation.Tpo .deps/OdbcConnectionInformation.Plo make[3]: Leaving directory '/tmp/B.pteQEh/BUILD/cvsnt-2.5.05.3744/cvsapi/db' make[3]: Entering directory '/tmp/B.pteQEh/BUILD/cvsnt-2.5.05.3744/cvsapi/db' /bin/sh ../../libtool --tag=CXX --mode=link x86_64-pld-linux-g++ -O2 -fwrapv -pipe -Wformat -Werror=format-security -gdwarf-4 -fno-debug-types-section -fvar-tracking-assignments -g2 -Wp,-D_FORTIFY_SOURCE=2 -fstack-protector-strong --param=ssp-buffer-size=4 -fPIC -march=x86-64 -gdwarf-4 -fno-debug-types-section -fvar-tracking-assignments -g2 -module -avoid-version -L//usr/lib64/cvsnt/database -Wl,--as-needed -Wl,--no-copy-dt-needed-entries -Wl,-z,relro -Wl,-z,combreloc -o postgres.la -rpath /usr/lib64/cvsnt/database PostgresConnection.lo PostgresConnectionInformation.lo PostgresRecordset.lo -lpq -L/usr/lib64 -lcrypt -lxml2 -lidn -lresolv libtool: link: x86_64-pld-linux-g++ -fPIC -DPIC -shared -nostdlib -O2 -gdwarf-4 -g2 -fstack-protector-strong -march=x86-64 -gdwarf-4 -g2 -Wl,--as-needed -Wl,--no-copy-dt-needed-entries -Wl,-z -Wl,relro -Wl,-z -Wl,combreloc -pthread /usr/lib64/gcc/x86_64-pld-linux/7.3.0/../../../../lib64/crti.o /usr/lib64/gcc/x86_64-pld-linux/7.3.0/crtbeginS.o .libs/PostgresConnection.o .libs/PostgresConnectionInformation.o .libs/PostgresRecordset.o -L//usr/lib64/cvsnt/database -lpq -L/usr/lib64 -lcrypt /usr/lib64/libxml2.so -ldl -lz /usr/lib64/liblzma.so /usr/lib64/libidn.so -lresolv -L/usr/lib64/gcc/x86_64-pld-linux/7.3.0 -L/usr/lib64/gcc/x86_64-pld-linux/7.3.0/../../../../lib64 -L/lib/../lib64 -L/usr/lib/../lib64 -L/usr/lib64/gcc/x86_64-pld-linux/7.3.0/../../.. /usr/lib64/libstdc++.so -lm -lc -lgcc_s /usr/lib64/gcc/x86_64-pld-linux/7.3.0/crtendS.o /usr/lib64/gcc/x86_64-pld-linux/7.3.0/../../../../lib64/crtn.o -Wl,-soname -Wl,postgres.so -o .libs/postgres.so libtool: link: ( cd ".libs" && rm -f "postgres.la" && ln -s "../postgres.la" "postgres.la" ) make[3]: Leaving directory '/tmp/B.pteQEh/BUILD/cvsnt-2.5.05.3744/cvsapi/db' make[3]: Entering directory '/tmp/B.pteQEh/BUILD/cvsnt-2.5.05.3744/cvsapi/db' /bin/sh ../../libtool --tag=CXX --mode=link x86_64-pld-linux-g++ -O2 -fwrapv -pipe -Wformat -Werror=format-security -gdwarf-4 -fno-debug-types-section -fvar-tracking-assignments -g2 -Wp,-D_FORTIFY_SOURCE=2 -fstack-protector-strong --param=ssp-buffer-size=4 -fPIC -march=x86-64 -gdwarf-4 -fno-debug-types-section -fvar-tracking-assignments -g2 -module -avoid-version -L//usr/lib64/cvsnt/database -Wl,--as-needed -Wl,--no-copy-dt-needed-entries -Wl,-z,relro -Wl,-z,combreloc -o mysql.la -rpath /usr/lib64/cvsnt/database MySqlConnection.lo MySqlConnectionInformation.lo MySqlRecordset.lo -L/usr/lib64 -lmysqlclient -lpthread -lz -lm -lrt -latomic -lssl -lcrypto -ldl -lcrypt -lxml2 -lidn -lresolv libtool: link: x86_64-pld-linux-g++ -fPIC -DPIC -shared -nostdlib -O2 -gdwarf-4 -g2 -fstack-protector-strong -march=x86-64 -gdwarf-4 -g2 -Wl,--as-needed -Wl,--no-copy-dt-needed-entries -Wl,-z -Wl,relro -Wl,-z -Wl,combreloc -pthread /usr/lib64/gcc/x86_64-pld-linux/7.3.0/../../../../lib64/crti.o /usr/lib64/gcc/x86_64-pld-linux/7.3.0/crtbeginS.o .libs/MySqlConnection.o .libs/MySqlConnectionInformation.o .libs/MySqlRecordset.o -L//usr/lib64/cvsnt/database -L/usr/lib64 -lmysqlclient -lpthread -lrt /usr/lib64/libatomic.so -lssl -lcrypto -lcrypt /usr/lib64/libxml2.so -ldl -lz /usr/lib64/liblzma.so /usr/lib64/libidn.so -lresolv -L/usr/lib64/gcc/x86_64-pld-linux/7.3.0 -L/usr/lib64/gcc/x86_64-pld-linux/7.3.0/../../../../lib64 -L/lib/../lib64 -L/usr/lib/../lib64 -L/usr/lib64/gcc/x86_64-pld-linux/7.3.0/../../.. /usr/lib64/libstdc++.so -lm -lc -lgcc_s /usr/lib64/gcc/x86_64-pld-linux/7.3.0/crtendS.o /usr/lib64/gcc/x86_64-pld-linux/7.3.0/../../../../lib64/crtn.o -Wl,-soname -Wl,mysql.so -o .libs/mysql.so libtool: link: ( cd ".libs" && rm -f "mysql.la" && ln -s "../mysql.la" "mysql.la" ) make[3]: Leaving directory '/tmp/B.pteQEh/BUILD/cvsnt-2.5.05.3744/cvsapi/db' make[3]: Entering directory '/tmp/B.pteQEh/BUILD/cvsnt-2.5.05.3744/cvsapi/db' /bin/sh ../../libtool --tag=CXX --mode=link x86_64-pld-linux-g++ -O2 -fwrapv -pipe -Wformat -Werror=format-security -gdwarf-4 -fno-debug-types-section -fvar-tracking-assignments -g2 -Wp,-D_FORTIFY_SOURCE=2 -fstack-protector-strong --param=ssp-buffer-size=4 -fPIC -march=x86-64 -gdwarf-4 -fno-debug-types-section -fvar-tracking-assignments -g2 -module -avoid-version -L//usr/lib64/cvsnt/database -Wl,--as-needed -Wl,--no-copy-dt-needed-entries -Wl,-z,relro -Wl,-z,combreloc -o sqlite.la -rpath /usr/lib64/cvsnt/database SQLiteConnection.lo SQLiteConnectionInformation.lo SQLiteRecordset.lo -lsqlite3 -lcrypt -lxml2 -lidn -lresolv libtool: link: x86_64-pld-linux-g++ -fPIC -DPIC -shared -nostdlib -O2 -gdwarf-4 -g2 -fstack-protector-strong -march=x86-64 -gdwarf-4 -g2 -Wl,--as-needed -Wl,--no-copy-dt-needed-entries -Wl,-z -Wl,relro -Wl,-z -Wl,combreloc -pthread /usr/lib64/gcc/x86_64-pld-linux/7.3.0/../../../../lib64/crti.o /usr/lib64/gcc/x86_64-pld-linux/7.3.0/crtbeginS.o .libs/SQLiteConnection.o .libs/SQLiteConnectionInformation.o .libs/SQLiteRecordset.o -L//usr/lib64/cvsnt/database /usr/lib64/libsqlite3.so -lpthread -lcrypt /usr/lib64/libxml2.so -L/usr/lib64 -ldl -lz /usr/lib64/liblzma.so /usr/lib64/libidn.so -lresolv -L/usr/lib64/gcc/x86_64-pld-linux/7.3.0 -L/usr/lib64/gcc/x86_64-pld-linux/7.3.0/../../../../lib64 -L/lib/../lib64 -L/usr/lib/../lib64 -L/usr/lib64/gcc/x86_64-pld-linux/7.3.0/../../.. /usr/lib64/libstdc++.so -lm -lc -lgcc_s /usr/lib64/gcc/x86_64-pld-linux/7.3.0/crtendS.o /usr/lib64/gcc/x86_64-pld-linux/7.3.0/../../../../lib64/crtn.o -Wl,-soname -Wl,sqlite.so -o .libs/sqlite.so libtool: link: ( cd ".libs" && rm -f "sqlite.la" && ln -s "../sqlite.la" "sqlite.la" ) make[3]: Leaving directory '/tmp/B.pteQEh/BUILD/cvsnt-2.5.05.3744/cvsapi/db' make[3]: Entering directory '/tmp/B.pteQEh/BUILD/cvsnt-2.5.05.3744/cvsapi/db' /bin/sh ../../libtool --tag=CXX --mode=compile x86_64-pld-linux-g++ -DHAVE_CONFIG_H -I. -I../.. -I../../src -I../../lib -I../../cvsapi -I/usr/include/libxml2 -I/usr/include/mysql -I/usr/include -O2 -fwrapv -pipe -Wformat -Werror=format-security -gdwarf-4 -fno-debug-types-section -fvar-tracking-assignments -g2 -Wp,-D_FORTIFY_SOURCE=2 -fstack-protector-strong --param=ssp-buffer-size=4 -fPIC -march=x86-64 -gdwarf-4 -fno-debug-types-section -fvar-tracking-assignments -g2 -MT OdbcRecordset.lo -MD -MP -MF .deps/OdbcRecordset.Tpo -c -o OdbcRecordset.lo `test -f 'odbc/OdbcRecordset.cpp' || echo './'`odbc/OdbcRecordset.cpp libtool: compile: x86_64-pld-linux-g++ -DHAVE_CONFIG_H -I. -I../.. -I../../src -I../../lib -I../../cvsapi -I/usr/include/libxml2 -I/usr/include/mysql -I/usr/include -O2 -fwrapv -pipe -Wformat -Werror=format-security -gdwarf-4 -fno-debug-types-section -fvar-tracking-assignments -g2 -Wp,-D_FORTIFY_SOURCE=2 -fstack-protector-strong --param=ssp-buffer-size=4 -fPIC -march=x86-64 -gdwarf-4 -fno-debug-types-section -fvar-tracking-assignments -g2 -MT OdbcRecordset.lo -MD -MP -MF .deps/OdbcRecordset.Tpo -c odbc/OdbcRecordset.cpp -fPIC -DPIC -o .libs/OdbcRecordset.o mv -f .deps/OdbcRecordset.Tpo .deps/OdbcRecordset.Plo make[3]: Leaving directory '/tmp/B.pteQEh/BUILD/cvsnt-2.5.05.3744/cvsapi/db' make[3]: Entering directory '/tmp/B.pteQEh/BUILD/cvsnt-2.5.05.3744/cvsapi/db' /bin/sh ../../libtool --tag=CXX --mode=compile x86_64-pld-linux-g++ -DHAVE_CONFIG_H -I. -I../.. -I../../src -I../../lib -I../../cvsapi -I/usr/include/libxml2 -I/usr/include/mysql -I/usr/include -O2 -fwrapv -pipe -Wformat -Werror=format-security -gdwarf-4 -fno-debug-types-section -fvar-tracking-assignments -g2 -Wp,-D_FORTIFY_SOURCE=2 -fstack-protector-strong --param=ssp-buffer-size=4 -fPIC -march=x86-64 -gdwarf-4 -fno-debug-types-section -fvar-tracking-assignments -g2 -MT OdbcConnection.lo -MD -MP -MF .deps/OdbcConnection.Tpo -c -o OdbcConnection.lo `test -f 'odbc/OdbcConnection.cpp' || echo './'`odbc/OdbcConnection.cpp libtool: compile: x86_64-pld-linux-g++ -DHAVE_CONFIG_H -I. -I../.. -I../../src -I../../lib -I../../cvsapi -I/usr/include/libxml2 -I/usr/include/mysql -I/usr/include -O2 -fwrapv -pipe -Wformat -Werror=format-security -gdwarf-4 -fno-debug-types-section -fvar-tracking-assignments -g2 -Wp,-D_FORTIFY_SOURCE=2 -fstack-protector-strong --param=ssp-buffer-size=4 -fPIC -march=x86-64 -gdwarf-4 -fno-debug-types-section -fvar-tracking-assignments -g2 -MT OdbcConnection.lo -MD -MP -MF .deps/OdbcConnection.Tpo -c odbc/OdbcConnection.cpp -fPIC -DPIC -o .libs/OdbcConnection.o mv -f .deps/OdbcConnection.Tpo .deps/OdbcConnection.Plo make[3]: Leaving directory '/tmp/B.pteQEh/BUILD/cvsnt-2.5.05.3744/cvsapi/db' make[3]: Entering directory '/tmp/B.pteQEh/BUILD/cvsnt-2.5.05.3744/cvsapi/db' /bin/sh ../../libtool --tag=CXX --mode=link x86_64-pld-linux-g++ -O2 -fwrapv -pipe -Wformat -Werror=format-security -gdwarf-4 -fno-debug-types-section -fvar-tracking-assignments -g2 -Wp,-D_FORTIFY_SOURCE=2 -fstack-protector-strong --param=ssp-buffer-size=4 -fPIC -march=x86-64 -gdwarf-4 -fno-debug-types-section -fvar-tracking-assignments -g2 -module -avoid-version -L//usr/lib64/cvsnt/database -Wl,--as-needed -Wl,--no-copy-dt-needed-entries -Wl,-z,relro -Wl,-z,combreloc -o odbc.la -rpath /usr/lib64/cvsnt/database OdbcConnection.lo OdbcConnectionInformation.lo OdbcRecordset.lo -lodbc -lcrypt -lxml2 -lidn -lresolv libtool: link: x86_64-pld-linux-g++ -fPIC -DPIC -shared -nostdlib -O2 -gdwarf-4 -g2 -fstack-protector-strong -march=x86-64 -gdwarf-4 -g2 -Wl,--as-needed -Wl,--no-copy-dt-needed-entries -Wl,-z -Wl,relro -Wl,-z -Wl,combreloc -pthread /usr/lib64/gcc/x86_64-pld-linux/7.3.0/../../../../lib64/crti.o /usr/lib64/gcc/x86_64-pld-linux/7.3.0/crtbeginS.o .libs/OdbcConnection.o .libs/OdbcConnectionInformation.o .libs/OdbcRecordset.o -L//usr/lib64/cvsnt/database /usr/lib64/libodbc.so -L/usr/lib64 /usr/lib64/libltdl.so -lpthread -lcrypt /usr/lib64/libxml2.so -ldl -lz /usr/lib64/liblzma.so /usr/lib64/libidn.so -lresolv -L/usr/lib64/gcc/x86_64-pld-linux/7.3.0 -L/usr/lib64/gcc/x86_64-pld-linux/7.3.0/../../../../lib64 -L/lib/../lib64 -L/usr/lib/../lib64 -L/usr/lib64/gcc/x86_64-pld-linux/7.3.0/../../.. /usr/lib64/libstdc++.so -lm -lc -lgcc_s /usr/lib64/gcc/x86_64-pld-linux/7.3.0/crtendS.o /usr/lib64/gcc/x86_64-pld-linux/7.3.0/../../../../lib64/crtn.o -Wl,-soname -Wl,odbc.so -o .libs/odbc.so libtool: link: ( cd ".libs" && rm -f "odbc.la" && ln -s "../odbc.la" "odbc.la" ) make[3]: Leaving directory '/tmp/B.pteQEh/BUILD/cvsnt-2.5.05.3744/cvsapi/db' Making all in mdns make[3]: Entering directory '/tmp/B.pteQEh/BUILD/cvsnt-2.5.05.3744/cvsapi/mdns' /bin/sh ../../libtool --tag=CXX --mode=compile x86_64-pld-linux-g++ -DHAVE_CONFIG_H -I. -I../.. -I../../src -I../../lib -I../../cvsapi -I/usr/include/libxml2 -I/usr/include/mysql -I/usr/include -O2 -fwrapv -pipe -Wformat -Werror=format-security -gdwarf-4 -fno-debug-types-section -fvar-tracking-assignments -g2 -Wp,-D_FORTIFY_SOURCE=2 -fstack-protector-strong --param=ssp-buffer-size=4 -fPIC -march=x86-64 -gdwarf-4 -fno-debug-types-section -fvar-tracking-assignments -g2 -MT mdns_apple.lo -MD -MP -MF .deps/mdns_apple.Tpo -c -o mdns_apple.lo `test -f 'apple/mdns_apple.cpp' || echo './'`apple/mdns_apple.cpp libtool: compile: x86_64-pld-linux-g++ -DHAVE_CONFIG_H -I. -I../.. -I../../src -I../../lib -I../../cvsapi -I/usr/include/libxml2 -I/usr/include/mysql -I/usr/include -O2 -fwrapv -pipe -Wformat -Werror=format-security -gdwarf-4 -fno-debug-types-section -fvar-tracking-assignments -g2 -Wp,-D_FORTIFY_SOURCE=2 -fstack-protector-strong --param=ssp-buffer-size=4 -fPIC -march=x86-64 -gdwarf-4 -fno-debug-types-section -fvar-tracking-assignments -g2 -MT mdns_apple.lo -MD -MP -MF .deps/mdns_apple.Tpo -c apple/mdns_apple.cpp -fPIC -DPIC -o .libs/mdns_apple.o apple/mdns_apple.cpp: In member function 'void CMdnsHelperApple::browse_reply(DNSServiceRef, DNSServiceFlags, uint32_t, DNSServiceErrorType, const char*, const char*, const char*)': apple/mdns_apple.cpp:123:15: warning: converting to non-pointer type 'int' from NULL [-Wconversion-null] socket = NULL; ^~~~ apple/mdns_apple.cpp:127:15: warning: converting to non-pointer type 'int' from NULL [-Wconversion-null] socket = NULL; ^~~~ apple/mdns_apple.cpp:140:16: warning: converting to non-pointer type 'int' from NULL [-Wconversion-null] socket = NULL; ^~~~ apple/mdns_apple.cpp:146:17: warning: converting to non-pointer type 'int' from NULL [-Wconversion-null] socket2 = NULL; ^~~~ mv -f .deps/mdns_apple.Tpo .deps/mdns_apple.Plo make[3]: Leaving directory '/tmp/B.pteQEh/BUILD/cvsnt-2.5.05.3744/cvsapi/mdns' make[3]: Entering directory '/tmp/B.pteQEh/BUILD/cvsnt-2.5.05.3744/cvsapi/mdns' /bin/sh ../../libtool --tag=CXX --mode=compile x86_64-pld-linux-g++ -DHAVE_CONFIG_H -I. -I../.. -I../../src -I../../lib -I../../cvsapi -I/usr/include/libxml2 -I/usr/include/mysql -I/usr/include -O2 -fwrapv -pipe -Wformat -Werror=format-security -gdwarf-4 -fno-debug-types-section -fvar-tracking-assignments -g2 -Wp,-D_FORTIFY_SOURCE=2 -fstack-protector-strong --param=ssp-buffer-size=4 -fPIC -march=x86-64 -gdwarf-4 -fno-debug-types-section -fvar-tracking-assignments -g2 -MT mdns_mini.lo -MD -MP -MF .deps/mdns_mini.Tpo -c -o mdns_mini.lo `test -f 'mini/mdns_mini.cpp' || echo './'`mini/mdns_mini.cpp libtool: compile: x86_64-pld-linux-g++ -DHAVE_CONFIG_H -I. -I../.. -I../../src -I../../lib -I../../cvsapi -I/usr/include/libxml2 -I/usr/include/mysql -I/usr/include -O2 -fwrapv -pipe -Wformat -Werror=format-security -gdwarf-4 -fno-debug-types-section -fvar-tracking-assignments -g2 -Wp,-D_FORTIFY_SOURCE=2 -fstack-protector-strong --param=ssp-buffer-size=4 -fPIC -march=x86-64 -gdwarf-4 -fno-debug-types-section -fvar-tracking-assignments -g2 -MT mdns_mini.lo -MD -MP -MF .deps/mdns_mini.Tpo -c mini/mdns_mini.cpp -fPIC -DPIC -o .libs/mdns_mini.o mv -f .deps/mdns_mini.Tpo .deps/mdns_mini.Plo make[3]: Leaving directory '/tmp/B.pteQEh/BUILD/cvsnt-2.5.05.3744/cvsapi/mdns' make[3]: Entering directory '/tmp/B.pteQEh/BUILD/cvsnt-2.5.05.3744/cvsapi/mdns' /bin/sh ../../libtool --tag=CXX --mode=link x86_64-pld-linux-g++ -O2 -fwrapv -pipe -Wformat -Werror=format-security -gdwarf-4 -fno-debug-types-section -fvar-tracking-assignments -g2 -Wp,-D_FORTIFY_SOURCE=2 -fstack-protector-strong --param=ssp-buffer-size=4 -fPIC -march=x86-64 -gdwarf-4 -fno-debug-types-section -fvar-tracking-assignments -g2 -module -avoid-version -L//usr/lib64/cvsnt/mdns -Wl,--as-needed -Wl,--no-copy-dt-needed-entries -Wl,-z,relro -Wl,-z,combreloc -o apple.la -rpath /usr/lib64/cvsnt/mdns mdns_apple.lo -ldns_sd -lcrypt -lxml2 -lidn -lresolv libtool: link: x86_64-pld-linux-g++ -fPIC -DPIC -shared -nostdlib -O2 -gdwarf-4 -g2 -fstack-protector-strong -march=x86-64 -gdwarf-4 -g2 -Wl,--as-needed -Wl,--no-copy-dt-needed-entries -Wl,-z -Wl,relro -Wl,-z -Wl,combreloc -pthread /usr/lib64/gcc/x86_64-pld-linux/7.3.0/../../../../lib64/crti.o /usr/lib64/gcc/x86_64-pld-linux/7.3.0/crtbeginS.o .libs/mdns_apple.o -L//usr/lib64/cvsnt/mdns -ldns_sd -lcrypt /usr/lib64/libxml2.so -L/usr/lib64 -ldl -lz /usr/lib64/liblzma.so /usr/lib64/libidn.so -lresolv -L/usr/lib64/gcc/x86_64-pld-linux/7.3.0 -L/usr/lib64/gcc/x86_64-pld-linux/7.3.0/../../../../lib64 -L/lib/../lib64 -L/usr/lib/../lib64 -L/usr/lib64/gcc/x86_64-pld-linux/7.3.0/../../.. /usr/lib64/libstdc++.so -lm -lc -lgcc_s /usr/lib64/gcc/x86_64-pld-linux/7.3.0/crtendS.o /usr/lib64/gcc/x86_64-pld-linux/7.3.0/../../../../lib64/crtn.o -Wl,-soname -Wl,apple.so -o .libs/apple.so libtool: link: ( cd ".libs" && rm -f "apple.la" && ln -s "../apple.la" "apple.la" ) make[3]: Leaving directory '/tmp/B.pteQEh/BUILD/cvsnt-2.5.05.3744/cvsapi/mdns' make[3]: Entering directory '/tmp/B.pteQEh/BUILD/cvsnt-2.5.05.3744/cvsapi/mdns' /bin/sh ../../libtool --tag=CXX --mode=link x86_64-pld-linux-g++ -O2 -fwrapv -pipe -Wformat -Werror=format-security -gdwarf-4 -fno-debug-types-section -fvar-tracking-assignments -g2 -Wp,-D_FORTIFY_SOURCE=2 -fstack-protector-strong --param=ssp-buffer-size=4 -fPIC -march=x86-64 -gdwarf-4 -fno-debug-types-section -fvar-tracking-assignments -g2 -module -avoid-version -L//usr/lib64/cvsnt/mdns -Wl,--as-needed -Wl,--no-copy-dt-needed-entries -Wl,-z,relro -Wl,-z,combreloc -o mini.la -rpath /usr/lib64/cvsnt/mdns mdns_mini.lo ../../mdnsclient/libmdnsclient.la -lcrypt -lxml2 -lidn -lresolv libtool: link: x86_64-pld-linux-g++ -fPIC -DPIC -shared -nostdlib -O2 -gdwarf-4 -g2 -fstack-protector-strong -march=x86-64 -gdwarf-4 -g2 -Wl,--as-needed -Wl,--no-copy-dt-needed-entries -Wl,-z -Wl,relro -Wl,-z -Wl,combreloc -pthread /usr/lib64/gcc/x86_64-pld-linux/7.3.0/../../../../lib64/crti.o /usr/lib64/gcc/x86_64-pld-linux/7.3.0/crtbeginS.o .libs/mdns_mini.o -Wl,-rpath -Wl,/tmp/B.pteQEh/BUILD/cvsnt-2.5.05.3744/mdnsclient/.libs -L//usr/lib64/cvsnt/mdns ../../mdnsclient/.libs/libmdnsclient.so -L/usr/lib64 -lcrypt /usr/lib64/libxml2.so -ldl -lz /usr/lib64/liblzma.so /usr/lib64/libidn.so -lresolv -L/usr/lib64/gcc/x86_64-pld-linux/7.3.0 -L/usr/lib64/gcc/x86_64-pld-linux/7.3.0/../../../../lib64 -L/lib/../lib64 -L/usr/lib/../lib64 -L/usr/lib64/gcc/x86_64-pld-linux/7.3.0/../../.. /usr/lib64/libstdc++.so -lm -lc -lgcc_s /usr/lib64/gcc/x86_64-pld-linux/7.3.0/crtendS.o /usr/lib64/gcc/x86_64-pld-linux/7.3.0/../../../../lib64/crtn.o -Wl,-soname -Wl,mini.so -o .libs/mini.so libtool: link: ( cd ".libs" && rm -f "mini.la" && ln -s "../mini.la" "mini.la" ) make[3]: Leaving directory '/tmp/B.pteQEh/BUILD/cvsnt-2.5.05.3744/cvsapi/mdns' make[3]: Entering directory '/tmp/B.pteQEh/BUILD/cvsnt-2.5.05.3744/cvsapi' /bin/sh ../libtool --tag=CXX --mode=compile x86_64-pld-linux-g++ -DHAVE_CONFIG_H -I. -I.. -I../src -I../lib -D_CVSAPI -I/usr/include/libxml2 -I/usr/include/mysql -I/usr/include -O2 -fwrapv -pipe -Wformat -Werror=format-security -gdwarf-4 -fno-debug-types-section -fvar-tracking-assignments -g2 -Wp,-D_FORTIFY_SOURCE=2 -fstack-protector-strong --param=ssp-buffer-size=4 -fPIC -march=x86-64 -gdwarf-4 -fno-debug-types-section -fvar-tracking-assignments -g2 -MT crypt.lo -MD -MP -MF .deps/crypt.Tpo -c -o crypt.lo crypt.cpp libtool: compile: x86_64-pld-linux-g++ -DHAVE_CONFIG_H -I. -I.. -I../src -I../lib -D_CVSAPI -I/usr/include/libxml2 -I/usr/include/mysql -I/usr/include -O2 -fwrapv -pipe -Wformat -Werror=format-security -gdwarf-4 -fno-debug-types-section -fvar-tracking-assignments -g2 -Wp,-D_FORTIFY_SOURCE=2 -fstack-protector-strong --param=ssp-buffer-size=4 -fPIC -march=x86-64 -gdwarf-4 -fno-debug-types-section -fvar-tracking-assignments -g2 -MT crypt.lo -MD -MP -MF .deps/crypt.Tpo -c crypt.cpp -fPIC -DPIC -o .libs/crypt.o mv -f .deps/crypt.Tpo .deps/crypt.Plo make[3]: Leaving directory '/tmp/B.pteQEh/BUILD/cvsnt-2.5.05.3744/cvsapi' make[3]: Entering directory '/tmp/B.pteQEh/BUILD/cvsnt-2.5.05.3744/cvsapi' /bin/sh ../libtool --tag=CXX --mode=compile x86_64-pld-linux-g++ -DHAVE_CONFIG_H -I. -I.. -I../src -I../lib -D_CVSAPI -I/usr/include/libxml2 -I/usr/include/mysql -I/usr/include -O2 -fwrapv -pipe -Wformat -Werror=format-security -gdwarf-4 -fno-debug-types-section -fvar-tracking-assignments -g2 -Wp,-D_FORTIFY_SOURCE=2 -fstack-protector-strong --param=ssp-buffer-size=4 -fPIC -march=x86-64 -gdwarf-4 -fno-debug-types-section -fvar-tracking-assignments -g2 -MT Codepage.lo -MD -MP -MF .deps/Codepage.Tpo -c -o Codepage.lo Codepage.cpp libtool: compile: x86_64-pld-linux-g++ -DHAVE_CONFIG_H -I. -I.. -I../src -I../lib -D_CVSAPI -I/usr/include/libxml2 -I/usr/include/mysql -I/usr/include -O2 -fwrapv -pipe -Wformat -Werror=format-security -gdwarf-4 -fno-debug-types-section -fvar-tracking-assignments -g2 -Wp,-D_FORTIFY_SOURCE=2 -fstack-protector-strong --param=ssp-buffer-size=4 -fPIC -march=x86-64 -gdwarf-4 -fno-debug-types-section -fvar-tracking-assignments -g2 -MT Codepage.lo -MD -MP -MF .deps/Codepage.Tpo -c Codepage.cpp -fPIC -DPIC -o .libs/Codepage.o mv -f .deps/Codepage.Tpo .deps/Codepage.Plo make[3]: Leaving directory '/tmp/B.pteQEh/BUILD/cvsnt-2.5.05.3744/cvsapi' make[3]: Entering directory '/tmp/B.pteQEh/BUILD/cvsnt-2.5.05.3744/cvsapi' /bin/sh ../libtool --tag=CXX --mode=compile x86_64-pld-linux-g++ -DHAVE_CONFIG_H -I. -I.. -I../src -I../lib -D_CVSAPI -I/usr/include/libxml2 -I/usr/include/mysql -I/usr/include -O2 -fwrapv -pipe -Wformat -Werror=format-security -gdwarf-4 -fno-debug-types-section -fvar-tracking-assignments -g2 -Wp,-D_FORTIFY_SOURCE=2 -fstack-protector-strong --param=ssp-buffer-size=4 -fPIC -march=x86-64 -gdwarf-4 -fno-debug-types-section -fvar-tracking-assignments -g2 -MT md5calc.lo -MD -MP -MF .deps/md5calc.Tpo -c -o md5calc.lo md5calc.cpp libtool: compile: x86_64-pld-linux-g++ -DHAVE_CONFIG_H -I. -I.. -I../src -I../lib -D_CVSAPI -I/usr/include/libxml2 -I/usr/include/mysql -I/usr/include -O2 -fwrapv -pipe -Wformat -Werror=format-security -gdwarf-4 -fno-debug-types-section -fvar-tracking-assignments -g2 -Wp,-D_FORTIFY_SOURCE=2 -fstack-protector-strong --param=ssp-buffer-size=4 -fPIC -march=x86-64 -gdwarf-4 -fno-debug-types-section -fvar-tracking-assignments -g2 -MT md5calc.lo -MD -MP -MF .deps/md5calc.Tpo -c md5calc.cpp -fPIC -DPIC -o .libs/md5calc.o mv -f .deps/md5calc.Tpo .deps/md5calc.Plo make[3]: Leaving directory '/tmp/B.pteQEh/BUILD/cvsnt-2.5.05.3744/cvsapi' make[3]: Entering directory '/tmp/B.pteQEh/BUILD/cvsnt-2.5.05.3744/cvsapi' /bin/sh ../libtool --tag=CXX --mode=compile x86_64-pld-linux-g++ -DHAVE_CONFIG_H -I. -I.. -I../src -I../lib -D_CVSAPI -I/usr/include/libxml2 -I/usr/include/mysql -I/usr/include -O2 -fwrapv -pipe -Wformat -Werror=format-security -gdwarf-4 -fno-debug-types-section -fvar-tracking-assignments -g2 -Wp,-D_FORTIFY_SOURCE=2 -fstack-protector-strong --param=ssp-buffer-size=4 -fPIC -march=x86-64 -gdwarf-4 -fno-debug-types-section -fvar-tracking-assignments -g2 -MT StringDiff.lo -MD -MP -MF .deps/StringDiff.Tpo -c -o StringDiff.lo `test -f 'diff/StringDiff.cpp' || echo './'`diff/StringDiff.cpp libtool: compile: x86_64-pld-linux-g++ -DHAVE_CONFIG_H -I. -I.. -I../src -I../lib -D_CVSAPI -I/usr/include/libxml2 -I/usr/include/mysql -I/usr/include -O2 -fwrapv -pipe -Wformat -Werror=format-security -gdwarf-4 -fno-debug-types-section -fvar-tracking-assignments -g2 -Wp,-D_FORTIFY_SOURCE=2 -fstack-protector-strong --param=ssp-buffer-size=4 -fPIC -march=x86-64 -gdwarf-4 -fno-debug-types-section -fvar-tracking-assignments -g2 -MT StringDiff.lo -MD -MP -MF .deps/StringDiff.Tpo -c diff/StringDiff.cpp -fPIC -DPIC -o .libs/StringDiff.o mv -f .deps/StringDiff.Tpo .deps/StringDiff.Plo make[3]: Leaving directory '/tmp/B.pteQEh/BUILD/cvsnt-2.5.05.3744/cvsapi' make[3]: Entering directory '/tmp/B.pteQEh/BUILD/cvsnt-2.5.05.3744/cvsapi' /bin/sh ../libtool --tag=CXX --mode=compile x86_64-pld-linux-g++ -DHAVE_CONFIG_H -I. -I.. -I../src -I../lib -D_CVSAPI -I/usr/include/libxml2 -I/usr/include/mysql -I/usr/include -O2 -fwrapv -pipe -Wformat -Werror=format-security -gdwarf-4 -fno-debug-types-section -fvar-tracking-assignments -g2 -Wp,-D_FORTIFY_SOURCE=2 -fstack-protector-strong --param=ssp-buffer-size=4 -fPIC -march=x86-64 -gdwarf-4 -fno-debug-types-section -fvar-tracking-assignments -g2 -MT DiffBase.lo -MD -MP -MF .deps/DiffBase.Tpo -c -o DiffBase.lo `test -f 'diff/DiffBase.cpp' || echo './'`diff/DiffBase.cpp libtool: compile: x86_64-pld-linux-g++ -DHAVE_CONFIG_H -I. -I.. -I../src -I../lib -D_CVSAPI -I/usr/include/libxml2 -I/usr/include/mysql -I/usr/include -O2 -fwrapv -pipe -Wformat -Werror=format-security -gdwarf-4 -fno-debug-types-section -fvar-tracking-assignments -g2 -Wp,-D_FORTIFY_SOURCE=2 -fstack-protector-strong --param=ssp-buffer-size=4 -fPIC -march=x86-64 -gdwarf-4 -fno-debug-types-section -fvar-tracking-assignments -g2 -MT DiffBase.lo -MD -MP -MF .deps/DiffBase.Tpo -c diff/DiffBase.cpp -fPIC -DPIC -o .libs/DiffBase.o mv -f .deps/DiffBase.Tpo .deps/DiffBase.Plo make[3]: Leaving directory '/tmp/B.pteQEh/BUILD/cvsnt-2.5.05.3744/cvsapi' make[3]: Entering directory '/tmp/B.pteQEh/BUILD/cvsnt-2.5.05.3744/cvsapi' /bin/sh ../libtool --tag=CXX --mode=compile x86_64-pld-linux-g++ -DHAVE_CONFIG_H -I. -I.. -I../src -I../lib -D_CVSAPI -I/usr/include/libxml2 -I/usr/include/mysql -I/usr/include -O2 -fwrapv -pipe -Wformat -Werror=format-security -gdwarf-4 -fno-debug-types-section -fvar-tracking-assignments -g2 -Wp,-D_FORTIFY_SOURCE=2 -fstack-protector-strong --param=ssp-buffer-size=4 -fPIC -march=x86-64 -gdwarf-4 -fno-debug-types-section -fvar-tracking-assignments -g2 -MT mdns.lo -MD -MP -MF .deps/mdns.Tpo -c -o mdns.lo mdns.cpp libtool: compile: x86_64-pld-linux-g++ -DHAVE_CONFIG_H -I. -I.. -I../src -I../lib -D_CVSAPI -I/usr/include/libxml2 -I/usr/include/mysql -I/usr/include -O2 -fwrapv -pipe -Wformat -Werror=format-security -gdwarf-4 -fno-debug-types-section -fvar-tracking-assignments -g2 -Wp,-D_FORTIFY_SOURCE=2 -fstack-protector-strong --param=ssp-buffer-size=4 -fPIC -march=x86-64 -gdwarf-4 -fno-debug-types-section -fvar-tracking-assignments -g2 -MT mdns.lo -MD -MP -MF .deps/mdns.Tpo -c mdns.cpp -fPIC -DPIC -o .libs/mdns.o mdns.cpp: In static member function 'static CMdnsHelperBase* CMdnsHelperBase::CreateHelper(const char*, const char*)': mdns.cpp:38:10: error: cannot convert 'bool' to 'CMdnsHelperBase*' in return return false; ^~~~~ make[3]: *** [Makefile:769: mdns.lo] Error 1 make[3]: Leaving directory '/tmp/B.pteQEh/BUILD/cvsnt-2.5.05.3744/cvsapi' make[3]: *** Waiting for unfinished jobs.... make[3]: Entering directory '/tmp/B.pteQEh/BUILD/cvsnt-2.5.05.3744/cvsapi' /bin/sh ../libtool --tag=CXX --mode=compile x86_64-pld-linux-g++ -DHAVE_CONFIG_H -I. -I.. -I../src -I../lib -D_CVSAPI -I/usr/include/libxml2 -I/usr/include/mysql -I/usr/include -O2 -fwrapv -pipe -Wformat -Werror=format-security -gdwarf-4 -fno-debug-types-section -fvar-tracking-assignments -g2 -Wp,-D_FORTIFY_SOURCE=2 -fstack-protector-strong --param=ssp-buffer-size=4 -fPIC -march=x86-64 -gdwarf-4 -fno-debug-types-section -fvar-tracking-assignments -g2 -MT GetOptions.lo -MD -MP -MF .deps/GetOptions.Tpo -c -o GetOptions.lo GetOptions.cpp libtool: compile: x86_64-pld-linux-g++ -DHAVE_CONFIG_H -I. -I.. -I../src -I../lib -D_CVSAPI -I/usr/include/libxml2 -I/usr/include/mysql -I/usr/include -O2 -fwrapv -pipe -Wformat -Werror=format-security -gdwarf-4 -fno-debug-types-section -fvar-tracking-assignments -g2 -Wp,-D_FORTIFY_SOURCE=2 -fstack-protector-strong --param=ssp-buffer-size=4 -fPIC -march=x86-64 -gdwarf-4 -fno-debug-types-section -fvar-tracking-assignments -g2 -MT GetOptions.lo -MD -MP -MF .deps/GetOptions.Tpo -c GetOptions.cpp -fPIC -DPIC -o .libs/GetOptions.o mv -f .deps/GetOptions.Tpo .deps/GetOptions.Plo make[3]: Leaving directory '/tmp/B.pteQEh/BUILD/cvsnt-2.5.05.3744/cvsapi' make[3]: Entering directory '/tmp/B.pteQEh/BUILD/cvsnt-2.5.05.3744/cvsapi' /bin/sh ../libtool --tag=CXX --mode=compile x86_64-pld-linux-g++ -DHAVE_CONFIG_H -I. -I.. -I../src -I../lib -D_CVSAPI -I/usr/include/libxml2 -I/usr/include/mysql -I/usr/include -O2 -fwrapv -pipe -Wformat -Werror=format-security -gdwarf-4 -fno-debug-types-section -fvar-tracking-assignments -g2 -Wp,-D_FORTIFY_SOURCE=2 -fstack-protector-strong --param=ssp-buffer-size=4 -fPIC -march=x86-64 -gdwarf-4 -fno-debug-types-section -fvar-tracking-assignments -g2 -MT ServerIO.lo -MD -MP -MF .deps/ServerIO.Tpo -c -o ServerIO.lo ServerIO.cpp libtool: compile: x86_64-pld-linux-g++ -DHAVE_CONFIG_H -I. -I.. -I../src -I../lib -D_CVSAPI -I/usr/include/libxml2 -I/usr/include/mysql -I/usr/include -O2 -fwrapv -pipe -Wformat -Werror=format-security -gdwarf-4 -fno-debug-types-section -fvar-tracking-assignments -g2 -Wp,-D_FORTIFY_SOURCE=2 -fstack-protector-strong --param=ssp-buffer-size=4 -fPIC -march=x86-64 -gdwarf-4 -fno-debug-types-section -fvar-tracking-assignments -g2 -MT ServerIO.lo -MD -MP -MF .deps/ServerIO.Tpo -c ServerIO.cpp -fPIC -DPIC -o .libs/ServerIO.o ServerIO.cpp: In static member function 'static int CServerIo::default_output(const char*, size_t)': ServerIO.cpp:111:36: warning: field width specifier '*' expects argument of type 'int', but argument 2 has type 'size_t {aka long unsigned int}' [-Wformat=] return printf("%-*.*s",len,len,str); ^ ServerIO.cpp:111:36: warning: field precision specifier '.*' expects argument of type 'int', but argument 3 has type 'size_t {aka long unsigned int}' [-Wformat=] mv -f .deps/ServerIO.Tpo .deps/ServerIO.Plo make[3]: Leaving directory '/tmp/B.pteQEh/BUILD/cvsnt-2.5.05.3744/cvsapi' make[3]: Entering directory '/tmp/B.pteQEh/BUILD/cvsnt-2.5.05.3744/cvsapi' /bin/sh ../libtool --tag=CXX --mode=compile x86_64-pld-linux-g++ -DHAVE_CONFIG_H -I. -I.. -I../src -I../lib -D_CVSAPI -I/usr/include/libxml2 -I/usr/include/mysql -I/usr/include -O2 -fwrapv -pipe -Wformat -Werror=format-security -gdwarf-4 -fno-debug-types-section -fvar-tracking-assignments -g2 -Wp,-D_FORTIFY_SOURCE=2 -fstack-protector-strong --param=ssp-buffer-size=4 -fPIC -march=x86-64 -gdwarf-4 -fno-debug-types-section -fvar-tracking-assignments -g2 -MT rpcBase.lo -MD -MP -MF .deps/rpcBase.Tpo -c -o rpcBase.lo rpcBase.cpp libtool: compile: x86_64-pld-linux-g++ -DHAVE_CONFIG_H -I. -I.. -I../src -I../lib -D_CVSAPI -I/usr/include/libxml2 -I/usr/include/mysql -I/usr/include -O2 -fwrapv -pipe -Wformat -Werror=format-security -gdwarf-4 -fno-debug-types-section -fvar-tracking-assignments -g2 -Wp,-D_FORTIFY_SOURCE=2 -fstack-protector-strong --param=ssp-buffer-size=4 -fPIC -march=x86-64 -gdwarf-4 -fno-debug-types-section -fvar-tracking-assignments -g2 -MT rpcBase.lo -MD -MP -MF .deps/rpcBase.Tpo -c rpcBase.cpp -fPIC -DPIC -o .libs/rpcBase.o mv -f .deps/rpcBase.Tpo .deps/rpcBase.Plo make[3]: Leaving directory '/tmp/B.pteQEh/BUILD/cvsnt-2.5.05.3744/cvsapi' make[3]: Entering directory '/tmp/B.pteQEh/BUILD/cvsnt-2.5.05.3744/cvsapi' /bin/sh ../libtool --tag=CXX --mode=compile x86_64-pld-linux-g++ -DHAVE_CONFIG_H -I. -I.. -I../src -I../lib -D_CVSAPI -I/usr/include/libxml2 -I/usr/include/mysql -I/usr/include -O2 -fwrapv -pipe -Wformat -Werror=format-security -gdwarf-4 -fno-debug-types-section -fvar-tracking-assignments -g2 -Wp,-D_FORTIFY_SOURCE=2 -fstack-protector-strong --param=ssp-buffer-size=4 -fPIC -march=x86-64 -gdwarf-4 -fno-debug-types-section -fvar-tracking-assignments -g2 -MT cvs_string.lo -MD -MP -MF .deps/cvs_string.Tpo -c -o cvs_string.lo cvs_string.cpp libtool: compile: x86_64-pld-linux-g++ -DHAVE_CONFIG_H -I. -I.. -I../src -I../lib -D_CVSAPI -I/usr/include/libxml2 -I/usr/include/mysql -I/usr/include -O2 -fwrapv -pipe -Wformat -Werror=format-security -gdwarf-4 -fno-debug-types-section -fvar-tracking-assignments -g2 -Wp,-D_FORTIFY_SOURCE=2 -fstack-protector-strong --param=ssp-buffer-size=4 -fPIC -march=x86-64 -gdwarf-4 -fno-debug-types-section -fvar-tracking-assignments -g2 -MT cvs_string.lo -MD -MP -MF .deps/cvs_string.Tpo -c cvs_string.cpp -fPIC -DPIC -o .libs/cvs_string.o mv -f .deps/cvs_string.Tpo .deps/cvs_string.Plo make[3]: Leaving directory '/tmp/B.pteQEh/BUILD/cvsnt-2.5.05.3744/cvsapi' make[2]: *** [Makefile:865: all-recursive] Error 1 make[1]: *** [Makefile:480: all-recursive] Error 1 make: *** [Makefile:410: all] Error 2 error: Bad exit status from /tmp/B.pteQEh/BUILD/tmp/rpm-tmp.90932 (%build) RPM build errors: Bad exit status from /tmp/B.pteQEh/BUILD/tmp/rpm-tmp.90932 (%build) ended at: Wed Mar 7 10:58:46 2018, done in 0:00:36.813360 error: No files produced. mesg: ttyname failed: Inappropriate ioctl for device + chmod -R u+rwX /tmp/B.pteQEh/BUILD + rm -rf /tmp/B.pteQEh/tmp /tmp/B.pteQEh/BUILD mesg: ttyname failed: Inappropriate ioctl for device + rm -rf /tmp/B.pteQEh Begin-PLD-Builder-Info Build-Time: user:39.20s sys:6.66s real:40.03s (faults io:0 non-io:3541605) End-PLD-Builder-Info
[Back to list of logs] [View rpm -qa of builder]