FailedOk

th/SRPMS[OK]
th/x32[OK]
th/i686[OK]
th/x86_64[OK]

ac/SRPMS[OK]
ac/i386[OK]
ac/i586[OK]
ac/i686[OK]
ac/alpha[OK]
ac/amd64[OK]
ac/athlon[OK]
ac/ppc[OK]
ac/sparc[OK]
ac/sparc64[OK]

Advanced Search
main()
Powered by PLD Linux
(c) 2002-2019 PLD Team
$Revision: 1.37 $
Powered by x-files.
Your IP: 35.175.191.72

ddd 51beae65-c384-47ed-bdfb-f7b69f663941

Status:Failed
Source URL:ftp://buildlogs.pld-linux.org/th/x86_64/FAIL/ddd,51beae65-c384-47ed-bdfb-f7b69f663941.bz2
text/plain URL:View!
full text:View!
rpm -qa of builder:View!
Date:2019/10/19 00:35:56
Runtime:0:00:30.658230

Toc:

  • error 1
  • strclass.h:813:19: error: friend declaration of 'string common_prefix(const string&, const string&, int)' specifies default arguments and isn't a definition [-fpermissive]
  • error 2
  • strclass.h:815:19: error: friend declaration of 'string common_suffix(const string&, const string&, int)' specifies default arguments and isn't a definition [-fpermissive]
  • error 3
  • strclass.h:866:16: error: friend declaration of 'int readline(std::istream&, string&, char, int)' specifies default arguments and isn't a definition [-fpermissive]
  • error 4
  • make[2]: *** [Makefile:2365: cwd.o] Error 1
  • error 5
  • strclass.h:813:19: error: friend declaration of 'string common_prefix(const string&, const string&, int)' specifies default arguments and isn't a definition [-fpermissive]
  • error 6
  • strclass.h:815:19: error: friend declaration of 'string common_suffix(const string&, const string&, int)' specifies default arguments and isn't a definition [-fpermissive]
  • error 7
  • strclass.h:866:16: error: friend declaration of 'int readline(std::istream&, string&, char, int)' specifies default arguments and isn't a definition [-fpermissive]
  • error 8
  • make[2]: *** [Makefile:2365: cook.o] Error 1
  • error 9
  • strclass.h:813:19: error: friend declaration of 'string common_prefix(const string&, const string&, int)' specifies default arguments and isn't a definition [-fpermissive]
  • error 10
  • strclass.h:815:19: error: friend declaration of 'string common_suffix(const string&, const string&, int)' specifies default arguments and isn't a definition [-fpermissive]
  • error 11
  • strclass.h:866:16: error: friend declaration of 'int readline(std::istream&, string&, char, int)' specifies default arguments and isn't a definition [-fpermissive]
  • error 12
  • make[2]: *** [Makefile:2365: home.o] Error 1
  • error 13
  • strclass.h:813:19: error: friend declaration of 'string common_prefix(const string&, const string&, int)' specifies default arguments and isn't a definition [-fpermissive]
  • error 14
  • strclass.h:815:19: error: friend declaration of 'string common_suffix(const string&, const string&, int)' specifies default arguments and isn't a definition [-fpermissive]
  • error 15
  • strclass.h:866:16: error: friend declaration of 'int readline(std::istream&, string&, char, int)' specifies default arguments and isn't a definition [-fpermissive]
  • error 16
  • strclass.C:1484:8: error: friend declaration of 'string common_prefix(const string&, const string&, int)' specifies default arguments and isn't the only declaration [-fpermissive]
  • error 17
  • strclass.C:1504:8: error: friend declaration of 'string common_suffix(const string&, const string&, int)' specifies default arguments and isn't the only declaration [-fpermissive]
  • error 18
  • strclass.C:1566:5: error: friend declaration of 'int readline(std::istream&, string&, char, int)' specifies default arguments and isn't the only declaration [-fpermissive]
  • error 19
  • make[2]: *** [Makefile:2365: strclass.o] Error 1
  • error 20
  • strclass.h:813:19: error: friend declaration of 'string common_prefix(const string&, const string&, int)' specifies default arguments and isn't a definition [-fpermissive]
  • error 21
  • strclass.h:815:19: error: friend declaration of 'string common_suffix(const string&, const string&, int)' specifies default arguments and isn't a definition [-fpermissive]
  • error 22
  • strclass.h:866:16: error: friend declaration of 'int readline(std::istream&, string&, char, int)' specifies default arguments and isn't a definition [-fpermissive]
  • error 23
  • make[2]: *** [Makefile:2365: rxclass.o] Error 1
  • error 24
  • strclass.h:813:19: error: friend declaration of 'string common_prefix(const string&, const string&, int)' specifies default arguments and isn't a definition [-fpermissive]
  • error 25
  • strclass.h:815:19: error: friend declaration of 'string common_suffix(const string&, const string&, int)' specifies default arguments and isn't a definition [-fpermissive]
  • error 26
  • strclass.h:866:16: error: friend declaration of 'int readline(std::istream&, string&, char, int)' specifies default arguments and isn't a definition [-fpermissive]
  • error 27
  • make[2]: *** [Makefile:2365: sigName.o] Error 1
  • error 28
  • strclass.h:813:19: error: friend declaration of 'string common_prefix(const string&, const string&, int)' specifies default arguments and isn't a definition [-fpermissive]
  • error 29
  • strclass.h:815:19: error: friend declaration of 'string common_suffix(const string&, const string&, int)' specifies default arguments and isn't a definition [-fpermissive]
  • error 30
  • strclass.h:866:16: error: friend declaration of 'int readline(std::istream&, string&, char, int)' specifies default arguments and isn't a definition [-fpermissive]
  • error 31
  • make[2]: *** [Makefile:2365: tabs.o] Error 1
  • error 32
  • make[1]: *** [Makefile:1992: all] Error 2
  • error 33
  • error: Bad exit status from /tmp/B.iC0wwb/BUILD/tmp/rpm-tmp.41894 (%build)
  • error 34
  • RPM build errors:
  • error 35
  • error: No files produced.

Content:

checking for tcflow... yes
checking for tcflow declaration in termios.h... yes
checking for tcflush... yes
checking for tcflush declaration in termios.h... yes
checking for tcgetattr... yes
checking for tcgetattr declaration in termios.h... yes
checking for tcgetpgrp... yes
checking for tcgetpgrp declaration in unistd.h... yes
checking for tcgetsid... yes
checking for tcgetsid declaration in sys/termios.h... yes
checking for tcsendbreak... yes
checking for tcsendbreak declaration in termios.h... yes
checking for tcsetattr... yes
checking for tcsetattr declaration in termios.h... yes
checking for tcsetpgrp... yes
checking for tcsetpgrp declaration in unistd.h... yes
checking for times... yes
checking for times declaration in sys/times.h... yes
checking for tmpfile... yes
checking for tmpfile declaration in stdio.h... yes
checking for uname... yes
checking for uname declaration in sys/utsname.h... yes
checking for unlink... yes
checking for unlink declaration in unistd.h... yes
checking for unlockpt... yes
checking for unlockpt declaration in stdlib.h... yes
checking for waitpid... yes
checking for waitpid declaration in sys/wait.h... yes
checking for PATH_MAX definition in limits.h... yes
checking for _POSIX_PATH_MAX definition in limits.h... yes
checking for MAXPATHLEN definition in sys/param.h... yes
checking fixes needed for Mac OS X... no
checking that generated files are newer than configure... done
configure: creating ./config.status
config.status: creating Makefile
config.status: creating ddd/Makefile
config.status: creating ddd/OldMakefile
config.status: WARNING:  'ddd/OldMakefile.in' seems to ignore the --datarootdir setting
config.status: creating ddd/vr.h
config.status: creating ddd/bld.h
config.status: creating ddd/Ddd
config.status: creating ddd/ddd.man
config.status: creating ddd/cfg.texi
config.status: creating ddd/.gdbinit
config.status: creating ddd.spec
config.status: creating themes/Makefile
config.status: creating vsllib/Makefile
config.status: creating ddd/config.h
config.status: executing depfiles commands
config.status: executing libtool commands
config.status: executing ddd/stamp-h commands
configure:
configuration is done.  Type `make' to make DDD.
In case of trouble, please check the settings in the files generated
by `configure' - that is, `ddd/config.h' and `ddd/Makefile'.
+ /usr/bin/make -Otarget -j9 'CXXOPT=-DNDEBUG -O2 -fwrapv -pipe -Wformat -Werror=format-security -gdwarf-4 -fno-debug-types-section -fvar-tracking-assignments -g2 -Wp,-D_FORTIFY_SOURCE=2 -fno-strict-aliasing -fstack-protector-strong --param=ssp-buffer-size=4 -Werror=trampolines -fPIC -march=x86-64 -gdwarf-4 -fno-debug-types-section -fvar-tracking-assignments -g2 '
Making all in themes
make[1]: Nothing to be done for 'all'.
Making all in vsllib
make[1]: Nothing to be done for 'all'.
Making all in ddd
/usr/bin/make  all-am
/usr/bin/make ddd.info
make[2]: Entering directory '/tmp/B.iC0wwb/BUILD/ddd-3.3.12/ddd'
cat ./host.h.in | \
sed "s%@HOST_CANONICAL@%x86_64-pld-linux-gnu%" | \
sed "s%@TARGET_CANONICAL@%x86_64-pld-linux-gnu%" | \
    cat > host.h~ && mv host.h~ host.h
make[2]: Leaving directory '/tmp/B.iC0wwb/BUILD/ddd-3.3.12/ddd'
make[2]: Entering directory '/tmp/B.iC0wwb/BUILD/ddd-3.3.12/ddd'
cat ./root.h.in | \
sed "s%@ROOT@%/usr/share/ddd-3.3.12%" | \
sed "s%@ALT_ROOT@%/usr/share/ddd%" | \
    cat > root.h~ && mv root.h~ root.h
make[2]: Leaving directory '/tmp/B.iC0wwb/BUILD/ddd-3.3.12/ddd'
make[2]: Entering directory '/tmp/B.iC0wwb/BUILD/ddd-3.3.12/ddd'
x86_64-pld-linux-g++ -DHAVE_CONFIG_H -I.  -I./..    -DNDEBUG -O2 -fwrapv -pipe -Wformat -Werror=format-security -gdwarf-4 -fno-debug-types-section -fvar-tracking-assignments -g2 -Wp,-D_FORTIFY_SOURCE=2 -fno-strict-aliasing -fstack-protector-strong --param=ssp-buffer-size=4 -Werror=trampolines -fPIC -march=x86-64 -gdwarf-4 -fno-debug-types-section -fvar-tracking-assignments -g2  -g2 -Wall -W -Wwrite-strings -Wformat -Werror=format-security -Wp,-D_FORTIFY_SOURCE=2 -Werror=trampolines -fwrapv -pipe -fno-debug-types-section -fvar-tracking-assignments -fno-strict-aliasing -fstack-protector-strong --param=ssp-buffer-size=4 -fPIC -march=x86-64 -fno-debug-types-section -fvar-tracking-assignments -trigraphs  -MT compare.o -MD -MP -MF .deps/compare.Tpo -c -o compare.o compare.C
mv -f .deps/compare.Tpo .deps/compare.Po
make[2]: Leaving directory '/tmp/B.iC0wwb/BUILD/ddd-3.3.12/ddd'
make[2]: Entering directory '/tmp/B.iC0wwb/BUILD/ddd-3.3.12/ddd'
x86_64-pld-linux-g++ -DHAVE_CONFIG_H -I.  -I./..    -DNDEBUG -O2 -fwrapv -pipe -Wformat -Werror=format-security -gdwarf-4 -fno-debug-types-section -fvar-tracking-assignments -g2 -Wp,-D_FORTIFY_SOURCE=2 -fno-strict-aliasing -fstack-protector-strong --param=ssp-buffer-size=4 -Werror=trampolines -fPIC -march=x86-64 -gdwarf-4 -fno-debug-types-section -fvar-tracking-assignments -g2  -g2 -Wall -W -Wwrite-strings -Wformat -Werror=format-security -Wp,-D_FORTIFY_SOURCE=2 -Werror=trampolines -fwrapv -pipe -fno-debug-types-section -fvar-tracking-assignments -fno-strict-aliasing -fstack-protector-strong --param=ssp-buffer-size=4 -fPIC -march=x86-64 -fno-debug-types-section -fvar-tracking-assignments -trigraphs  -MT basename.o -MD -MP -MF .deps/basename.Tpo -c -o basename.o basename.C
mv -f .deps/basename.Tpo .deps/basename.Po
make[2]: Leaving directory '/tmp/B.iC0wwb/BUILD/ddd-3.3.12/ddd'
make[2]: Entering directory '/tmp/B.iC0wwb/BUILD/ddd-3.3.12/ddd'
x86_64-pld-linux-g++ -DHAVE_CONFIG_H -I.  -I./..    -DNDEBUG -O2 -fwrapv -pipe -Wformat -Werror=format-security -gdwarf-4 -fno-debug-types-section -fvar-tracking-assignments -g2 -Wp,-D_FORTIFY_SOURCE=2 -fno-strict-aliasing -fstack-protector-strong --param=ssp-buffer-size=4 -Werror=trampolines -fPIC -march=x86-64 -gdwarf-4 -fno-debug-types-section -fvar-tracking-assignments -g2  -g2 -Wall -W -Wwrite-strings -Wformat -Werror=format-security -Wp,-D_FORTIFY_SOURCE=2 -Werror=trampolines -fwrapv -pipe -fno-debug-types-section -fvar-tracking-assignments -fno-strict-aliasing -fstack-protector-strong --param=ssp-buffer-size=4 -fPIC -march=x86-64 -fno-debug-types-section -fvar-tracking-assignments -trigraphs  -MT isid.o -MD -MP -MF .deps/isid.Tpo -c -o isid.o isid.C
mv -f .deps/isid.Tpo .deps/isid.Po
make[2]: Leaving directory '/tmp/B.iC0wwb/BUILD/ddd-3.3.12/ddd'
make[2]: Entering directory '/tmp/B.iC0wwb/BUILD/ddd-3.3.12/ddd'
x86_64-pld-linux-g++ -DHAVE_CONFIG_H -I.  -I./..    -DNDEBUG -O2 -fwrapv -pipe -Wformat -Werror=format-security -gdwarf-4 -fno-debug-types-section -fvar-tracking-assignments -g2 -Wp,-D_FORTIFY_SOURCE=2 -fno-strict-aliasing -fstack-protector-strong --param=ssp-buffer-size=4 -Werror=trampolines -fPIC -march=x86-64 -gdwarf-4 -fno-debug-types-section -fvar-tracking-assignments -g2  -g2 -Wall -W -Wwrite-strings -Wformat -Werror=format-security -Wp,-D_FORTIFY_SOURCE=2 -Werror=trampolines -fwrapv -pipe -fno-debug-types-section -fvar-tracking-assignments -fno-strict-aliasing -fstack-protector-strong --param=ssp-buffer-size=4 -fPIC -march=x86-64 -fno-debug-types-section -fvar-tracking-assignments -trigraphs  -MT hash.o -MD -MP -MF .deps/hash.Tpo -c -o hash.o hash.C
mv -f .deps/hash.Tpo .deps/hash.Po
make[2]: Leaving directory '/tmp/B.iC0wwb/BUILD/ddd-3.3.12/ddd'
make[2]: Entering directory '/tmp/B.iC0wwb/BUILD/ddd-3.3.12/ddd'
x86_64-pld-linux-g++ -DHAVE_CONFIG_H -I.  -I./..    -DNDEBUG -O2 -fwrapv -pipe -Wformat -Werror=format-security -gdwarf-4 -fno-debug-types-section -fvar-tracking-assignments -g2 -Wp,-D_FORTIFY_SOURCE=2 -fno-strict-aliasing -fstack-protector-strong --param=ssp-buffer-size=4 -Werror=trampolines -fPIC -march=x86-64 -gdwarf-4 -fno-debug-types-section -fvar-tracking-assignments -g2  -g2 -Wall -W -Wwrite-strings -Wformat -Werror=format-security -Wp,-D_FORTIFY_SOURCE=2 -Werror=trampolines -fwrapv -pipe -fno-debug-types-section -fvar-tracking-assignments -fno-strict-aliasing -fstack-protector-strong --param=ssp-buffer-size=4 -fPIC -march=x86-64 -fno-debug-types-section -fvar-tracking-assignments -trigraphs  -MT glob.o -MD -MP -MF .deps/glob.Tpo -c -o glob.o glob.C
mv -f .deps/glob.Tpo .deps/glob.Po
make[2]: Leaving directory '/tmp/B.iC0wwb/BUILD/ddd-3.3.12/ddd'
make[2]: Entering directory '/tmp/B.iC0wwb/BUILD/ddd-3.3.12/ddd'
x86_64-pld-linux-g++ -DHAVE_CONFIG_H -I.  -I./..    -DNDEBUG -O2 -fwrapv -pipe -Wformat -Werror=format-security -gdwarf-4 -fno-debug-types-section -fvar-tracking-assignments -g2 -Wp,-D_FORTIFY_SOURCE=2 -fno-strict-aliasing -fstack-protector-strong --param=ssp-buffer-size=4 -Werror=trampolines -fPIC -march=x86-64 -gdwarf-4 -fno-debug-types-section -fvar-tracking-assignments -g2  -g2 -Wall -W -Wwrite-strings -Wformat -Werror=format-security -Wp,-D_FORTIFY_SOURCE=2 -Werror=trampolines -fwrapv -pipe -fno-debug-types-section -fvar-tracking-assignments -fno-strict-aliasing -fstack-protector-strong --param=ssp-buffer-size=4 -fPIC -march=x86-64 -fno-debug-types-section -fvar-tracking-assignments -trigraphs  -MT cwd.o -MD -MP -MF .deps/cwd.Tpo -c -o cwd.o cwd.C
In file included from cwd.h:32,
                 from cwd.C:31:
strclass.h:813:19: error: friend declaration of 'string common_prefix(const string&, const string&, int)' specifies default arguments and isn't a definition [-fpermissive]
  813 |     friend string common_prefix(const string& x, const string& y,
      |                   ^~~~~~~~~~~~~
strclass.h:815:19: error: friend declaration of 'string common_suffix(const string&, const string&, int)' specifies default arguments and isn't a definition [-fpermissive]
  815 |     friend string common_suffix(const string& x, const string& y,
      |                   ^~~~~~~~~~~~~
strclass.h:866:16: error: friend declaration of 'int readline(std::istream&, string&, char, int)' specifies default arguments and isn't a definition [-fpermissive]
  866 |     friend int readline(std::istream& s, string& x,
      |                ^~~~~~~~
make[2]: *** [Makefile:2365: cwd.o] Error 1
make[2]: Leaving directory '/tmp/B.iC0wwb/BUILD/ddd-3.3.12/ddd'
make[2]: *** Waiting for unfinished jobs....
make[2]: Entering directory '/tmp/B.iC0wwb/BUILD/ddd-3.3.12/ddd'
x86_64-pld-linux-g++ -DHAVE_CONFIG_H -I.  -I./..    -DNDEBUG -O2 -fwrapv -pipe -Wformat -Werror=format-security -gdwarf-4 -fno-debug-types-section -fvar-tracking-assignments -g2 -Wp,-D_FORTIFY_SOURCE=2 -fno-strict-aliasing -fstack-protector-strong --param=ssp-buffer-size=4 -Werror=trampolines -fPIC -march=x86-64 -gdwarf-4 -fno-debug-types-section -fvar-tracking-assignments -g2  -g2 -Wall -W -Wwrite-strings -Wformat -Werror=format-security -Wp,-D_FORTIFY_SOURCE=2 -Werror=trampolines -fwrapv -pipe -fno-debug-types-section -fvar-tracking-assignments -fno-strict-aliasing -fstack-protector-strong --param=ssp-buffer-size=4 -fPIC -march=x86-64 -fno-debug-types-section -fvar-tracking-assignments -trigraphs  -MT cook.o -MD -MP -MF .deps/cook.Tpo -c -o cook.o cook.C
In file included from cook.h:31,
                 from cook.C:36:
strclass.h:813:19: error: friend declaration of 'string common_prefix(const string&, const string&, int)' specifies default arguments and isn't a definition [-fpermissive]
  813 |     friend string common_prefix(const string& x, const string& y,
      |                   ^~~~~~~~~~~~~
strclass.h:815:19: error: friend declaration of 'string common_suffix(const string&, const string&, int)' specifies default arguments and isn't a definition [-fpermissive]
  815 |     friend string common_suffix(const string& x, const string& y,
      |                   ^~~~~~~~~~~~~
strclass.h:866:16: error: friend declaration of 'int readline(std::istream&, string&, char, int)' specifies default arguments and isn't a definition [-fpermissive]
  866 |     friend int readline(std::istream& s, string& x,
      |                ^~~~~~~~
make[2]: *** [Makefile:2365: cook.o] Error 1
make[2]: Leaving directory '/tmp/B.iC0wwb/BUILD/ddd-3.3.12/ddd'
make[2]: Entering directory '/tmp/B.iC0wwb/BUILD/ddd-3.3.12/ddd'
x86_64-pld-linux-g++ -DHAVE_CONFIG_H -I.  -I./..    -DNDEBUG -O2 -fwrapv -pipe -Wformat -Werror=format-security -gdwarf-4 -fno-debug-types-section -fvar-tracking-assignments -g2 -Wp,-D_FORTIFY_SOURCE=2 -fno-strict-aliasing -fstack-protector-strong --param=ssp-buffer-size=4 -Werror=trampolines -fPIC -march=x86-64 -gdwarf-4 -fno-debug-types-section -fvar-tracking-assignments -g2  -g2 -Wall -W -Wwrite-strings -Wformat -Werror=format-security -Wp,-D_FORTIFY_SOURCE=2 -Werror=trampolines -fwrapv -pipe -fno-debug-types-section -fvar-tracking-assignments -fno-strict-aliasing -fstack-protector-strong --param=ssp-buffer-size=4 -fPIC -march=x86-64 -fno-debug-types-section -fvar-tracking-assignments -trigraphs  -MT home.o -MD -MP -MF .deps/home.Tpo -c -o home.o home.C
In file included from home.C:32:
strclass.h:813:19: error: friend declaration of 'string common_prefix(const string&, const string&, int)' specifies default arguments and isn't a definition [-fpermissive]
  813 |     friend string common_prefix(const string& x, const string& y,
      |                   ^~~~~~~~~~~~~
strclass.h:815:19: error: friend declaration of 'string common_suffix(const string&, const string&, int)' specifies default arguments and isn't a definition [-fpermissive]
  815 |     friend string common_suffix(const string& x, const string& y,
      |                   ^~~~~~~~~~~~~
strclass.h:866:16: error: friend declaration of 'int readline(std::istream&, string&, char, int)' specifies default arguments and isn't a definition [-fpermissive]
  866 |     friend int readline(std::istream& s, string& x,
      |                ^~~~~~~~
make[2]: *** [Makefile:2365: home.o] Error 1
make[2]: Leaving directory '/tmp/B.iC0wwb/BUILD/ddd-3.3.12/ddd'
make[2]: Entering directory '/tmp/B.iC0wwb/BUILD/ddd-3.3.12/ddd'
x86_64-pld-linux-g++ -DHAVE_CONFIG_H -I.  -I./..    -DNDEBUG -O2 -fwrapv -pipe -Wformat -Werror=format-security -gdwarf-4 -fno-debug-types-section -fvar-tracking-assignments -g2 -Wp,-D_FORTIFY_SOURCE=2 -fno-strict-aliasing -fstack-protector-strong --param=ssp-buffer-size=4 -Werror=trampolines -fPIC -march=x86-64 -gdwarf-4 -fno-debug-types-section -fvar-tracking-assignments -g2  -g2 -Wall -W -Wwrite-strings -Wformat -Werror=format-security -Wp,-D_FORTIFY_SOURCE=2 -Werror=trampolines -fwrapv -pipe -fno-debug-types-section -fvar-tracking-assignments -fno-strict-aliasing -fstack-protector-strong --param=ssp-buffer-size=4 -fPIC -march=x86-64 -fno-debug-types-section -fvar-tracking-assignments -trigraphs  -MT assert.o -MD -MP -MF .deps/assert.Tpo -c -o assert.o assert.C
mv -f .deps/assert.Tpo .deps/assert.Po
make[2]: Leaving directory '/tmp/B.iC0wwb/BUILD/ddd-3.3.12/ddd'
make[2]: Entering directory '/tmp/B.iC0wwb/BUILD/ddd-3.3.12/ddd'
x86_64-pld-linux-g++ -DHAVE_CONFIG_H -I.  -I./..    -DNDEBUG -O2 -fwrapv -pipe -Wformat -Werror=format-security -gdwarf-4 -fno-debug-types-section -fvar-tracking-assignments -g2 -Wp,-D_FORTIFY_SOURCE=2 -fno-strict-aliasing -fstack-protector-strong --param=ssp-buffer-size=4 -Werror=trampolines -fPIC -march=x86-64 -gdwarf-4 -fno-debug-types-section -fvar-tracking-assignments -g2  -g2 -Wall -W -Wwrite-strings -Wformat -Werror=format-security -Wp,-D_FORTIFY_SOURCE=2 -Werror=trampolines -fwrapv -pipe -fno-debug-types-section -fvar-tracking-assignments -fno-strict-aliasing -fstack-protector-strong --param=ssp-buffer-size=4 -fPIC -march=x86-64 -fno-debug-types-section -fvar-tracking-assignments -trigraphs  -MT strclass.o -MD -MP -MF .deps/strclass.Tpo -c -o strclass.o strclass.C
In file included from strclass.C:36:
strclass.h:813:19: error: friend declaration of 'string common_prefix(const string&, const string&, int)' specifies default arguments and isn't a definition [-fpermissive]
  813 |     friend string common_prefix(const string& x, const string& y,
      |                   ^~~~~~~~~~~~~
strclass.h:815:19: error: friend declaration of 'string common_suffix(const string&, const string&, int)' specifies default arguments and isn't a definition [-fpermissive]
  815 |     friend string common_suffix(const string& x, const string& y,
      |                   ^~~~~~~~~~~~~
strclass.h:866:16: error: friend declaration of 'int readline(std::istream&, string&, char, int)' specifies default arguments and isn't a definition [-fpermissive]
  866 |     friend int readline(std::istream& s, string& x,
      |                ^~~~~~~~
strclass.C:1484:8: error: friend declaration of 'string common_prefix(const string&, const string&, int)' specifies default arguments and isn't the only declaration [-fpermissive]
 1484 | string common_prefix(const string& x, const string& y, int startpos)
      |        ^~~~~~~~~~~~~
In file included from strclass.C:36:
strclass.h:813:19: note: previous declaration of 'string common_prefix(const string&, const string&, int)'
  813 |     friend string common_prefix(const string& x, const string& y,
      |                   ^~~~~~~~~~~~~
strclass.C:1504:8: error: friend declaration of 'string common_suffix(const string&, const string&, int)' specifies default arguments and isn't the only declaration [-fpermissive]
 1504 | string common_suffix(const string& x, const string& y, int startpos)
      |        ^~~~~~~~~~~~~
In file included from strclass.C:36:
strclass.h:815:19: note: previous declaration of 'string common_suffix(const string&, const string&, int)'
  815 |     friend string common_suffix(const string& x, const string& y,
      |                   ^~~~~~~~~~~~~
strclass.C:1566:5: error: friend declaration of 'int readline(std::istream&, string&, char, int)' specifies default arguments and isn't the only declaration [-fpermissive]
 1566 | int readline(std::istream& s, string& x, char terminator, int discard)
      |     ^~~~~~~~
In file included from strclass.C:36:
strclass.h:866:16: note: previous declaration of 'int readline(std::istream&, string&, char, int)'
  866 |     friend int readline(std::istream& s, string& x,
      |                ^~~~~~~~
make[2]: *** [Makefile:2365: strclass.o] Error 1
make[2]: Leaving directory '/tmp/B.iC0wwb/BUILD/ddd-3.3.12/ddd'
make[2]: Entering directory '/tmp/B.iC0wwb/BUILD/ddd-3.3.12/ddd'
x86_64-pld-linux-g++ -DHAVE_CONFIG_H -I.  -I./..    -DNDEBUG -O2 -fwrapv -pipe -Wformat -Werror=format-security -gdwarf-4 -fno-debug-types-section -fvar-tracking-assignments -g2 -Wp,-D_FORTIFY_SOURCE=2 -fno-strict-aliasing -fstack-protector-strong --param=ssp-buffer-size=4 -Werror=trampolines -fPIC -march=x86-64 -gdwarf-4 -fno-debug-types-section -fvar-tracking-assignments -g2  -g2 -Wall -W -Wwrite-strings -Wformat -Werror=format-security -Wp,-D_FORTIFY_SOURCE=2 -Werror=trampolines -fwrapv -pipe -fno-debug-types-section -fvar-tracking-assignments -fno-strict-aliasing -fstack-protector-strong --param=ssp-buffer-size=4 -fPIC -march=x86-64 -fno-debug-types-section -fvar-tracking-assignments -trigraphs  -MT rxclass.o -MD -MP -MF .deps/rxclass.Tpo -c -o rxclass.o rxclass.C
In file included from rxclass.C:33:
strclass.h:813:19: error: friend declaration of 'string common_prefix(const string&, const string&, int)' specifies default arguments and isn't a definition [-fpermissive]
  813 |     friend string common_prefix(const string& x, const string& y,
      |                   ^~~~~~~~~~~~~
strclass.h:815:19: error: friend declaration of 'string common_suffix(const string&, const string&, int)' specifies default arguments and isn't a definition [-fpermissive]
  815 |     friend string common_suffix(const string& x, const string& y,
      |                   ^~~~~~~~~~~~~
strclass.h:866:16: error: friend declaration of 'int readline(std::istream&, string&, char, int)' specifies default arguments and isn't a definition [-fpermissive]
  866 |     friend int readline(std::istream& s, string& x,
      |                ^~~~~~~~
make[2]: *** [Makefile:2365: rxclass.o] Error 1
make[2]: Leaving directory '/tmp/B.iC0wwb/BUILD/ddd-3.3.12/ddd'
make[2]: Entering directory '/tmp/B.iC0wwb/BUILD/ddd-3.3.12/ddd'
x86_64-pld-linux-g++ -DHAVE_CONFIG_H -I.  -I./..    -DNDEBUG -O2 -fwrapv -pipe -Wformat -Werror=format-security -gdwarf-4 -fno-debug-types-section -fvar-tracking-assignments -g2 -Wp,-D_FORTIFY_SOURCE=2 -fno-strict-aliasing -fstack-protector-strong --param=ssp-buffer-size=4 -Werror=trampolines -fPIC -march=x86-64 -gdwarf-4 -fno-debug-types-section -fvar-tracking-assignments -g2  -g2 -Wall -W -Wwrite-strings -Wformat -Werror=format-security -Wp,-D_FORTIFY_SOURCE=2 -Werror=trampolines -fwrapv -pipe -fno-debug-types-section -fvar-tracking-assignments -fno-strict-aliasing -fstack-protector-strong --param=ssp-buffer-size=4 -fPIC -march=x86-64 -fno-debug-types-section -fvar-tracking-assignments -trigraphs  -MT sigName.o -MD -MP -MF .deps/sigName.Tpo -c -o sigName.o sigName.C
In file included from sigName.C:42:
strclass.h:813:19: error: friend declaration of 'string common_prefix(const string&, const string&, int)' specifies default arguments and isn't a definition [-fpermissive]
  813 |     friend string common_prefix(const string& x, const string& y,
      |                   ^~~~~~~~~~~~~
strclass.h:815:19: error: friend declaration of 'string common_suffix(const string&, const string&, int)' specifies default arguments and isn't a definition [-fpermissive]
  815 |     friend string common_suffix(const string& x, const string& y,
      |                   ^~~~~~~~~~~~~
strclass.h:866:16: error: friend declaration of 'int readline(std::istream&, string&, char, int)' specifies default arguments and isn't a definition [-fpermissive]
  866 |     friend int readline(std::istream& s, string& x,
      |                ^~~~~~~~
make[2]: *** [Makefile:2365: sigName.o] Error 1
make[2]: Leaving directory '/tmp/B.iC0wwb/BUILD/ddd-3.3.12/ddd'
make[2]: Entering directory '/tmp/B.iC0wwb/BUILD/ddd-3.3.12/ddd'
x86_64-pld-linux-g++ -DHAVE_CONFIG_H -I.  -I./..    -DNDEBUG -O2 -fwrapv -pipe -Wformat -Werror=format-security -gdwarf-4 -fno-debug-types-section -fvar-tracking-assignments -g2 -Wp,-D_FORTIFY_SOURCE=2 -fno-strict-aliasing -fstack-protector-strong --param=ssp-buffer-size=4 -Werror=trampolines -fPIC -march=x86-64 -gdwarf-4 -fno-debug-types-section -fvar-tracking-assignments -g2  -g2 -Wall -W -Wwrite-strings -Wformat -Werror=format-security -Wp,-D_FORTIFY_SOURCE=2 -Werror=trampolines -fwrapv -pipe -fno-debug-types-section -fvar-tracking-assignments -fno-strict-aliasing -fstack-protector-strong --param=ssp-buffer-size=4 -fPIC -march=x86-64 -fno-debug-types-section -fvar-tracking-assignments -trigraphs  -MT tabs.o -MD -MP -MF .deps/tabs.Tpo -c -o tabs.o tabs.C
In file included from tabs.h:32,
                 from tabs.C:31:
strclass.h:813:19: error: friend declaration of 'string common_prefix(const string&, const string&, int)' specifies default arguments and isn't a definition [-fpermissive]
  813 |     friend string common_prefix(const string& x, const string& y,
      |                   ^~~~~~~~~~~~~
strclass.h:815:19: error: friend declaration of 'string common_suffix(const string&, const string&, int)' specifies default arguments and isn't a definition [-fpermissive]
  815 |     friend string common_suffix(const string& x, const string& y,
      |                   ^~~~~~~~~~~~~
strclass.h:866:16: error: friend declaration of 'int readline(std::istream&, string&, char, int)' specifies default arguments and isn't a definition [-fpermissive]
  866 |     friend int readline(std::istream& s, string& x,
      |                ^~~~~~~~
make[2]: *** [Makefile:2365: tabs.o] Error 1
make[2]: Leaving directory '/tmp/B.iC0wwb/BUILD/ddd-3.3.12/ddd'
make[3]: Entering directory '/tmp/B.iC0wwb/BUILD/ddd-3.3.12/ddd'
restore=: && backupdir=".am$$" && \
am__cwd=`pwd` && CDPATH="${ZSH_VERSION+.}:" && cd . && \
rm -rf $backupdir && mkdir $backupdir && \
if (/bin/sh /tmp/B.iC0wwb/BUILD/ddd-3.3.12/missing makeinfo --version) >/dev/null 2>&1; then \
  for f in ddd.info ddd.info-[0-9] ddd.info-[0-9][0-9] ddd.i[0-9] ddd.i[0-9][0-9]; do \
    if test -f $f; then mv $f $backupdir; restore=mv; else :; fi; \
  done; \
else :; fi && \
cd "$am__cwd"; \
if /bin/sh /tmp/B.iC0wwb/BUILD/ddd-3.3.12/missing makeinfo   -I . \
 -o ddd.info ddd.texi; \
then \
  rc=0; \
  CDPATH="${ZSH_VERSION+.}:" && cd .; \
else \
  rc=$?; \
  CDPATH="${ZSH_VERSION+.}:" && cd . && \
  $restore $backupdir/* `echo "./ddd.info" | sed 's|[^/]*$||'`; \
fi; \
rm -rf $backupdir; exit $rc
make[3]: Leaving directory '/tmp/B.iC0wwb/BUILD/ddd-3.3.12/ddd'
make[2]: Entering directory '/tmp/B.iC0wwb/BUILD/ddd-3.3.12/ddd'
info --subnodes -o - -f ./ddd.info | cat > ddd.info.txt~ \
    && mv ddd.info.txt~ ddd.info.txt
make[2]: Leaving directory '/tmp/B.iC0wwb/BUILD/ddd-3.3.12/ddd'
make[1]: *** [Makefile:1992: all] Error 2
make: *** [Makefile:588: all-recursive] Error 1
error: Bad exit status from /tmp/B.iC0wwb/BUILD/tmp/rpm-tmp.41894 (%build)


RPM build errors:
    Bad exit status from /tmp/B.iC0wwb/BUILD/tmp/rpm-tmp.41894 (%build)
ended at: Sat Oct 19 00:35:56 2019, done in 0:00:30.658230
error: No files produced.
+ chmod -R u+rwX /tmp/B.iC0wwb/BUILD
+ rm -rf /tmp/B.iC0wwb/tmp /tmp/B.iC0wwb/BUILD
+ rm -rf /tmp/B.iC0wwb
Begin-PLD-Builder-Info
Build-Time: user:26.18s sys:4.94s real:34.62s (faults io:0 non-io:2289073)

End-PLD-Builder-Info
[Back to list of logs] [View rpm -qa of builder]