FailedOk

th/SRPMS[OK]
th/x32[OK]
th/i686[OK]
th/x86_64[OK]

ac/SRPMS[OK]
ac/i386[OK]
ac/i586[OK]
ac/i686[OK]
ac/alpha[OK]
ac/amd64[OK]
ac/athlon[OK]
ac/ppc[OK]
ac/sparc[OK]
ac/sparc64[OK]

Advanced Search
main()
Powered by PLD Linux
(c) 2002-2020 PLD Team
$Revision: 1.37 $
Powered by Ken.
Your IP: 34.234.207.100

docsis 059ae1cd-7195-4a2d-85ed-eea0368a467b

Status:Failed
Source URL:https://buildlogs.pld-linux.org/pld/th/x86_64/FAIL/docsis,059ae1cd-7195-4a2d-85ed-eea0368a467b.bz2
text/plain URL:View!
full text:View!
rpm -qa of builder:View!
Date:2020/10/05 09:17:08
Runtime:0:00:09.676687

Toc:

  • error 1
  • collect2: error: ld returned 1 exit status
  • error 2
  • make[2]: *** [Makefile:430: docsis] Error 1
  • error 3
  • make[1]: *** [Makefile:476: all-recursive] Error 1
  • error 4
  • error: Bad exit status from /tmp/B.f9axGS/BUILD/tmp/rpm-tmp.61024 (%build)
  • error 5
  • RPM build errors:
  • error 6
  • error: No files produced.

Content:

                 from /usr/include/net-snmp/library/snmp_api.h:33,
                 from /usr/include/net-snmp/definitions.h:23,
                 from /usr/include/net-snmp/types.h:424,
                 from /usr/include/net-snmp/utilities.h:16,
                 from docsis_snmp.h:28,
                 from docsis_snmp.c:23:
/usr/include/net-snmp/library/asn1.h:200:48: note: expected 'size_t *' {aka 'long unsigned int *'} but argument is of type 'unsigned int *'
  200 |     u_char         *asn_parse_string(u_char *, size_t *, u_char *,
      |                                                ^~~~~~~~
docsis_snmp.c:515:33: warning: passing argument 2 of 'asn_parse_objid' from incompatible pointer type [-Wincompatible-pointer-types]
  515 |       asn_parse_objid (var_val, &len, &vp->type, objid, &vp->val_len);
      |                                 ^~~~
      |                                 |
      |                                 unsigned int *
In file included from /usr/include/net-snmp/pdu_api.h:44,
                 from /usr/include/net-snmp/library/snmp_client.h:31,
                 from /usr/include/net-snmp/varbind_api.h:102,
                 from /usr/include/net-snmp/library/snmp_api.h:33,
                 from /usr/include/net-snmp/definitions.h:23,
                 from /usr/include/net-snmp/types.h:424,
                 from /usr/include/net-snmp/utilities.h:16,
                 from docsis_snmp.h:28,
                 from docsis_snmp.c:23:
/usr/include/net-snmp/library/asn1.h:219:47: note: expected 'size_t *' {aka 'long unsigned int *'} but argument is of type 'unsigned int *'
  219 |     u_char         *asn_parse_objid(u_char *, size_t *, u_char *, oid *,
      |                                               ^~~~~~~~
docsis_snmp.c:527:37: warning: passing argument 2 of 'asn_parse_bitstring' from incompatible pointer type [-Wincompatible-pointer-types]
  527 |       asn_parse_bitstring (var_val, &len, &vp->type,
      |                                     ^~~~
      |                                     |
      |                                     unsigned int *
In file included from /usr/include/net-snmp/pdu_api.h:44,
                 from /usr/include/net-snmp/library/snmp_client.h:31,
                 from /usr/include/net-snmp/varbind_api.h:102,
                 from /usr/include/net-snmp/library/snmp_api.h:33,
                 from /usr/include/net-snmp/definitions.h:23,
                 from /usr/include/net-snmp/types.h:424,
                 from /usr/include/net-snmp/utilities.h:16,
                 from docsis_snmp.h:28,
                 from docsis_snmp.c:23:
/usr/include/net-snmp/library/asn1.h:229:51: note: expected 'size_t *' {aka 'long unsigned int *'} but argument is of type 'unsigned int *'
  229 |     u_char         *asn_parse_bitstring(u_char *, size_t *, u_char *,
      |                                                   ^~~~~~~~
docsis_snmp.c: In function 'encode_snmp_oid':
docsis_snmp.c:633:43: warning: passing argument 2 of 'asn_build_objid' from incompatible pointer type [-Wincompatible-pointer-types]
  633 |   data_ptr = asn_build_objid (out_buffer, &out_size,
      |                                           ^~~~~~~~~
      |                                           |
      |                                           unsigned int *
In file included from /usr/include/net-snmp/pdu_api.h:44,
                 from /usr/include/net-snmp/library/snmp_client.h:31,
                 from /usr/include/net-snmp/varbind_api.h:102,
                 from /usr/include/net-snmp/library/snmp_api.h:33,
                 from /usr/include/net-snmp/definitions.h:23,
                 from /usr/include/net-snmp/types.h:424,
                 from /usr/include/net-snmp/utilities.h:16,
                 from docsis_snmp.h:28,
                 from docsis_snmp.c:23:
/usr/include/net-snmp/library/asn1.h:222:47: note: expected 'size_t *' {aka 'long unsigned int *'} but argument is of type 'unsigned int *'
  222 |     u_char         *asn_build_objid(u_char *, size_t *, u_char, oid *,
      |                                               ^~~~~~~~
docsis_snmp.c: In function 'decode_snmp_oid':
docsis_snmp.c:655:31: warning: passing argument 2 of 'asn_parse_objid' from incompatible pointer type [-Wincompatible-pointer-types]
  655 |        asn_parse_objid (data, &len, &type, this_oid, &oid_len)) == NULL)
      |                               ^~~~
      |                               |
      |                               int *
In file included from /usr/include/net-snmp/pdu_api.h:44,
                 from /usr/include/net-snmp/library/snmp_client.h:31,
                 from /usr/include/net-snmp/varbind_api.h:102,
                 from /usr/include/net-snmp/library/snmp_api.h:33,
                 from /usr/include/net-snmp/definitions.h:23,
                 from /usr/include/net-snmp/types.h:424,
                 from /usr/include/net-snmp/utilities.h:16,
                 from docsis_snmp.h:28,
                 from docsis_snmp.c:23:
/usr/include/net-snmp/library/asn1.h:219:47: note: expected 'size_t *' {aka 'long unsigned int *'} but argument is of type 'int *'
  219 |     u_char         *asn_parse_objid(u_char *, size_t *, u_char *, oid *,
      |                                               ^~~~~~~~
mv -f .deps/docsis_snmp.Tpo .deps/docsis_snmp.Po
make[2]: Leaving directory '/tmp/B.f9axGS/BUILD/docsis-0.9.5/src'
make[2]: Entering directory '/tmp/B.f9axGS/BUILD/docsis-0.9.5/src'
x86_64-pld-linux-gcc -DHAVE_CONFIG_H -I. -I..  -I/usr/include/libnl3 -I. -I/usr/include    -O2 -fwrapv -pipe -Wformat -Werror=format-security -gdwarf-4 -fno-debug-types-section -fvar-tracking-assignments -g2 -Wp,-D_FORTIFY_SOURCE=2 -fstack-protector-strong --param=ssp-buffer-size=4 -Werror=trampolines -fPIC -march=x86-64 -gdwarf-4 -fno-debug-types-section -fvar-tracking-assignments -g2  -MT docsis_decode.o -MD -MP -MF .deps/docsis_decode.Tpo -c -o docsis_decode.o docsis_decode.c
mv -f .deps/docsis_decode.Tpo .deps/docsis_decode.Po
make[2]: Leaving directory '/tmp/B.f9axGS/BUILD/docsis-0.9.5/src'
make[2]: Entering directory '/tmp/B.f9axGS/BUILD/docsis-0.9.5/src'
x86_64-pld-linux-gcc -DHAVE_CONFIG_H -I. -I..  -I/usr/include/libnl3 -I. -I/usr/include    -O2 -fwrapv -pipe -Wformat -Werror=format-security -gdwarf-4 -fno-debug-types-section -fvar-tracking-assignments -g2 -Wp,-D_FORTIFY_SOURCE=2 -fstack-protector-strong --param=ssp-buffer-size=4 -Werror=trampolines -fPIC -march=x86-64 -gdwarf-4 -fno-debug-types-section -fvar-tracking-assignments -g2  -MT docsis_lex.o -MD -MP -MF .deps/docsis_lex.Tpo -c -o docsis_lex.o docsis_lex.c
mv -f .deps/docsis_lex.Tpo .deps/docsis_lex.Po
make[2]: Leaving directory '/tmp/B.f9axGS/BUILD/docsis-0.9.5/src'
make[2]: Entering directory '/tmp/B.f9axGS/BUILD/docsis-0.9.5/src'
x86_64-pld-linux-gcc -DHAVE_CONFIG_H -I. -I..  -I/usr/include/libnl3 -I. -I/usr/include    -O2 -fwrapv -pipe -Wformat -Werror=format-security -gdwarf-4 -fno-debug-types-section -fvar-tracking-assignments -g2 -Wp,-D_FORTIFY_SOURCE=2 -fstack-protector-strong --param=ssp-buffer-size=4 -Werror=trampolines -fPIC -march=x86-64 -gdwarf-4 -fno-debug-types-section -fvar-tracking-assignments -g2  -MT docsis_yy.o -MD -MP -MF .deps/docsis_yy.Tpo -c -o docsis_yy.o docsis_yy.c
mv -f .deps/docsis_yy.Tpo .deps/docsis_yy.Po
make[2]: Leaving directory '/tmp/B.f9axGS/BUILD/docsis-0.9.5/src'
make[2]: Entering directory '/tmp/B.f9axGS/BUILD/docsis-0.9.5/src'
/bin/sh ../libtool  --tag=CC   --mode=link x86_64-pld-linux-gcc  -O2 -fwrapv -pipe -Wformat -Werror=format-security -gdwarf-4 -fno-debug-types-section -fvar-tracking-assignments -g2 -Wp,-D_FORTIFY_SOURCE=2 -fstack-protector-strong --param=ssp-buffer-size=4 -Werror=trampolines -fPIC -march=x86-64 -gdwarf-4 -fno-debug-types-section -fvar-tracking-assignments -g2   -L/usr/lib64 -lnetsnmp -lm -lcom_err -lkrb5 -lssh2 -lssl -lssl -lcrypto -lfl  -Wl,--as-needed -Wl,--no-copy-dt-needed-entries -Wl,-z,relro -Wl,-z,combreloc  -o docsis docsis.o ethermac.o md5.o docsis_encode.o docsis_decode.o docsis_snmp.o docsis_yy.o docsis_lex.o hmac_md5.o  -lm -lresolv 
libtool: link: x86_64-pld-linux-gcc -O2 -fwrapv -pipe -Wformat -Werror=format-security -gdwarf-4 -fno-debug-types-section -fvar-tracking-assignments -g2 -Wp,-D_FORTIFY_SOURCE=2 -fstack-protector-strong --param=ssp-buffer-size=4 -Werror=trampolines -fPIC -march=x86-64 -gdwarf-4 -fno-debug-types-section -fvar-tracking-assignments -g2 -Wl,--as-needed -Wl,--no-copy-dt-needed-entries -Wl,-z -Wl,relro -Wl,-z -Wl,combreloc -o docsis docsis.o ethermac.o md5.o docsis_encode.o docsis_decode.o docsis_snmp.o docsis_yy.o docsis_lex.o hmac_md5.o  -L/usr/lib64 /usr/lib64/libnetsnmp.so /usr/lib64/libkrb5.so /usr/lib64/libhx509.so /usr/lib64/libwind.so /usr/lib64/libsqlite3.so /usr/lib64/libhcrypto.so /usr/lib64/libasn1.so -lcom_err /usr/lib64/libheimbase.so /usr/lib64/libroken.so -lcrypt -ldl -lpthread /usr/lib64/libssh2.so -lz -lssl -lcrypto -lfl -lm -lresolv -pthread
/usr/bin/ld: docsis_encode.o:/tmp/B.f9axGS/BUILD/docsis-0.9.5/src/docsis_globals.h:26: multiple definition of `prog_name'; docsis.o:/tmp/B.f9axGS/BUILD/docsis-0.9.5/src/docsis_globals.h:26: first defined here
/usr/bin/ld: docsis_encode.o:/tmp/B.f9axGS/BUILD/docsis-0.9.5/src/docsis_globals.h:28: multiple definition of `global_symtable'; docsis.o:/tmp/B.f9axGS/BUILD/docsis-0.9.5/src/docsis_globals.h:28: first defined here
/usr/bin/ld: docsis_encode.o:/tmp/B.f9axGS/BUILD/docsis-0.9.5/src/docsis_globals.h:27: multiple definition of `global_tlvtree_head'; docsis.o:/tmp/B.f9axGS/BUILD/docsis-0.9.5/src/docsis_globals.h:27: first defined here
collect2: error: ld returned 1 exit status
make[2]: *** [Makefile:430: docsis] Error 1
make[2]: Leaving directory '/tmp/B.f9axGS/BUILD/docsis-0.9.5/src'
make[1]: *** [Makefile:476: all-recursive] Error 1
make: *** [Makefile:373: all] Error 2
error: Bad exit status from /tmp/B.f9axGS/BUILD/tmp/rpm-tmp.61024 (%build)


RPM build errors:
    Bad exit status from /tmp/B.f9axGS/BUILD/tmp/rpm-tmp.61024 (%build)
ended at: Mon Oct  5 09:17:07 2020, done in 0:00:09.676687
error: No files produced.
+ chmod -R u+rwX /tmp/B.f9axGS/BUILD
+ rm -rf /tmp/B.f9axGS/tmp /tmp/B.f9axGS/BUILD
+ rm -rf /tmp/B.f9axGS
Begin-PLD-Builder-Info
Build-Time: user:9.13s sys:1.18s real:11.83s (faults io:0 non-io:755936)

End-PLD-Builder-Info
[Back to list of logs] [View rpm -qa of builder]