FailedOk

th/SRPMS[OK]
th/x32[OK]
th/i686[OK]
th/x86_64[OK]

ac/SRPMS[OK]
ac/i386[OK]
ac/i586[OK]
ac/i686[OK]
ac/alpha[OK]
ac/amd64[OK]
ac/athlon[OK]
ac/ppc[OK]
ac/sparc[OK]
ac/sparc64[OK]

Advanced Search
main()
Powered by PLD Linux
(c) 2002-2017 PLD Team
$Revision: 1.37 $
Powered by The Right Thing.
Your IP: 54.227.51.103

dotnet-gnome-sharp e8c9c952-8168-44e5-b566-17f0d0611f3a

Status:Failed
Source URL:ftp://buildlogs.pld-linux.org/th/x86_64/FAIL/dotnet-gnome-sharp,e8c9c952-8168-44e5-b566-17f0d0611f3a.bz2
text/plain URL:View!
rpm -qa of builder:View!
Date:2017/11/29 21:16:15
Runtime:0:00:14.533339

Toc:

  • prep
  • Executing(%prep): /bin/sh -e /tmp/B.nCn7wS/BUILD/tmp/rpm-tmp.40548
  • build
  • Executing(%build): /bin/sh -e /tmp/B.nCn7wS/BUILD/tmp/rpm-tmp.25818
  • error 1
  • generated/CanvasPathDef.custom(24,67): error CS1502: The best overloaded method match for `Gnome.CanvasPathDef.gnome_canvas_path_def_new_from_bpath(System.IntPtr)' has some invalid arguments
  • error 2
  • generated/CanvasPathDef.custom(24,109): error CS1615: Argument `#1' does not require `ref' modifier. Consider removing `ref' modifier
  • error 3
  • error: Bad exit status from /tmp/B.nCn7wS/BUILD/tmp/rpm-tmp.25818 (%build)
  • error 4
  • RPM build errors:
  • error 5
  • error: No files produced.

Content:

request from: baggins
checking if we should skip the build
started at: Wed Nov 29 21:15:56 2017
fetching https://srcbuilder.pld-linux.org/th//srpms/e8c9c952-8168-44e5-b566-17f0d0611f3a/dotnet-gnome-sharp-2.24.5-1.src.rpm
fetched 640290 bytes, 340.2 K/s
installing srpm: dotnet-gnome-sharp-2.24.5-1.src.rpm
mesg: ttyname failed: Inappropriate ioctl for device
+ install -d /tmp/B.nCn7wS/BUILD /tmp/B.nCn7wS/RPMS
+ LC_ALL=en_US.UTF-8
+ rpm -qp --changelog dotnet-gnome-sharp-2.24.5-1.src.rpm
* Wed Nov 29 2017 PLD Linux Team <feedback@pld-linux.org>
- For complete changelog see: http://git.pld-linux.org/?p=packages/dotnet-gnome-sharp.git;a=log;h=master
* Tue Nov 28 2017 Jakub Bogusz <qboosh@pld-linux.org> ad976d4
- updated to 2.24.5 + rpm -Uhv --nodeps --define '_topdir /tmp/B.nCn7wS' --define '_specdir %{_topdir}' --define '_sourcedir %{_specdir}' --define '_rpmdir %{_topdir}/RPMS' --define '_builddir %{_topdir}/BUILD' dotnet-gnome-sharp-2.24.5-1.src.rpm Preparing... ################################################## dotnet-gnome-sharp ################################################## + rm -f dotnet-gnome-sharp-2.24.5-1.src.rpm mesg: ttyname failed: Inappropriate ioctl for device + install -m 700 -d /tmp/B.nCn7wS/BUILD/tmp mesg: ttyname failed: Inappropriate ioctl for device + TMPDIR=/tmp/B.nCn7wS/BUILD/tmp + exec nice -n 0 rpmbuild -bp --short-circuit --nodeps --define '_topdir /tmp/B.nCn7wS' --define '_specdir %{_topdir}' --define '_sourcedir %{_specdir}' --define '_rpmdir %{_topdir}/RPMS' --define '_builddir %{_topdir}/BUILD' --target x86_64-pld-linux --define 'prep exit 0' /tmp/B.nCn7wS/dotnet-gnome-sharp.spec Building target platforms: x86_64-pld-linux checking BuildConflict-ing packages no BuildConflicts found checking BR rpm: Building target platforms: x86_64-pld-linux no BR needed building RPM using: set -ex; : build-id: e8c9c952-8168-44e5-b566-17f0d0611f3a; TMPDIR=/tmp/B.nCn7wS/BUILD/tmp exec nice -n 0 rpmbuild -bb --define '_smp_mflags -j5' --define '_make_opts -Otarget' --define '_pld_builder 1' --define '_topdir /tmp/B.nCn7wS' --define '_specdir %{_topdir}' --define '_sourcedir %{_specdir}' --define '_rpmdir %{_topdir}/RPMS' --define '_builddir %{_topdir}/BUILD' --target x86_64-pld-linux /tmp/B.nCn7wS/dotnet-gnome-sharp.spec mesg: ttyname failed: Inappropriate ioctl for device + : build-id: e8c9c952-8168-44e5-b566-17f0d0611f3a + TMPDIR=/tmp/B.nCn7wS/BUILD/tmp + exec nice -n 0 rpmbuild -bb --define '_smp_mflags -j5' --define '_make_opts -Otarget' --define '_pld_builder 1' --define '_topdir /tmp/B.nCn7wS' --define '_specdir %{_topdir}' --define '_sourcedir %{_specdir}' --define '_rpmdir %{_topdir}/RPMS' --define '_builddir %{_topdir}/BUILD' --target x86_64-pld-linux /tmp/B.nCn7wS/dotnet-gnome-sharp.spec Building target platforms: x86_64-pld-linux Executing(%prep): /bin/sh -e /tmp/B.nCn7wS/BUILD/tmp/rpm-tmp.40548 + umask 022 + cd /tmp/B.nCn7wS/BUILD + cd /tmp/B.nCn7wS/BUILD + rm -rf gnome-sharp-2.24.5 + /usr/bin/gzip -dc /tmp/B.nCn7wS/gnome-sharp-2.24.5.tar.gz + /bin/tar -xf - + STATUS=0 + '[' 0 -ne 0 ']' + cd gnome-sharp-2.24.5 + /bin/id -u + '[' 1000 '=' 0 ']' + /bin/id -u + '[' 1000 '=' 0 ']' + /bin/chmod -Rf a+rX,u+w,g-w,o-w . + echo 'Patch #0 (dotnet-gnome-sharp-destdir.patch):' Patch #0 (dotnet-gnome-sharp-destdir.patch): + '[' -f /tmp/B.nCn7wS/dotnet-gnome-sharp-destdir.patch ']' + /bin/cat /tmp/B.nCn7wS/dotnet-gnome-sharp-destdir.patch + /usr/bin/patch -s -p1 + echo 'Patch #1 (dotnet-gnome-sharp-mint.patch):' Patch #1 (dotnet-gnome-sharp-mint.patch): + '[' -f /tmp/B.nCn7wS/dotnet-gnome-sharp-mint.patch ']' + /bin/cat /tmp/B.nCn7wS/dotnet-gnome-sharp-mint.patch + /usr/bin/patch -s -p1 + exit 0 Executing(%build): /bin/sh -e /tmp/B.nCn7wS/BUILD/tmp/rpm-tmp.25818 TMP=/home/users/builder/tmp HOME=/home/users/builder PATH=/home/users/builder/GNUstep/Tools:/usr/local/bin:/usr/bin:/bin:/home/users/builder/bin TMPDIR=/tmp/B.nCn7wS/BUILD/tmp + umask 022 + cd /tmp/B.nCn7wS/BUILD + cd gnome-sharp-2.24.5 + libtoolize --copy --force --install libtoolize: putting auxiliary files in '.'. libtoolize: copying file './config.guess' libtoolize: copying file './config.sub' libtoolize: copying file './install-sh' libtoolize: copying file './ltmain.sh' libtoolize: Consider adding 'AC_CONFIG_MACRO_DIRS([m4])' to configure.in, libtoolize: and rerunning libtoolize and aclocal. libtoolize: Consider adding '-I m4' to ACLOCAL_AMFLAGS in Makefile.am. + aclocal aclocal: warning: autoconf input should be named 'configure.ac', not 'configure.in' + autoconf + autoheader + automake -a -c -f --foreign automake: warning: autoconf input should be named 'configure.ac', not 'configure.in' configure.in:5: warning: AM_INIT_AUTOMAKE: two- and three-arguments forms are deprecated. For more info, see: configure.in:5: http://www.gnu.org/software/automake/manual/automake.html#Modernize-AM_005fINIT_005fAUTOMAKE-invocation configure.in:31: installing './compile' configure.in:5: installing './missing' automake: warning: autoconf input should be named 'configure.ac', not 'configure.in' gnome/glue/Makefile.am:21: warning: 'INCLUDES' is the old name for 'AM_CPPFLAGS' (or '*_CPPFLAGS') gnome/glue/Makefile.am: installing './depcomp' + ./configure 'LDFLAGS=-Wl,--as-needed -Wl,--no-copy-dt-needed-entries -Wl,-z,relro -Wl,-z,combreloc ' 'CFLAGS=-O2 -fwrapv -pipe -Wformat -Werror=format-security -gdwarf-4 -fno-debug-types-section -fvar-tracking-assignments -g2 -Wp,-D_FORTIFY_SOURCE=2 -fstack-protector-strong --param=ssp-buffer-size=4 -fPIC -march=x86-64 -gdwarf-4 -fno-debug-types-section -fvar-tracking-assignments -g2 ' 'CXXFLAGS=-O2 -fwrapv -pipe -Wformat -Werror=format-security -gdwarf-4 -fno-debug-types-section -fvar-tracking-assignments -g2 -Wp,-D_FORTIFY_SOURCE=2 -fstack-protector-strong --param=ssp-buffer-size=4 -fPIC -march=x86-64 -gdwarf-4 -fno-debug-types-section -fvar-tracking-assignments -g2 ' 'FFLAGS=-O2 -fwrapv -pipe -Wformat -Werror=format-security -gdwarf-4 -fno-debug-types-section -fvar-tracking-assignments -g2 -Wp,-D_FORTIFY_SOURCE=2 -fstack-protector-strong --param=ssp-buffer-size=4 -fPIC -march=x86-64 -gdwarf-4 -fno-debug-types-section -fvar-tracking-assignments -g2 ' 'FCFLAGS=-O2 -fwrapv -pipe -Wformat -Werror=format-security -gdwarf-4 -fno-debug-types-section -fvar-tracking-assignments -g2 -Wp,-D_FORTIFY_SOURCE=2 -fstack-protector-strong --param=ssp-buffer-size=4 -fPIC -march=x86-64 -gdwarf-4 -fno-debug-types-section -fvar-tracking-assignments -g2 ' 'CPPFLAGS=' 'CC=x86_64-pld-linux-gcc' 'CXX=x86_64-pld-linux-g++' '--host=x86_64-pld-linux' '--build=x86_64-pld-linux' '--prefix=/usr' '--exec-prefix=/usr' '--bindir=/usr/bin' '--sbindir=/usr/sbin' '--sysconfdir=/etc' '--datadir=/usr/share' '--includedir=/usr/include' '--libdir=/usr/lib64' '--libexecdir=/usr/libexec' '--localstatedir=/var' '--sharedstatedir=/var/lib' '--mandir=/usr/share/man' '--infodir=/usr/share/info' '--x-libraries=/usr/lib64' checking build system type... x86_64-pld-linux-gnu checking host system type... x86_64-pld-linux-gnu checking target system type... x86_64-pld-linux-gnu checking for a BSD-compatible install... /usr/bin/install -c checking whether build environment is sane... yes checking for a thread-safe mkdir -p... /bin/mkdir -p checking for mawk... mawk checking whether make sets $(MAKE)... yes checking whether make supports nested variables... yes checking whether to enable maintainer-specific portions of Makefiles... no checking for x86_64-pld-linux-gcc... x86_64-pld-linux-gcc checking for x86_64-pld-linux-gcc... (cached) x86_64-pld-linux-gcc checking whether the C compiler works... yes checking for C compiler default output file name... a.out checking for suffix of executables... checking whether we are cross compiling... no checking for suffix of object files... o checking whether we are using the GNU C compiler... yes checking whether x86_64-pld-linux-gcc accepts -g... yes checking for x86_64-pld-linux-gcc option to accept ISO C89... none needed checking whether x86_64-pld-linux-gcc understands -c and -o together... yes checking for style of include used by make... GNU checking dependency style of x86_64-pld-linux-gcc... gcc3 checking for x86_64-pld-linux-gcc... (cached) x86_64-pld-linux-gcc checking whether we are using the GNU C compiler... (cached) yes checking whether x86_64-pld-linux-gcc accepts -g... (cached) yes checking for x86_64-pld-linux-gcc option to accept ISO C89... (cached) none needed checking whether x86_64-pld-linux-gcc understands -c and -o together... (cached) yes checking dependency style of x86_64-pld-linux-gcc... (cached) gcc3 checking how to run the C preprocessor... x86_64-pld-linux-gcc -E checking for grep that handles long lines and -e... /bin/grep checking for egrep... /bin/grep -E checking for ANSI C header files... yes checking how to print strings... print -r checking for a sed that does not truncate output... /bin/sed checking for fgrep... /bin/grep -F checking for ld used by x86_64-pld-linux-gcc... /usr/bin/ld checking if the linker (/usr/bin/ld) is GNU ld... yes checking for BSD- or MS-compatible name lister (nm)... /usr/bin/nm -B checking the name lister (/usr/bin/nm -B) interface... BSD nm checking whether ln -s works... yes checking the maximum length of command line arguments... 1572864 checking how to convert x86_64-pld-linux-gnu file names to x86_64-pld-linux-gnu format... func_convert_file_noop checking how to convert x86_64-pld-linux-gnu file names to toolchain format... func_convert_file_noop checking for /usr/bin/ld option to reload object files... -r checking for x86_64-pld-linux-objdump... objdump checking how to recognize dependent libraries... pass_all checking for x86_64-pld-linux-dlltool... dlltool checking how to associate runtime and link libraries... print -r -- checking for x86_64-pld-linux-ar... no checking for ar... ar checking for archiver @FILE support... @ checking for x86_64-pld-linux-strip... no checking for strip... strip checking for x86_64-pld-linux-ranlib... no checking for ranlib... ranlib checking command to parse /usr/bin/nm -B output from x86_64-pld-linux-gcc object... ok checking for sysroot... no checking for a working dd... /bin/dd checking how to truncate binary pipes... /bin/dd bs=4096 count=1 checking for x86_64-pld-linux-mt... no checking for mt... no checking if : is a manifest tool... no checking for sys/types.h... yes checking for sys/stat.h... yes checking for stdlib.h... yes checking for string.h... yes checking for memory.h... yes checking for strings.h... yes checking for inttypes.h... yes checking for stdint.h... yes checking for unistd.h... yes checking for dlfcn.h... yes checking for objdir... .libs checking if x86_64-pld-linux-gcc supports -fno-rtti -fno-exceptions... no checking for x86_64-pld-linux-gcc option to produce PIC... -fPIC -DPIC checking if x86_64-pld-linux-gcc PIC flag -fPIC -DPIC works... yes checking if x86_64-pld-linux-gcc static flag -static works... yes checking if x86_64-pld-linux-gcc supports -c -o file.o... yes checking if x86_64-pld-linux-gcc supports -c -o file.o... (cached) yes checking whether the x86_64-pld-linux-gcc linker (/usr/bin/ld -m elf_x86_64) supports shared libraries... yes checking whether -lc should be explicitly linked in... no checking dynamic linker characteristics... GNU/Linux ld.so checking how to hardcode library paths into programs... immediate checking whether stripping libraries is possible... yes checking if libtool supports shared libraries... yes checking whether to build shared libraries... yes checking whether to build static libraries... yes checking size of void *... 8 checking for pkg-config... /usr/bin/pkg-config checking for x86_64-pld-linux-pkg-config... (cached) /usr/bin/pkg-config checking pkg-config is at least version 0.9.0... yes checking for mono >= 2.7... yes checking for mint >= 2.7... no checking for mint >= 1.0... no checking for gacutil... /usr/bin/gacutil checking for al... /usr/bin/al checking for mono... /usr/bin/mono checking for mcs... /usr/bin/mcs checking for mono-cairo >= 1.0... yes checking for gtk-sharp-2.0 >= 2.12.2... yes checking for glade-sharp-2.0 >= 2.12.2... yes checking for gapi-2.0 >= 2.12.2... yes checking for gapi2-parser... /usr/bin/gapi2-parser checking for gapi2-codegen... /usr/bin/gapi2-codegen checking for gapi2-fixup... /usr/bin/gapi2-fixup checking for libart-2.0 >= 2.3.20... yes checking for gnome-vfs-2.0 >= 2.22.0... yes checking for libgnomecanvas-2.0 >= 2.20.0 libgnomeui-2.0 >= 2.23.0 gtk+-2.0 >= 2.13.0 gmodule-2.0 >= 2.13.0... yes checking that generated files are newer than configure... done configure: creating ./config.status config.status: creating AssemblyInfo.cs config.status: creating Makefile config.status: creating policy.config config.status: creating sources/Makefile config.status: creating art/Makefile config.status: creating art/art-sharp.dll.config config.status: creating art/art-sharp-2.0.pc config.status: creating gnome/Makefile config.status: creating gnome/gnome-sharp.dll.config config.status: creating gnome/gnome-sharp-2.0.pc config.status: creating gnome/glue/Makefile config.status: creating gnomevfs/Makefile config.status: creating gnomevfs/gnome-vfs-sharp.dll.config config.status: creating gnomevfs/gnome-vfs-sharp-2.0.pc config.status: creating gconf/Makefile config.status: creating gconf/doc/Makefile config.status: creating gconf/GConf/Makefile config.status: creating gconf/GConf/gconf-sharp.dll.config config.status: creating gconf/GConf/gconf-sharp-2.0.pc config.status: creating gconf/GConf.PropertyEditors/Makefile config.status: creating gconf/GConf.PropertyEditors/gconf-sharp-peditors-2.0.pc config.status: creating gconf/tools/Makefile config.status: creating gconf/tools/gconfsharp2-schemagen config.status: creating sample/Makefile config.status: creating sample/gconf/Makefile config.status: creating sample/gnomevfs/Makefile config.status: creating config.h config.status: executing depfiles commands config.status: executing libtool commands --- Configuration summary * Installation prefix = /usr * C# compiler: /usr/bin/mcs -define:GTK_SHARP_2_6 -define:GTK_SHARP_2_8 -define:GNOME_SHARP_2_16 -define:GNOME_SHARP_2_20 -define:GNOME_SHARP_2_24 Optional assemblies included in the build: * art-sharp.dll: yes * gnomevfs-sharp.dll: yes * gnome-sharp.dll: yes NOTE: if any of the above say 'no' you may install the corresponding development packages for them, rerun autogen.sh to include them in the build. gnome-sharp.dll requires libgnomecanvas, libgnome, and libgnomeui. --- + /usr/bin/make -Otarget -j5 -j 1 /usr/bin/make all-recursive make[1]: Entering directory '/tmp/B.nCn7wS/BUILD/gnome-sharp-2.24.5' Making all in sources make[2]: Entering directory '/tmp/B.nCn7wS/BUILD/gnome-sharp-2.24.5/sources' make[2]: Nothing to be done for 'all'. make[2]: Leaving directory '/tmp/B.nCn7wS/BUILD/gnome-sharp-2.24.5/sources' Making all in art make[2]: Entering directory '/tmp/B.nCn7wS/BUILD/gnome-sharp-2.24.5/art' cp ./art-api.raw art-api.xml chmod u+w art-api.xml /usr/bin/gapi2-fixup --api=art-api.xml --metadata=./Art.metadata --symbols=./art-symbols.xml rm -f generated/* && \ /usr/bin/gapi2-codegen --generate art-api.xml \ -I:/usr/lib64/pkgconfig/../../share/gapi-2.0/pango-api.xml -I:/usr/lib64/pkgconfig/../../share/gapi-2.0/atk-api.xml -I:/usr/lib64/pkgconfig/../../share/gapi-2.0/gdk-api.xml -I:/usr/lib64/pkgconfig/../../share/gapi-2.0/gtk-api.xml -I:/usr/lib64/pkgconfig/../../share/gapi-2.0/glib-api.xml \ --outdir=generated --customdir=. --assembly-name=art-sharp \ --gluelib-name=artsharpglue-2 --glue-filename=glue/generated.c \ --glue-includes= \ && touch generated-stamp Simple type element art_u8 has no specified default value Simple type element art_u32 has no specified default value Unable to create specified glue file. Glue will not be generated. Defaulting DestroyNotify param to 'call' scope in method PixBuf.art_pixbuf_new_rgb_dnotify Defaulting DestroyNotify param to 'call' scope in method PixBuf.art_pixbuf_new_rgba_dnotify Defaulting RenderAaCallback param to 'call' scope in method SVP.RenderAa Generation Summary: Enums: 10 Structs: 20 Boxed: 0 Opaques: 2 Interfaces: 0 Objects: 0 Callbacks: 2 Properties: 0 Signals: 0 Methods: 92 Constructors: 11 Throttled: 0 Total Nodes: 137 cp ../gtk-sharp.snk . cp ../AssemblyInfo.cs . /usr/bin/mcs -define:GTK_SHARP_2_6 -define:GTK_SHARP_2_8 -define:GNOME_SHARP_2_16 -define:GNOME_SHARP_2_20 -define:GNOME_SHARP_2_24 -nowarn:0169,0612,0618 -unsafe -out:art-sharp.dll -target:library -r:/usr/lib64/pkgconfig/../../lib/mono/gtk-sharp-2.0/pango-sharp.dll -r:/usr/lib64/pkgconfig/../../lib/mono/gtk-sharp-2.0/atk-sharp.dll -r:/usr/lib64/pkgconfig/../../lib/mono/gtk-sharp-2.0/gdk-sharp.dll -r:/usr/lib64/pkgconfig/../../lib/mono/gtk-sharp-2.0/gtk-sharp.dll -r:/usr/lib64/pkgconfig/../../lib/mono/gtk-sharp-2.0/glib-sharp.dll -r:Mono.Cairo generated/*.cs AssemblyInfo.cs AssemblyInfo.cs(6,11): warning CS1699: Use compiler option `keyfile' or appropriate project settings instead of `AssemblyKeyFile' attribute Compilation succeeded - 1 warning(s) sed -e "s/@ASSEMBLY_NAME@/art-sharp/" -e "s/@POLICY@/2.4/" ../policy.config > policy.2.4.config /usr/bin/al -link:policy.2.4.config -out:policy.2.4.art-sharp.dll -keyfile:gtk-sharp.snk ALINK: warning A99999: Path 'policy.2.4.config' in the resource name is not supported. Using just file name 'policy.2.4.config' sed -e "s/@ASSEMBLY_NAME@/art-sharp/" -e "s/@POLICY@/2.6/" ../policy.config > policy.2.6.config /usr/bin/al -link:policy.2.6.config -out:policy.2.6.art-sharp.dll -keyfile:gtk-sharp.snk ALINK: warning A99999: Path 'policy.2.6.config' in the resource name is not supported. Using just file name 'policy.2.6.config' sed -e "s/@ASSEMBLY_NAME@/art-sharp/" -e "s/@POLICY@/2.8/" ../policy.config > policy.2.8.config /usr/bin/al -link:policy.2.8.config -out:policy.2.8.art-sharp.dll -keyfile:gtk-sharp.snk ALINK: warning A99999: Path 'policy.2.8.config' in the resource name is not supported. Using just file name 'policy.2.8.config' sed -e "s/@ASSEMBLY_NAME@/art-sharp/" -e "s/@POLICY@/2.16/" ../policy.config > policy.2.16.config /usr/bin/al -link:policy.2.16.config -out:policy.2.16.art-sharp.dll -keyfile:gtk-sharp.snk ALINK: warning A99999: Path 'policy.2.16.config' in the resource name is not supported. Using just file name 'policy.2.16.config' sed -e "s/@ASSEMBLY_NAME@/art-sharp/" -e "s/@POLICY@/2.20/" ../policy.config > policy.2.20.config /usr/bin/al -link:policy.2.20.config -out:policy.2.20.art-sharp.dll -keyfile:gtk-sharp.snk ALINK: warning A99999: Path 'policy.2.20.config' in the resource name is not supported. Using just file name 'policy.2.20.config' make[2]: Leaving directory '/tmp/B.nCn7wS/BUILD/gnome-sharp-2.24.5/art' Making all in gnomevfs make[2]: Entering directory '/tmp/B.nCn7wS/BUILD/gnome-sharp-2.24.5/gnomevfs' Making all in . make[3]: Entering directory '/tmp/B.nCn7wS/BUILD/gnome-sharp-2.24.5/gnomevfs' cp ./gnome-vfs-api.raw gnome-vfs-api.xml chmod u+w gnome-vfs-api.xml /usr/bin/gapi2-fixup --api=gnome-vfs-api.xml --metadata=./Gnomevfs.metadata --symbols=./gnomevfs-symbols.xml Warning: <remove-node path="/api/namespace/callback[@cname='GnomeVFSProcessCallback']"/> matched no nodes Warning: <remove-node path="/api/namespace/callback[@cname='GnomeVFSProcessInitFunc']"/> matched no nodes Warning: <attr path="/api/namespace/alias[@cname='XdgUchar8T']"/> matched no nodes Warning: <attr path="/api/namespace/alias[@cname='XdgUint16T']"/> matched no nodes Warning: <attr path="/api/namespace/alias[@cname='XdgUint32T']"/> matched no nodes Warning: <attr path="/api/namespace/alias[@cname='XdgUnicharT']"/> matched no nodes Warning: <attr path="/api/namespace/enum[@cname='GnomeVFSProcessOptions']"/> matched no nodes Warning: <attr path="/api/namespace/enum[@cname='GnomeVFSProcessResult']"/> matched no nodes Warning: <attr path="/api/namespace/enum[@cname='GnomeVFSProcessRunResult']"/> matched no nodes Warning: <attr path="/api/namespace/object[@cname='GnomeVFSClient']"/> matched no nodes Warning: <attr path="/api/namespace/object[@cname='GnomeVFSClientCall']"/> matched no nodes Warning: <attr path="/api/namespace/struct[@cname='GnomeVFSMimeAction']/field[@cname='action']"/> matched no nodes Warning: <attr path="/api/namespace/struct[@cname='GnomeVFSProcess']"/> matched no nodes rm -f generated/* && \ /usr/bin/gapi2-codegen --generate gnome-vfs-api.xml \ -I:/usr/lib64/pkgconfig/../../share/gapi-2.0/pango-api.xml -I:/usr/lib64/pkgconfig/../../share/gapi-2.0/atk-api.xml -I:/usr/lib64/pkgconfig/../../share/gapi-2.0/gdk-api.xml -I:/usr/lib64/pkgconfig/../../share/gapi-2.0/gtk-api.xml -I:/usr/lib64/pkgconfig/../../share/gapi-2.0/glib-api.xml \ --outdir=generated --customdir=. --assembly-name=gnome-vfs-sharp \ --gluelib-name=gnome-vfssharpglue-2 --glue-filename=glue/generated.c \ --glue-includes= \ && touch generated-stamp Name: cancellation Type: GnomeVFSCancellation* in callback GnomeVFSSocketSetTimeoutFunc Name: ace Type: GnomeVFSACE* in gnome_vfs_acl_unset in method Unset in type Gnome.Vfs.ACL Name: ace Type: GnomeVFSACE* in gnome_vfs_acl_set in method Set in type Gnome.Vfs.ACL Name: sa Type: sockaddr* in gnome_vfs_address_new_from_sockaddr in type Gnome.Vfs.Address rettype: GnomeVFSCancellation* in method GetCancellation in type Gnome.Vfs.Context Name: kind Type: GnomeVFSFindDirectoryKind in gnome_vfs_find_directory_cancellable in method FindDirectoryCancellable in type Gnome.Vfs.Global Name: optional_stat_info Type: stat* in gnome_vfs_get_file_mime_type in method GetFileMimeType in type Gnome.Vfs.Global Name: buffer Type: GnomeVFSMimeSniffBuffer* in gnome_vfs_get_mime_type_for_buffer in method GetMimeTypeForBuffer in type Gnome.Vfs.Global Name: optional_stat_info Type: stat* in gnome_vfs_get_file_mime_type_fast in method GetFileMimeTypeFast in type Gnome.Vfs.Global Name: kind Type: GnomeVFSFindDirectoryKind in gnome_vfs_find_directory in method FindDirectory in type Gnome.Vfs.Global Name: statptr Type: stat* in gnome_vfs_stat_to_file_info in method StatToFileInfo in type Gnome.Vfs.Global Name: child Type: pid_t* in gnome_vfs_pty_open in method PtyOpen in type Gnome.Vfs.Global Name: s Type: stat* in gnome_vfs_parse_ls_lga in method ParseLsLga in type Gnome.Vfs.Global Name: message Type: DBusMessage* in gnome_vfs_daemon_message_append_file_info in method MessageAppendFileInfo in type Gnome.Vfs.Daemon Name: iter Type: DBusMessageIter* in gnome_vfs_daemon_message_iter_append_file_info in method MessageIterAppendFileInfo in type Gnome.Vfs.Daemon Name: conn Type: DBusConnection* in gnome_vfs_daemon_set_current_connection in method SetCurrentConnection in type Gnome.Vfs.Daemon Name: iter Type: DBusMessageIter* in gnome_vfs_daemon_message_iter_get_file_info in method MessageIterGetFileInfo in type Gnome.Vfs.Daemon Name: dirs Type: GnomeVFSMakeURIDirs in gnome_vfs_make_uri_from_input_with_dirs in method UriFromInputWithDirs in type Gnome.Vfs.Make Name: mode Type: mode_t in gnome_vfs_mime_type_from_mode in method TypeFromMode in type Gnome.Vfs.Mime Name: mode Type: mode_t in gnome_vfs_mime_type_from_mode_or_default in method TypeFromModeOrDefault in type Gnome.Vfs.Mime Name: cb Type: GnomeVFSModuleCallback in gnome_vfs_module_callback_set_default in method CallbackSetDefault in type Gnome.Vfs.Module Name: cb Type: GnomeVFSModuleCallback in gnome_vfs_module_callback_push in method CallbackPush in type Gnome.Vfs.Module Unable to create specified glue file. Glue will not be generated. Defaulting VolumeOpCallback param to 'call' scope in method Drive.Mount Defaulting VolumeOpCallback param to 'call' scope in method Drive.Eject Defaulting VolumeOpCallback param to 'call' scope in method Drive.Unmount Defaulting VolumeOpCallback param to 'call' scope in method Volume.Unmount Defaulting VolumeOpCallback param to 'call' scope in method Volume.Eject Generation Summary: Enums: 28 Structs: 5 Boxed: 0 Opaques: 12 Interfaces: 0 Objects: 5 Callbacks: 11 Properties: 0 Signals: 9 Methods: 276 Constructors: 7 Throttled: 21 Total Nodes: 374 cp ../gtk-sharp.snk . cp ../AssemblyInfo.cs . /usr/bin/mcs -define:GTK_SHARP_2_6 -define:GTK_SHARP_2_8 -define:GNOME_SHARP_2_16 -define:GNOME_SHARP_2_20 -define:GNOME_SHARP_2_24 -nowarn:0169,0612,0618 -unsafe -out:gnome-vfs-sharp.dll -target:library -r:/usr/lib64/pkgconfig/../../lib/mono/gtk-sharp-2.0/pango-sharp.dll -r:/usr/lib64/pkgconfig/../../lib/mono/gtk-sharp-2.0/atk-sharp.dll -r:/usr/lib64/pkgconfig/../../lib/mono/gtk-sharp-2.0/gdk-sharp.dll -r:/usr/lib64/pkgconfig/../../lib/mono/gtk-sharp-2.0/gtk-sharp.dll -r:/usr/lib64/pkgconfig/../../lib/mono/gtk-sharp-2.0/glib-sharp.dll -r:Mono.Cairo generated/*.cs ./Async.cs ./AsyncCallback.cs ./AsyncCallbackNative.cs ./AsyncDirectoryLoadCallback.cs ./AsyncDirectoryLoadCallbackNative.cs ./AsyncReadCallback.cs ./AsyncReadCallbackNative.cs ./AsyncWriteCallback.cs ./AsyncWriteCallbackNative.cs ./Directory.cs ./FileInfo.cs ./MimeType.cs ./ModuleCallback.cs ./ModuleCallbackAuthentication.cs ./ModuleCallbackFillAuthentication.cs ./ModuleCallbackFullAuthentication.cs ./ModuleCallbackSaveAuthentication.cs ./ModuleCallbackStatusMessage.cs ./Monitor.cs ./Sync.cs ./Vfs.cs ./VfsException.cs ./VfsStream.cs ./VfsStreamAsyncResult.cs ./Xfer.cs ./XferProgressCallback.cs ./XferProgressCallbackNative.cs AssemblyInfo.cs AssemblyInfo.cs(6,11): warning CS1699: Use compiler option `keyfile' or appropriate project settings instead of `AssemblyKeyFile' attribute ./VfsStream.cs(33,18): warning CS0649: Field `Gnome.Vfs.VfsStreamAsync.state' is never assigned to, and will always have its default value `null' ./VfsStream.cs(118,20): warning CS0414: The private field `Gnome.Vfs.VfsStream.mode' is assigned but its value is never used Compilation succeeded - 3 warning(s) sed -e "s/@ASSEMBLY_NAME@/gnome-vfs-sharp/" -e "s/@POLICY@/2.4/" ../policy.config > policy.2.4.config /usr/bin/al -link:policy.2.4.config -out:policy.2.4.gnome-vfs-sharp.dll -keyfile:gtk-sharp.snk ALINK: warning A99999: Path 'policy.2.4.config' in the resource name is not supported. Using just file name 'policy.2.4.config' sed -e "s/@ASSEMBLY_NAME@/gnome-vfs-sharp/" -e "s/@POLICY@/2.6/" ../policy.config > policy.2.6.config /usr/bin/al -link:policy.2.6.config -out:policy.2.6.gnome-vfs-sharp.dll -keyfile:gtk-sharp.snk ALINK: warning A99999: Path 'policy.2.6.config' in the resource name is not supported. Using just file name 'policy.2.6.config' sed -e "s/@ASSEMBLY_NAME@/gnome-vfs-sharp/" -e "s/@POLICY@/2.8/" ../policy.config > policy.2.8.config /usr/bin/al -link:policy.2.8.config -out:policy.2.8.gnome-vfs-sharp.dll -keyfile:gtk-sharp.snk ALINK: warning A99999: Path 'policy.2.8.config' in the resource name is not supported. Using just file name 'policy.2.8.config' sed -e "s/@ASSEMBLY_NAME@/gnome-vfs-sharp/" -e "s/@POLICY@/2.16/" ../policy.config > policy.2.16.config /usr/bin/al -link:policy.2.16.config -out:policy.2.16.gnome-vfs-sharp.dll -keyfile:gtk-sharp.snk ALINK: warning A99999: Path 'policy.2.16.config' in the resource name is not supported. Using just file name 'policy.2.16.config' sed -e "s/@ASSEMBLY_NAME@/gnome-vfs-sharp/" -e "s/@POLICY@/2.20/" ../policy.config > policy.2.20.config /usr/bin/al -link:policy.2.20.config -out:policy.2.20.gnome-vfs-sharp.dll -keyfile:gtk-sharp.snk ALINK: warning A99999: Path 'policy.2.20.config' in the resource name is not supported. Using just file name 'policy.2.20.config' make[3]: Leaving directory '/tmp/B.nCn7wS/BUILD/gnome-sharp-2.24.5/gnomevfs' make[2]: Leaving directory '/tmp/B.nCn7wS/BUILD/gnome-sharp-2.24.5/gnomevfs' Making all in gnome make[2]: Entering directory '/tmp/B.nCn7wS/BUILD/gnome-sharp-2.24.5/gnome' Making all in . make[3]: Entering directory '/tmp/B.nCn7wS/BUILD/gnome-sharp-2.24.5/gnome' cp ./gnome-api.raw gnome-api.xml chmod u+w gnome-api.xml /usr/bin/gapi2-fixup --api=gnome-api.xml --metadata=./Gnome.metadata rm -f generated/* && \ /usr/bin/gapi2-codegen --generate gnome-api.xml \ -I:/usr/lib64/pkgconfig/../../share/gapi-2.0/pango-api.xml -I:/usr/lib64/pkgconfig/../../share/gapi-2.0/atk-api.xml -I:/usr/lib64/pkgconfig/../../share/gapi-2.0/gdk-api.xml -I:/usr/lib64/pkgconfig/../../share/gapi-2.0/gtk-api.xml -I:/usr/lib64/pkgconfig/../../share/gapi-2.0/glib-api.xml -I:../art/art-api.xml -I:../gnomevfs/gnome-vfs-api.xml \ --outdir=generated --customdir=. --assembly-name=gnome-sharp \ --gluelib-name=gnomesharpglue-2 --glue-filename=glue/generated.c \ --glue-includes=gnome.h \ && touch generated-stamp Simple type element art_u8 has no specified default value Simple type element art_u32 has no specified default value rettype: GOptionGroup*rettype: GOptionGroup* in callback GnomeModuleGetGOptionGroupFunc rettype: poptContext in method Preinit in type Gnome.Program Ellipsis parameter in gnome_program_init in method Init in type Gnome.Program Name: parms Type: GParameter* in gnome_program_init_paramv in method InitParamv in type Gnome.Program Name: pclass Type: GnomeProgramClass* in gnome_program_install_property in method InstallProperty in type Gnome.Program Name: Pass Type: /* in gnome_score_log in method Log in type Gnome.Score Ellipsis parameter in gnome_triggers_add_trigger in method AddTrigger in type Gnome.Triggers Ellipsis parameter in gnome_triggers_do in method Do in type Gnome.Triggers Ellipsis parameter in gnome_canvas_item_set in method Set in type Gnome.CanvasItem Nameless signal in type Gnome.CanvasRichText Property has unknown Type value_array in type Gnome.About Property has unknown Type value_array in type Gnome.About Name: behavior Type: BonoboDockItemBehavior in gnome_app_add_docked in method AddDocked in type Gnome.App Name: item Type: BonoboDockItem* in gnome_app_add_dock_item in method AddDockItem in type Gnome.App Name: behavior Type: BonoboDockItemBehavior in gnome_app_add_toolbar in method AddToolbar in type Gnome.App rettype: BonoboDockItem* in method GetDockItemByName in type Gnome.App Name: dock_item Type: BonoboDockItem* in gnome_app_setup_toolbar in method SetupToolbar in type Gnome.App rettype: BonoboDock* in method GetDock in type Gnome.App Ellipsis parameter in gnome_client_add_static_arg in method AddStaticArg in type Gnome.Client Name: pid Type: pid_t in gnome_client_set_process_id in method SetProcessId in type Gnome.Client rettype: GtkVisibility in method IconIsVisible in type Gnome.IconList Name: Name Type: /* in gnome_scores_display in method Display in type Gnome.Scores Name: options Type: poptOption* in gnome_init_with_popt_table in method InitWithPoptTable in type Gnome.Global Defaulting CallbackMarshal param to 'call' scope in method App.CreateToolbarInterp Defaulting DestroyNotify param to 'call' scope in method App.CreateToolbarInterp Defaulting CallbackMarshal param to 'call' scope in method App.CreateMenusInterp Defaulting DestroyNotify param to 'call' scope in method App.CreateMenusInterp Defaulting CallbackMarshal param to 'call' scope in method App.InsertMenusInterp Defaulting DestroyNotify param to 'call' scope in method App.InsertMenusInterp Defaulting CallbackMarshal param to 'call' scope in method Client.RequestInteractionInterp Defaulting DestroyNotify param to 'call' scope in method Client.RequestInteractionInterp Defaulting InteractFunction param to 'call' scope in method Client.RequestInteraction Defaulting ThemeFileLineFunc param to 'call' scope in method ThemeFile.ForeachKey Defaulting ThemeFileSectionFunc param to 'call' scope in method ThemeFile.ForeachSection Defaulting GdkPixbufLoadCallback param to 'call' scope in method GdkHelper.PixbufNewFromUriAsync Defaulting GdkPixbufDoneCallback param to 'call' scope in method GdkHelper.PixbufNewFromUriAsync Defaulting MenuPositionFunc param to 'call' scope in method Popup.MenuDoPopup Defaulting MenuPositionFunc param to 'call' scope in method Popup.MenuDoPopupModal Generation Summary: Enums: 23 Structs: 7 Boxed: 0 Opaques: 9 Interfaces: 0 Objects: 39 Callbacks: 10 Properties: 210 Signals: 46 Methods: 447 Constructors: 27 Throttled: 19 Total Nodes: 837 cp ../gtk-sharp.snk . cp ../AssemblyInfo.cs . /usr/bin/mcs -define:GTK_SHARP_2_6 -define:GTK_SHARP_2_8 -define:GNOME_SHARP_2_16 -define:GNOME_SHARP_2_20 -define:GNOME_SHARP_2_24 -nowarn:0169,0612,0618 -unsafe -out:gnome-sharp.dll -target:library -r:/usr/lib64/pkgconfig/../../lib/mono/gtk-sharp-2.0/pango-sharp.dll -r:/usr/lib64/pkgconfig/../../lib/mono/gtk-sharp-2.0/atk-sharp.dll -r:/usr/lib64/pkgconfig/../../lib/mono/gtk-sharp-2.0/gdk-sharp.dll -r:/usr/lib64/pkgconfig/../../lib/mono/gtk-sharp-2.0/gtk-sharp.dll -r:/usr/lib64/pkgconfig/../../lib/mono/gtk-sharp-2.0/glib-sharp.dll /r:../art/art-sharp.dll /r:../gnomevfs/gnome-vfs-sharp.dll -r:Mono.Cairo generated/*.cs ./BonoboUIVerb.cs ./IconTheme.cs ./Modules.cs AssemblyInfo.cs AssemblyInfo.cs(6,11): warning CS1699: Use compiler option `keyfile' or appropriate project settings instead of `AssemblyKeyFile' attribute generated/App.cs(124,17): warning CS0108: `Gnome.App.Name' hides inherited member `Gtk.Widget.Name'. Use the new keyword if hiding was intended /usr/lib64/pkgconfig/../../lib/mono/gtk-sharp-2.0/gtk-sharp.dll (Location of the symbol related to previous warning) generated/ThemeFile.cs(56,26): warning CS0809: Obsolete member `Gnome.ThemeFile.ToString()' overrides non-obsolete member `object.ToString()' /usr/lib/mono/4.5/mscorlib.dll (Location of the symbol related to previous warning) generated/CanvasPathDef.custom(24,67): error CS1502: The best overloaded method match for `Gnome.CanvasPathDef.gnome_canvas_path_def_new_from_bpath(System.IntPtr)' has some invalid arguments generated/CanvasPathDef.cs(263,24): (Location of the symbol related to previous error) generated/CanvasPathDef.custom(24,109): error CS1615: Argument `#1' does not require `ref' modifier. Consider removing `ref' modifier Compilation failed: 2 error(s), 3 warnings make[3]: *** [Makefile:845: gnome-sharp.dll] Error 1 make[3]: Leaving directory '/tmp/B.nCn7wS/BUILD/gnome-sharp-2.24.5/gnome' make[2]: *** [Makefile:539: all-recursive] Error 1 make[2]: Leaving directory '/tmp/B.nCn7wS/BUILD/gnome-sharp-2.24.5/gnome' make[1]: *** [Makefile:452: all-recursive] Error 1 make[1]: Leaving directory '/tmp/B.nCn7wS/BUILD/gnome-sharp-2.24.5' make: *** [Makefile:380: all] Error 2 error: Bad exit status from /tmp/B.nCn7wS/BUILD/tmp/rpm-tmp.25818 (%build) RPM build errors: Bad exit status from /tmp/B.nCn7wS/BUILD/tmp/rpm-tmp.25818 (%build) ended at: Wed Nov 29 21:16:15 2017, done in 0:00:14.533339 error: No files produced. mesg: ttyname failed: Inappropriate ioctl for device + chmod -R u+rwX /tmp/B.nCn7wS/BUILD + rm -rf /tmp/B.nCn7wS/tmp /tmp/B.nCn7wS/BUILD mesg: ttyname failed: Inappropriate ioctl for device + rm -rf /tmp/B.nCn7wS Begin-PLD-Builder-Info Build-Time: user:10.56s sys:1.12s real:19.00s (faults io:3 non-io:738968) End-PLD-Builder-Info
[Back to list of logs] [View rpm -qa of builder]