FailedOk

th/SRPMS[OK]
th/x32[OK]
th/i686[OK]
th/x86_64[OK]

ac/SRPMS[OK]
ac/i386[OK]
ac/i586[OK]
ac/i686[OK]
ac/alpha[OK]
ac/amd64[OK]
ac/athlon[OK]
ac/ppc[OK]
ac/sparc[OK]
ac/sparc64[OK]

Advanced Search
main()
Powered by PLD Linux
(c) 2002-2018 PLD Team
$Revision: 1.37 $
Powered by computron.
Your IP: 54.198.15.20

dovecot-antispam c4827ecc-58f8-4eb3-98e8-c6613dfa3def

Status:Failed
Source URL:ftp://buildlogs.pld-linux.org/th/x86_64/FAIL/dovecot-antispam,c4827ecc-58f8-4eb3-98e8-c6613dfa3def.bz2
text/plain URL:View!
full text:View!
rpm -qa of builder:View!
Date:2018/08/04 21:53:04
Runtime:0:00:00.812659

Toc:

  • error 1
  • dovecot-version.h:17:28: fatal error: antispam-storage-2.3.c: No such file or directory
  • error 2
  • compilation terminated.
  • error 3
  • antispam-plugin.h:284:2: error: #error "Building against this dovecot version is not supported"
  • error 4
  • antispam-plugin.h:284:2: error: #error "Building against this dovecot version is not supported"
  • error 5
  • antispam-plugin.h:284:2: error: #error "Building against this dovecot version is not supported"
  • error 6
  • pipe.c:153:16: error: 'TEMP' undeclared (first use in this function)
  • error 7
  • pipe.c:153:21: error: expected ')' before string constant
  • error 8
  • pipe.c:152:4: error: too few arguments to function 'mail_storage_set_error'
  • error 9
  • pipe.c:234:15: error: 'NOTPOSSIBLE' undeclared (first use in this function)
  • error 10
  • pipe.c:234:27: error: expected ')' before string constant
  • error 11
  • pipe.c:233:3: error: too few arguments to function 'mail_storage_set_error'
  • error 12
  • pipe.c:241:27: error: expected ')' before string constant
  • error 13
  • pipe.c:240:3: error: too few arguments to function 'mail_storage_set_error'
  • error 14
  • pipe.c:248:15: error: 'EXPUNGED' undeclared (first use in this function); did you mean 'ERANGE'?
  • error 15
  • pipe.c:248:24: error: expected ')' before string constant
  • error 16
  • pipe.c:247:3: error: too few arguments to function 'mail_storage_set_error'
  • error 17
  • pipe.c:261:27: error: expected ')' before string constant
  • error 18
  • pipe.c:260:3: error: too few arguments to function 'mail_storage_set_error'
  • error 19
  • pipe.c:273:27: error: expected ')' before string constant
  • error 20
  • pipe.c:272:3: error: too few arguments to function 'mail_storage_set_error'
  • error 21
  • pipe.c:282:27: error: expected ')' before string constant
  • error 22
  • pipe.c:281:3: error: too few arguments to function 'mail_storage_set_error'
  • error 23
  • pipe.c:291:27: error: expected ')' before string constant
  • error 24
  • pipe.c:290:3: error: too few arguments to function 'mail_storage_set_error'
  • error 25
  • pipe.c:303:27: error: expected ')' before string constant
  • error 26
  • pipe.c:302:3: error: too few arguments to function 'mail_storage_set_error'
  • error 27
  • antispam-plugin.h:284:2: error: #error "Building against this dovecot version is not supported"
  • error 28
  • dspam-exec.c:200:16: error: 'NOTPOSSIBLE' undeclared (first use in this function)
  • error 29
  • dspam-exec.c:200:28: error: expected ')' before string constant
  • error 30
  • dspam-exec.c:199:4: error: too few arguments to function 'mail_storage_set_error'
  • error 31
  • antispam-plugin.h:284:2: error: #error "Building against this dovecot version is not supported"
  • error 32
  • crm114-exec.c:172:16: error: 'NOTPOSSIBLE' undeclared (first use in this function)
  • error 33
  • crm114-exec.c:172:28: error: expected ')' before string constant
  • error 34
  • crm114-exec.c:171:4: error: too few arguments to function 'mail_storage_set_error'
  • error 35
  • antispam-plugin.h:284:2: error: #error "Building against this dovecot version is not supported"
  • error 36
  • spool2dir.c:156:15: error: 'NOTPOSSIBLE' undeclared (first use in this function)
  • error 37
  • spool2dir.c:156:27: error: expected ')' before string constant
  • error 38
  • spool2dir.c:155:3: error: too few arguments to function 'mail_storage_set_error'
  • error 39
  • spool2dir.c:163:15: error: 'EXPUNGED' undeclared (first use in this function); did you mean 'ERANGE'?
  • error 40
  • spool2dir.c:163:24: error: expected ')' before string constant
  • error 41
  • spool2dir.c:162:3: error: too few arguments to function 'mail_storage_set_error'
  • error 42
  • spool2dir.c:183:27: error: expected ')' before string constant
  • error 43
  • spool2dir.c:182:3: error: too few arguments to function 'mail_storage_set_error'
  • error 44
  • spool2dir.c:193:27: error: expected ')' before string constant
  • error 45
  • spool2dir.c:192:3: error: too few arguments to function 'mail_storage_set_error'
  • error 46
  • spool2dir.c:201:27: error: expected ')' before string constant
  • error 47
  • spool2dir.c:200:3: error: too few arguments to function 'mail_storage_set_error'
  • error 48
  • spool2dir.c:212:27: error: expected ')' before string constant
  • error 49
  • spool2dir.c:211:3: error: too few arguments to function 'mail_storage_set_error'
  • error 50
  • antispam-plugin.h:284:2: error: #error "Building against this dovecot version is not supported"
  • error 51
  • signature.c:41:16: error: 'NOTPOSSIBLE' undeclared (first use in this function)
  • error 52
  • signature.c:41:28: error: expected ')' before string constant
  • error 53
  • signature.c:40:4: error: too few arguments to function 'mail_storage_set_error'
  • error 54
  • signature.c:72:16: error: 'NOTPOSSIBLE' undeclared (first use in this function)
  • error 55
  • signature.c:72:28: error: expected ')' before string constant
  • error 56
  • signature.c:71:4: error: too few arguments to function 'mail_storage_set_error'
  • error 57
  • error: Bad exit status from /tmp/B.OjmOxU/BUILD/tmp/rpm-tmp.11782 (%build)
  • error 58
  • RPM build errors:
  • error 59
  • error: No files produced.

Content:

checking if we should skip the build
started at: Sat Aug  4 21:53:01 2018
killing old processes on a builder
mesg: ttyname failed: Inappropriate ioctl for device
sending signal 9 to pid -1
Killed
cleaning up /tmp
mesg: ttyname failed: Inappropriate ioctl for device
fetching https://srcbuilder.pld-linux.org/th//srpms/c4827ecc-58f8-4eb3-98e8-c6613dfa3def/dovecot-antispam-2.0-44.src.rpm
fetched 44270 bytes, 131.6 K/s
installing srpm: dovecot-antispam-2.0-44.src.rpm
mesg: ttyname failed: Inappropriate ioctl for device
+ install -d /tmp/B.OjmOxU/BUILD /tmp/B.OjmOxU/RPMS
+ LC_ALL=en_US.UTF-8
+ rpm -qp --changelog dovecot-antispam-2.0-44.src.rpm
* Sat Aug 04 2018 PLD Linux Team <feedback@pld-linux.org>
- For complete changelog see: http://git.pld-linux.org/?p=packages/dovecot-antispam.git;a=log;h=master
* Sat Aug 04 2018 Jan Rękorajski <baggins@pld-linux.org> ac97bdf
- release 44 (by relup.sh) * Tue Jun 12 2018 Jan Rękorajski <baggins@pld-linux.org> 578bcf8
- release 43 (by relup.sh) * Tue Mar 20 2018 Jan Rękorajski <baggins@pld-linux.org> 8892ecb
- release 42 (by relup.sh) * Fri Mar 02 2018 Jan Rękorajski <baggins@pld-linux.org> b1b188c
- release 41 (by relup.sh) * Sun Nov 26 2017 Jan Rękorajski <baggins@pld-linux.org> 7d7fb01
- release 40 (by relup.sh) * Sun Oct 15 2017 Jan Rękorajski <baggins@pld-linux.org> 1ef81a1
- release 39 (by relup.sh) * Sat Aug 26 2017 Jan Rękorajski <baggins@pld-linux.org> 0326c6b
- release 38 (by relup.sh) + rpm -Uhv --nodeps --define '_topdir /tmp/B.OjmOxU' --define '_specdir %{_topdir}' --define '_sourcedir %{_specdir}' --define '_rpmdir %{_topdir}/RPMS' --define '_builddir %{_topdir}/BUILD' dovecot-antispam-2.0-44.src.rpm Preparing... ################################################## dovecot-antispam ################################################## + rm -f dovecot-antispam-2.0-44.src.rpm mesg: ttyname failed: Inappropriate ioctl for device + install -m 700 -d /tmp/B.OjmOxU/BUILD/tmp mesg: ttyname failed: Inappropriate ioctl for device + TMPDIR=/tmp/B.OjmOxU/BUILD/tmp + exec nice -n 0 rpmbuild -bp --short-circuit --nodeps --define '_topdir /tmp/B.OjmOxU' --define '_specdir %{_topdir}' --define '_sourcedir %{_specdir}' --define '_rpmdir %{_topdir}/RPMS' --define '_builddir %{_topdir}/BUILD' --target x86_64-pld-linux --define 'prep exit 0' /tmp/B.OjmOxU/dovecot-antispam.spec Building target platforms: x86_64-pld-linux checking BuildConflict-ing packages no BuildConflicts found checking BR rpm: Building target platforms: x86_64-pld-linux no BR needed building RPM using: set -ex; : build-id: c4827ecc-58f8-4eb3-98e8-c6613dfa3def; TMPDIR=/tmp/B.OjmOxU/BUILD/tmp exec nice -n 0 rpmbuild -bb --define '_smp_mflags -j9' --define '_make_opts -Otarget' --define '_pld_builder 1' --define '_topdir /tmp/B.OjmOxU' --define '_specdir %{_topdir}' --define '_sourcedir %{_specdir}' --define '_rpmdir %{_topdir}/RPMS' --define '_builddir %{_topdir}/BUILD' --target x86_64-pld-linux /tmp/B.OjmOxU/dovecot-antispam.spec mesg: ttyname failed: Inappropriate ioctl for device + : build-id: c4827ecc-58f8-4eb3-98e8-c6613dfa3def + TMPDIR=/tmp/B.OjmOxU/BUILD/tmp + exec nice -n 0 rpmbuild -bb --define '_smp_mflags -j9' --define '_make_opts -Otarget' --define '_pld_builder 1' --define '_topdir /tmp/B.OjmOxU' --define '_specdir %{_topdir}' --define '_sourcedir %{_specdir}' --define '_rpmdir %{_topdir}/RPMS' --define '_builddir %{_topdir}/BUILD' --target x86_64-pld-linux /tmp/B.OjmOxU/dovecot-antispam.spec Building target platforms: x86_64-pld-linux Executing(%prep): /bin/sh -e /tmp/B.OjmOxU/BUILD/tmp/rpm-tmp.11782 + umask 022 + cd /tmp/B.OjmOxU/BUILD + cd /tmp/B.OjmOxU/BUILD + rm -rf dovecot-antispam-2.0 + /usr/bin/bzip2 -dc /tmp/B.OjmOxU/dovecot-antispam-2.0.tar.bz2 + /bin/tar -xf - + STATUS=0 + '[' 0 -ne 0 ']' + cd dovecot-antispam-2.0 + /bin/id -u + '[' 1000 '=' 0 ']' + /bin/id -u + '[' 1000 '=' 0 ']' + /bin/chmod -Rf a+rX,u+w,g-w,o-w . + echo 'Patch #0 (dovecot-antispam-git.patch):' Patch #0 (dovecot-antispam-git.patch): + '[' -f /tmp/B.OjmOxU/dovecot-antispam-git.patch ']' + /bin/cat /tmp/B.OjmOxU/dovecot-antispam-git.patch + /usr/bin/patch -s -p1 + exit 0 Executing(%build): /bin/sh -e /tmp/B.OjmOxU/BUILD/tmp/rpm-tmp.11782 TMP=/home/users/builder/tmp HOME=/home/users/builder PATH=/home/users/builder/GNUstep/Tools:/usr/local/bin:/usr/bin:/bin:/home/users/builder/bin TMPDIR=/tmp/B.OjmOxU/BUILD/tmp + umask 022 + cd /tmp/B.OjmOxU/BUILD + cd dovecot-antispam-2.0 + unset GIT_DIR + /usr/bin/make -Otarget -j9 'CFLAGS=-O2 -fwrapv -pipe -Wformat -Werror=format-security -gdwarf-4 -fno-debug-types-section -fvar-tracking-assignments -g2 -Wp,-D_FORTIFY_SOURCE=2 -fstack-protector-strong --param=ssp-buffer-size=4 -fPIC -march=x86-64 -gdwarf-4 -fno-debug-types-section -fvar-tracking-assignments -g2 ' 'LDFLAGS=-Wl,--as-needed -Wl,--no-copy-dt-needed-entries -Wl,-z,relro -Wl,-z,combreloc ' ./version.sh antispam-version.h cc -DHAVE_CONFIG_H -I/usr/include/dovecot/ -I/usr/include/dovecot/src/ -I/usr/include/dovecot/src/lib/ -I/usr/include/dovecot/src/lib-storage/ -I/usr/include/dovecot/src/lib-mail/ -I/usr/include/dovecot/src/lib-imap/ -I/usr/include/dovecot/src/lib-dict/ -I/usr/include/dovecot/src/lib-index/ -I/usr/include/dovecot/src/imap/ -o dovecot-version dovecot-version.c ./dovecot-version > dovecot-version.h CC antispam-storage.o In file included from antispam-storage.c:1: dovecot-version.h:17:28: fatal error: antispam-storage-2.3.c: No such file or directory #define ANTISPAM_STORAGE "antispam-storage-2.3.c" ^~~~~~~~~~~~~~~~~~~~~~~~ compilation terminated. make: *** [Makefile:37: antispam-storage.o] Error 1 make: *** Waiting for unfinished jobs.... CC debug.o In file included from debug.c:4: antispam-plugin.h:284:2: error: #error "Building against this dovecot version is not supported" #error "Building against this dovecot version is not supported" ^~~~~ antispam-plugin.h:287:1: warning: parameter names (without types) in function declaration void antispam_storage_init(module_arg); ^~~~ make: *** [Makefile:41: debug.o] Error 1 CC antispam-plugin.o In file included from antispam-plugin.c:38: antispam-plugin.h:284:2: error: #error "Building against this dovecot version is not supported" #error "Building against this dovecot version is not supported" ^~~~~ antispam-plugin.h:287:1: warning: parameter names (without types) in function declaration void antispam_storage_init(module_arg); ^~~~ antispam-plugin.c: In function 'antispam_setup_config': antispam-plugin.c:366:2: warning: implicit declaration of function 'mempool_unref'; did you mean 'pool_unref'? [-Wimplicit-function-declaration] mempool_unref(&cfg->mem_pool); ^~~~~~~~~~~~~ pool_unref make: *** [Makefile:41: antispam-plugin.o] Error 1 CC pipe.o In file included from pipe.c:31: antispam-plugin.h:284:2: error: #error "Building against this dovecot version is not supported" #error "Building against this dovecot version is not supported" ^~~~~ antispam-plugin.h:287:1: warning: parameter names (without types) in function declaration void antispam_storage_init(module_arg); ^~~~ pipe.c: In function 'process_tmpdir': pipe.c:141:8: warning: implicit declaration of function 't_malloc'; did you mean 'i_malloc'? [-Wimplicit-function-declaration] buf = t_malloc(20 + ast->tmplen); ^~~~~~~~ i_malloc pipe.c:141:6: warning: assignment to 'char *' from 'int' makes pointer from integer without a cast [-Wint-conversion] buf = t_malloc(20 + ast->tmplen); ^ pipe.c:153:13: warning: implicit declaration of function 'ME' [-Wimplicit-function-declaration] ME(TEMP) ^~ pipe.c:153:16: error: 'TEMP' undeclared (first use in this function) ME(TEMP) ^~~~ pipe.c:153:16: note: each undeclared identifier is reported only once for each function it appears in pipe.c:153:21: error: expected ')' before string constant ME(TEMP) ^ ) "failed to send mail"); ~~~~~~~~~~~~~~~~~~~~~ pipe.c:152:4: error: too few arguments to function 'mail_storage_set_error' mail_storage_set_error(ctx->box->storage, ^~~~~~~~~~~~~~~~~~~~~~ In file included from pipe.c:27: /usr/include/dovecot/mail-storage-private.h:749:6: note: declared here void mail_storage_set_error(struct mail_storage *storage, ^~~~~~~~~~~~~~~~~~~~~~ pipe.c: In function 'clear_tmpdir': pipe.c:173:6: warning: assignment to 'char *' from 'int' makes pointer from integer without a cast [-Wint-conversion] buf = t_malloc(20 + ast->tmplen); ^ pipe.c: In function 'backend_handle_mail': pipe.c:234:15: error: 'NOTPOSSIBLE' undeclared (first use in this function) ME(NOTPOSSIBLE) ^~~~~~~~~~~ pipe.c:234:27: error: expected ')' before string constant ME(NOTPOSSIBLE) ^ ) "Failed to initialise temporary dir"); ~~~~~~~~~~~~~~~~~~~~~~~~~~~~~~~~~~~~ pipe.c:233:3: error: too few arguments to function 'mail_storage_set_error' mail_storage_set_error(t->box->storage, ^~~~~~~~~~~~~~~~~~~~~~ In file included from pipe.c:27: /usr/include/dovecot/mail-storage-private.h:749:6: note: declared here void mail_storage_set_error(struct mail_storage *storage, ^~~~~~~~~~~~~~~~~~~~~~ pipe.c:241:27: error: expected ')' before string constant ME(NOTPOSSIBLE) ^ ) "antispam plugin not configured"); ~~~~~~~~~~~~~~~~~~~~~~~~~~~~~~~~ pipe.c:240:3: error: too few arguments to function 'mail_storage_set_error' mail_storage_set_error(t->box->storage, ^~~~~~~~~~~~~~~~~~~~~~ In file included from pipe.c:27: /usr/include/dovecot/mail-storage-private.h:749:6: note: declared here void mail_storage_set_error(struct mail_storage *storage, ^~~~~~~~~~~~~~~~~~~~~~ pipe.c:248:15: error: 'EXPUNGED' undeclared (first use in this function); did you mean 'ERANGE'? ME(EXPUNGED) ^~~~~~~~ ERANGE pipe.c:248:24: error: expected ')' before string constant ME(EXPUNGED) ^ ) "Failed to get mail contents"); ~~~~~~~~~~~~~~~~~~~~~~~~~~~~~ pipe.c:247:3: error: too few arguments to function 'mail_storage_set_error' mail_storage_set_error(t->box->storage, ^~~~~~~~~~~~~~~~~~~~~~ In file included from pipe.c:27: /usr/include/dovecot/mail-storage-private.h:749:6: note: declared here void mail_storage_set_error(struct mail_storage *storage, ^~~~~~~~~~~~~~~~~~~~~~ pipe.c:255:6: warning: assignment to 'char *' from 'int' makes pointer from integer without a cast [-Wint-conversion] buf = t_malloc(20 + ast->tmplen); ^ pipe.c:261:27: error: expected ')' before string constant ME(NOTPOSSIBLE) ^ ) "Failed to create temporary file"); ~~~~~~~~~~~~~~~~~~~~~~~~~~~~~~~~~ pipe.c:260:3: error: too few arguments to function 'mail_storage_set_error' mail_storage_set_error(t->box->storage, ^~~~~~~~~~~~~~~~~~~~~~ In file included from pipe.c:27: /usr/include/dovecot/mail-storage-private.h:749:6: note: declared here void mail_storage_set_error(struct mail_storage *storage, ^~~~~~~~~~~~~~~~~~~~~~ pipe.c:269:14: warning: implicit declaration of function 'o_stream_create_from_fd'; did you mean 'i_stream_create_from_data'? [-Wimplicit-function-declaration] outstream = o_stream_create_from_fd(fd, t->box->pool); ^~~~~~~~~~~~~~~~~~~~~~~ i_stream_create_from_data pipe.c:269:12: warning: assignment to 'struct ostream *' from 'int' makes pointer from integer without a cast [-Wint-conversion] outstream = o_stream_create_from_fd(fd, t->box->pool); ^ pipe.c:273:27: error: expected ')' before string constant ME(NOTPOSSIBLE) ^ ) "Failed to stream temporary file"); ~~~~~~~~~~~~~~~~~~~~~~~~~~~~~~~~~ pipe.c:272:3: error: too few arguments to function 'mail_storage_set_error' mail_storage_set_error(t->box->storage, ^~~~~~~~~~~~~~~~~~~~~~ In file included from pipe.c:27: /usr/include/dovecot/mail-storage-private.h:749:6: note: declared here void mail_storage_set_error(struct mail_storage *storage, ^~~~~~~~~~~~~~~~~~~~~~ pipe.c:282:27: error: expected ')' before string constant ME(NOTPOSSIBLE) ^ ) "Failed to write marker to temp file"); ~~~~~~~~~~~~~~~~~~~~~~~~~~~~~~~~~~~~~ pipe.c:281:3: error: too few arguments to function 'mail_storage_set_error' mail_storage_set_error(t->box->storage, ^~~~~~~~~~~~~~~~~~~~~~ In file included from pipe.c:27: /usr/include/dovecot/mail-storage-private.h:749:6: note: declared here void mail_storage_set_error(struct mail_storage *storage, ^~~~~~~~~~~~~~~~~~~~~~ pipe.c:291:27: error: expected ')' before string constant ME(NOTPOSSIBLE) ^ ) "Failed to read mail beginning"); ~~~~~~~~~~~~~~~~~~~~~~~~~~~~~~~ pipe.c:290:3: error: too few arguments to function 'mail_storage_set_error' mail_storage_set_error(t->box->storage, ^~~~~~~~~~~~~~~~~~~~~~ In file included from pipe.c:27: /usr/include/dovecot/mail-storage-private.h:749:6: note: declared here void mail_storage_set_error(struct mail_storage *storage, ^~~~~~~~~~~~~~~~~~~~~~ pipe.c:303:27: error: expected ')' before string constant ME(NOTPOSSIBLE) ^ ) "Failed to copy to temporary file"); ~~~~~~~~~~~~~~~~~~~~~~~~~~~~~~~~~~ pipe.c:302:3: error: too few arguments to function 'mail_storage_set_error' mail_storage_set_error(t->box->storage, ^~~~~~~~~~~~~~~~~~~~~~ In file included from pipe.c:27: /usr/include/dovecot/mail-storage-private.h:749:6: note: declared here void mail_storage_set_error(struct mail_storage *storage, ^~~~~~~~~~~~~~~~~~~~~~ pipe.c: In function 'process_tmpdir': pipe.c:149:3: warning: ignoring return value of 'read', declared with attribute warn_unused_result [-Wunused-result] read(fd, &wanted, sizeof(wanted)); ^~~~~~~~~~~~~~~~~~~~~~~~~~~~~~~~~ make: *** [Makefile:41: pipe.o] Error 1 CC dspam-exec.o In file included from dspam-exec.c:29: antispam-plugin.h:284:2: error: #error "Building against this dovecot version is not supported" #error "Building against this dovecot version is not supported" ^~~~~ antispam-plugin.h:287:1: warning: parameter names (without types) in function declaration void antispam_storage_init(module_arg); ^~~~ dspam-exec.c: In function 'backend_commit': dspam-exec.c:200:13: warning: implicit declaration of function 'ME' [-Wimplicit-function-declaration] ME(NOTPOSSIBLE) ^~ dspam-exec.c:200:16: error: 'NOTPOSSIBLE' undeclared (first use in this function) ME(NOTPOSSIBLE) ^~~~~~~~~~~ dspam-exec.c:200:16: note: each undeclared identifier is reported only once for each function it appears in dspam-exec.c:200:28: error: expected ')' before string constant ME(NOTPOSSIBLE) ^ ) "Failed to call dspam"); ~~~~~~~~~~~~~~~~~~~~~~ dspam-exec.c:199:4: error: too few arguments to function 'mail_storage_set_error' mail_storage_set_error(ctx->box->storage, ^~~~~~~~~~~~~~~~~~~~~~ In file included from dspam-exec.c:27: /usr/include/dovecot/mail-storage-private.h:749:6: note: declared here void mail_storage_set_error(struct mail_storage *storage, ^~~~~~~~~~~~~~~~~~~~~~ dspam-exec.c: In function 'backend_handle_mail': dspam-exec.c:225:12: warning: implicit declaration of function 'get_mail_headers'; did you mean 'mail_get_headers'? [-Wimplicit-function-declaration] result = get_mail_headers(mail, cfg->dspam.result_header); ^~~~~~~~~~~~~~~~ mail_get_headers dspam-exec.c:225:10: warning: assignment to 'const char * const*' from 'int' makes pointer from integer without a cast [-Wint-conversion] result = get_mail_headers(mail, cfg->dspam.result_header); ^ make: *** [Makefile:41: dspam-exec.o] Error 1 CC crm114-exec.o In file included from crm114-exec.c:29: antispam-plugin.h:284:2: error: #error "Building against this dovecot version is not supported" #error "Building against this dovecot version is not supported" ^~~~~ antispam-plugin.h:287:1: warning: parameter names (without types) in function declaration void antispam_storage_init(module_arg); ^~~~ crm114-exec.c: In function 'backend_commit': crm114-exec.c:172:13: warning: implicit declaration of function 'ME' [-Wimplicit-function-declaration] ME(NOTPOSSIBLE) ^~ crm114-exec.c:172:16: error: 'NOTPOSSIBLE' undeclared (first use in this function) ME(NOTPOSSIBLE) ^~~~~~~~~~~ crm114-exec.c:172:16: note: each undeclared identifier is reported only once for each function it appears in crm114-exec.c:172:28: error: expected ')' before string constant ME(NOTPOSSIBLE) ^ ) "Failed to call reaver"); ~~~~~~~~~~~~~~~~~~~~~~~ crm114-exec.c:171:4: error: too few arguments to function 'mail_storage_set_error' mail_storage_set_error(ctx->box->storage, ^~~~~~~~~~~~~~~~~~~~~~ In file included from crm114-exec.c:27: /usr/include/dovecot/mail-storage-private.h:749:6: note: declared here void mail_storage_set_error(struct mail_storage *storage, ^~~~~~~~~~~~~~~~~~~~~~ crm114-exec.c: In function 'call_reaver': crm114-exec.c:67:3: warning: ignoring return value of 'write', declared with attribute warn_unused_result [-Wunused-result] write(pipes[1], cfg->crm.sigcfg.signature_hdr, ^~~~~~~~~~~~~~~~~~~~~~~~~~~~~~~~~~~~~~~~~~~~~~ strlen(cfg->crm.sigcfg.signature_hdr)); ~~~~~~~~~~~~~~~~~~~~~~~~~~~~~~~~~~~~~~ crm114-exec.c:69:3: warning: ignoring return value of 'write', declared with attribute warn_unused_result [-Wunused-result] write(pipes[1], ": ", 2); ^~~~~~~~~~~~~~~~~~~~~~~~ crm114-exec.c:70:3: warning: ignoring return value of 'write', declared with attribute warn_unused_result [-Wunused-result] write(pipes[1], signature, strlen(signature)); ^~~~~~~~~~~~~~~~~~~~~~~~~~~~~~~~~~~~~~~~~~~~~ crm114-exec.c:71:3: warning: ignoring return value of 'write', declared with attribute warn_unused_result [-Wunused-result] write(pipes[1], "\r\n\r\n", 4); ^~~~~~~~~~~~~~~~~~~~~~~~~~~~~~ make: *** [Makefile:41: crm114-exec.o] Error 1 CC spool2dir.o In file included from spool2dir.c:105: antispam-plugin.h:284:2: error: #error "Building against this dovecot version is not supported" #error "Building against this dovecot version is not supported" ^~~~~ antispam-plugin.h:287:1: warning: parameter names (without types) in function declaration void antispam_storage_init(module_arg); ^~~~ spool2dir.c: In function 'backend_handle_mail': spool2dir.c:156:12: warning: implicit declaration of function 'ME' [-Wimplicit-function-declaration] ME(NOTPOSSIBLE) ^~ spool2dir.c:156:15: error: 'NOTPOSSIBLE' undeclared (first use in this function) ME(NOTPOSSIBLE) ^~~~~~~~~~~ spool2dir.c:156:15: note: each undeclared identifier is reported only once for each function it appears in spool2dir.c:156:27: error: expected ')' before string constant ME(NOTPOSSIBLE) ^ ) "antispam plugin / spool2dir backend not configured"); ~~~~~~~~~~~~~~~~~~~~~~~~~~~~~~~~~~~~~~~~~~~~~~~~~~~~ spool2dir.c:155:3: error: too few arguments to function 'mail_storage_set_error' mail_storage_set_error(t->box->storage, ^~~~~~~~~~~~~~~~~~~~~~ In file included from spool2dir.c:101: /usr/include/dovecot/mail-storage-private.h:749:6: note: declared here void mail_storage_set_error(struct mail_storage *storage, ^~~~~~~~~~~~~~~~~~~~~~ spool2dir.c:163:15: error: 'EXPUNGED' undeclared (first use in this function); did you mean 'ERANGE'? ME(EXPUNGED) ^~~~~~~~ ERANGE spool2dir.c:163:24: error: expected ')' before string constant ME(EXPUNGED) ^ ) "Failed to get mail contents"); ~~~~~~~~~~~~~~~~~~~~~~~~~~~~~ spool2dir.c:162:3: error: too few arguments to function 'mail_storage_set_error' mail_storage_set_error(t->box->storage, ^~~~~~~~~~~~~~~~~~~~~~ In file included from spool2dir.c:101: /usr/include/dovecot/mail-storage-private.h:749:6: note: declared here void mail_storage_set_error(struct mail_storage *storage, ^~~~~~~~~~~~~~~~~~~~~~ spool2dir.c:183:27: error: expected ')' before string constant ME(NOTPOSSIBLE) ^ ) "Failed to create spool file"); ~~~~~~~~~~~~~~~~~~~~~~~~~~~~~ spool2dir.c:182:3: error: too few arguments to function 'mail_storage_set_error' mail_storage_set_error(t->box->storage, ^~~~~~~~~~~~~~~~~~~~~~ In file included from spool2dir.c:101: /usr/include/dovecot/mail-storage-private.h:749:6: note: declared here void mail_storage_set_error(struct mail_storage *storage, ^~~~~~~~~~~~~~~~~~~~~~ spool2dir.c:190:14: warning: implicit declaration of function 'o_stream_create_from_fd'; did you mean 'i_stream_create_from_data'? [-Wimplicit-function-declaration] outstream = o_stream_create_from_fd(fd, t->box->pool); ^~~~~~~~~~~~~~~~~~~~~~~ i_stream_create_from_data spool2dir.c:190:12: warning: assignment to 'struct ostream *' from 'int' makes pointer from integer without a cast [-Wint-conversion] outstream = o_stream_create_from_fd(fd, t->box->pool); ^ spool2dir.c:193:27: error: expected ')' before string constant ME(NOTPOSSIBLE) ^ ) "Failed to stream spool file"); ~~~~~~~~~~~~~~~~~~~~~~~~~~~~~ spool2dir.c:192:3: error: too few arguments to function 'mail_storage_set_error' mail_storage_set_error(t->box->storage, ^~~~~~~~~~~~~~~~~~~~~~ In file included from spool2dir.c:101: /usr/include/dovecot/mail-storage-private.h:749:6: note: declared here void mail_storage_set_error(struct mail_storage *storage, ^~~~~~~~~~~~~~~~~~~~~~ spool2dir.c:201:27: error: expected ')' before string constant ME(NOTPOSSIBLE) ^ ) "Failed to read mail beginning"); ~~~~~~~~~~~~~~~~~~~~~~~~~~~~~~~ spool2dir.c:200:3: error: too few arguments to function 'mail_storage_set_error' mail_storage_set_error(t->box->storage, ^~~~~~~~~~~~~~~~~~~~~~ In file included from spool2dir.c:101: /usr/include/dovecot/mail-storage-private.h:749:6: note: declared here void mail_storage_set_error(struct mail_storage *storage, ^~~~~~~~~~~~~~~~~~~~~~ spool2dir.c:212:27: error: expected ')' before string constant ME(NOTPOSSIBLE) ^ ) "Failed to copy to spool file"); ~~~~~~~~~~~~~~~~~~~~~~~~~~~~~~ spool2dir.c:211:3: error: too few arguments to function 'mail_storage_set_error' mail_storage_set_error(t->box->storage, ^~~~~~~~~~~~~~~~~~~~~~ In file included from spool2dir.c:101: /usr/include/dovecot/mail-storage-private.h:749:6: note: declared here void mail_storage_set_error(struct mail_storage *storage, ^~~~~~~~~~~~~~~~~~~~~~ make: *** [Makefile:41: spool2dir.o] Error 1 CC signature.o In file included from signature.c:3: antispam-plugin.h:284:2: error: #error "Building against this dovecot version is not supported" #error "Building against this dovecot version is not supported" ^~~~~ antispam-plugin.h:287:1: warning: parameter names (without types) in function declaration void antispam_storage_init(module_arg); ^~~~ signature.c: In function 'signature_extract_to_list': signature.c:37:15: warning: implicit declaration of function 'get_mail_headers'; did you mean 'mail_get_headers'? [-Wimplicit-function-declaration] signatures = get_mail_headers(mail, cfg->signature_hdr); ^~~~~~~~~~~~~~~~ mail_get_headers signature.c:37:13: warning: assignment to 'const char * const*' from 'int' makes pointer from integer without a cast [-Wint-conversion] signatures = get_mail_headers(mail, cfg->signature_hdr); ^ signature.c:41:13: warning: implicit declaration of function 'ME' [-Wimplicit-function-declaration] ME(NOTPOSSIBLE) ^~ signature.c:41:16: error: 'NOTPOSSIBLE' undeclared (first use in this function) ME(NOTPOSSIBLE) ^~~~~~~~~~~ signature.c:41:16: note: each undeclared identifier is reported only once for each function it appears in signature.c:41:28: error: expected ')' before string constant ME(NOTPOSSIBLE) ^ ) "antispam signature not found"); ~~~~~~~~~~~~~~~~~~~~~~~~~~~~~~ signature.c:40:4: error: too few arguments to function 'mail_storage_set_error' mail_storage_set_error(t->box->storage, ^~~~~~~~~~~~~~~~~~~~~~ In file included from signature.c:4: /usr/include/dovecot/mail-storage-private.h:749:6: note: declared here void mail_storage_set_error(struct mail_storage *storage, ^~~~~~~~~~~~~~~~~~~~~~ signature.c: In function 'signature_extract': signature.c:68:13: warning: assignment to 'const char * const*' from 'int' makes pointer from integer without a cast [-Wint-conversion] signatures = get_mail_headers(mail, cfg->signature_hdr); ^ signature.c:72:16: error: 'NOTPOSSIBLE' undeclared (first use in this function) ME(NOTPOSSIBLE) ^~~~~~~~~~~ signature.c:72:28: error: expected ')' before string constant ME(NOTPOSSIBLE) ^ ) "antispam signature not found"); ~~~~~~~~~~~~~~~~~~~~~~~~~~~~~~ signature.c:71:4: error: too few arguments to function 'mail_storage_set_error' mail_storage_set_error(t->box->storage, ^~~~~~~~~~~~~~~~~~~~~~ In file included from signature.c:4: /usr/include/dovecot/mail-storage-private.h:749:6: note: declared here void mail_storage_set_error(struct mail_storage *storage, ^~~~~~~~~~~~~~~~~~~~~~ make: *** [Makefile:41: signature.o] Error 1 error: Bad exit status from /tmp/B.OjmOxU/BUILD/tmp/rpm-tmp.11782 (%build) RPM build errors: Bad exit status from /tmp/B.OjmOxU/BUILD/tmp/rpm-tmp.11782 (%build) ended at: Sat Aug 4 21:53:04 2018, done in 0:00:00.812659 error: No files produced. mesg: ttyname failed: Inappropriate ioctl for device + chmod -R u+rwX /tmp/B.OjmOxU/BUILD + rm -rf /tmp/B.OjmOxU/tmp /tmp/B.OjmOxU/BUILD mesg: ttyname failed: Inappropriate ioctl for device + rm -rf /tmp/B.OjmOxU Begin-PLD-Builder-Info Build-Time: user:2.13s sys:0.36s real:3.26s (faults io:0 non-io:164271) End-PLD-Builder-Info
[Back to list of logs] [View rpm -qa of builder]