FailedOk

th/SRPMS[OK]
th/x32[OK]
th/i686[OK]
th/x86_64[OK]

ac/SRPMS[OK]
ac/i386[OK]
ac/i586[OK]
ac/i686[OK]
ac/alpha[OK]
ac/amd64[OK]
ac/athlon[OK]
ac/ppc[OK]
ac/sparc[OK]
ac/sparc64[OK]

Advanced Search
main()
Powered by PLD Linux
(c) 2002-2022 PLD Team
$Revision: 1.37 $
Powered by Przewodniczacego Lepper-a.
Your IP: 100.25.42.211

firefox 05da2df8-250e-48ea-b5a4-93a6dbdf387f

Status:Failed
Source URL:https://buildlogs.pld-linux.org/pld/th/x86_64/FAIL/firefox,05da2df8-250e-48ea-b5a4-93a6dbdf387f.bz2
text/plain URL:View!
full text:View!
rpm -qa of builder:View!
Date:2019/06/03 20:47:34
Runtime:0:04:13.659700

Toc:

  • error 1
  • 3:40.46 Error: EFILE
  • error 2
  • 3:40.47 gmake[4]: *** [backend.mk:20: .deps/node.stub.stub] Error 1
  • error 3
  • 3:40.47 gmake[3]: *** [/tmp/B.Z6bhIa/BUILD/firefox-67.0/config/recurse.mk:101: devtools/client/debugger/new/src/export] Error 2
  • error 4
  • 3:40.47 gmake[2]: *** [/tmp/B.Z6bhIa/BUILD/firefox-67.0/config/recurse.mk:34: export] Error 2
  • error 5
  • 3:40.47 gmake[1]: *** [/tmp/B.Z6bhIa/BUILD/firefox-67.0/config/rules.mk:400: default] Error 2
  • error 6
  • error: Bad exit status from /tmp/B.Z6bhIa/BUILD/tmp/rpm-tmp.55669 (%build)
  • error 7
  • RPM build errors:
  • error 8
  • error: No files produced.

Content:

 1:38.71 config/makefiles/xpidl/windowcreator.xpt
 1:38.90 config/makefiles/xpidl/windowwatcher.xpt
 1:39.18 config/makefiles/xpidl/xpcom_base.xpt
 1:39.66 config/makefiles/xpidl/xpcom_components.xpt
 1:39.96 config/makefiles/xpidl/xpcom_ds.xpt
 1:40.54 config/makefiles/xpidl/xpcom_io.xpt
 1:41.34 config/makefiles/xpidl/xpcom_system.xpt
 1:41.72 config/makefiles/xpidl/xpcom_threads.xpt
 1:42.18 config/makefiles/xpidl/xpconnect.xpt
 1:42.52 config/makefiles/xpidl/xul.xpt
 1:42.71 config/makefiles/xpidl/xulapp.xpt
 1:42.89 config/makefiles/xpidl/zipwriter.xpt
 1:43.07 config/makefiles/xpidl/xptdata.cpp
 1:45.28 media/libdav1d/16bd_cdef_apply_tmpl.c.stub
 1:45.42 media/libdav1d/16bd_cdef_tmpl.c.stub
 1:45.54 media/libdav1d/16bd_film_grain_tmpl.c.stub
 1:45.68 media/libdav1d/16bd_ipred_prepare_tmpl.c.stub
 1:45.80 media/libdav1d/16bd_ipred_tmpl.c.stub
 1:45.94 media/libdav1d/16bd_itx_tmpl.c.stub
 1:46.07 media/libdav1d/16bd_lf_apply_tmpl.c.stub
 1:46.19 media/libdav1d/16bd_loopfilter_tmpl.c.stub
 1:46.33 media/libdav1d/16bd_looprestoration_tmpl.c.stub
 1:46.45 media/libdav1d/16bd_lr_apply_tmpl.c.stub
 1:46.59 media/libdav1d/16bd_mc_tmpl.c.stub
 1:46.72 media/libdav1d/16bd_recon_tmpl.c.stub
 1:46.85 media/libdav1d/8bd_cdef_apply_tmpl.c.stub
 1:46.98 media/libdav1d/8bd_cdef_tmpl.c.stub
 1:47.11 media/libdav1d/8bd_film_grain_tmpl.c.stub
 1:47.24 media/libdav1d/8bd_ipred_prepare_tmpl.c.stub
 1:47.37 media/libdav1d/8bd_ipred_tmpl.c.stub
 1:47.50 media/libdav1d/8bd_itx_tmpl.c.stub
 1:47.63 media/libdav1d/8bd_lf_apply_tmpl.c.stub
 1:47.76 media/libdav1d/8bd_loopfilter_tmpl.c.stub
 1:47.89 media/libdav1d/8bd_looprestoration_tmpl.c.stub
 1:48.02 media/libdav1d/8bd_lr_apply_tmpl.c.stub
 1:48.15 media/libdav1d/8bd_mc_tmpl.c.stub
 1:48.28 media/libdav1d/8bd_recon_tmpl.c.stub
 1:48.41 media/libdav1d/asm/16bd_cdef_init_tmpl.c.stub
 1:48.55 media/libdav1d/asm/16bd_ipred_init_tmpl.c.stub
 1:48.68 media/libdav1d/asm/16bd_itx_init_tmpl.c.stub
 1:48.81 media/libdav1d/asm/16bd_loopfilter_init_tmpl.c.stub
 1:48.94 media/libdav1d/asm/16bd_looprestoration_init_tmpl.c.stub
 1:49.07 media/libdav1d/asm/16bd_mc_init_tmpl.c.stub
 1:49.19 media/libdav1d/asm/8bd_cdef_init_tmpl.c.stub
 1:49.33 media/libdav1d/asm/8bd_ipred_init_tmpl.c.stub
 1:49.46 media/libdav1d/asm/8bd_itx_init_tmpl.c.stub
 1:49.59 media/libdav1d/asm/8bd_loopfilter_init_tmpl.c.stub
 1:49.72 media/libdav1d/asm/8bd_looprestoration_init_tmpl.c.stub
 1:49.85 media/libdav1d/asm/8bd_mc_init_tmpl.c.stub
 1:49.99 security/apps/xpcshell.inc.stub
 1:50.13 security/apps/addons-public.inc.stub
 1:50.26 security/apps/addons-public-intermediate.inc.stub
 1:50.39 security/apps/addons-stage.inc.stub
 1:50.52 security/apps/privileged-package-root.inc.stub
 1:50.65 xpcom/base/error_list.rs.stub
 1:50.79 xpcom/base/ErrorList.h.stub
 1:50.93 xpcom/base/ErrorNamesInternal.h.stub
 1:51.07 xpcom/base/gk_rust_utils_ffi_generated.h.stub
 1:51.73 xpcom/ds/nsGkAtomList.h.stub
 1:51.93 xpcom/ds/nsGkAtomConsts.h.stub
 1:52.10 xpcom/components/Components.h.stub
 1:52.42 xpcom/build/Services.cpp.stub
 1:52.55 xpcom/build/Services.h.stub
 1:52.69 xpcom/build/services.rs.stub
 1:52.85 intl/locale/encodingsgroups.properties.h.stub
 1:52.98 netwerk/necko-config.h.stub
 1:53.13 netwerk/dns/etld_data.inc.stub
 2:29.97 gfx/webrender_bindings/webrender_ffi_generated.h.stub
 2:31.65 dom/base/PropertyUseCounterMap.inc.stub
 2:31.78 dom/base/UseCounterList.h.stub
 2:31.92 layout/style/ServoCSSPropList.py.stub
 2:37.61 layout/style/nsCSSPropertyID.h.stub
 2:37.76 layout/style/ServoCSSPropList.h.stub
 2:37.91 layout/style/CompositorAnimatableProperties.h.stub
 2:38.05 layout/style/nsComputedDOMStyleGenerated.cpp.stub
 2:38.20 layout/style/nsCSSPropsGenerated.inc.stub
 2:38.36 layout/style/ServoStyleConsts.h.stub
 2:39.94 dom/bindings/CSS2Properties.webidl.stub
 3:01.51 dom/encoding/domainsfallbacks.properties.h.stub
 3:01.65 dom/encoding/labelsencodings.properties.h.stub
 3:01.78 dom/encoding/localesfallbacks.properties.h.stub
 3:01.91 dom/encoding/nonparticipatingdomains.properties.h.stub
 3:02.04 accessible/xpcom/xpcAccEvents.h.stub
 3:02.70 security/manager/ssl/nsSTSPreloadList.h.stub
 3:34.97 toolkit/components/telemetry/TelemetryEventData.h.stub
 3:35.45 toolkit/components/telemetry/TelemetryEventEnums.h.stub
 3:35.93 toolkit/components/telemetry/TelemetryHistogramData.inc.stub
 3:36.76 toolkit/components/telemetry/TelemetryHistogramEnums.h.stub
 3:37.20 toolkit/components/telemetry/TelemetryHistogramNameMap.h.stub
 3:38.26 toolkit/components/telemetry/TelemetryProcessData.h.stub
 3:38.43 toolkit/components/telemetry/TelemetryProcessEnums.h.stub
 3:38.61 toolkit/components/telemetry/TelemetryScalarData.h.stub
 3:39.30 toolkit/components/telemetry/TelemetryScalarEnums.h.stub
 3:40.00 toolkit/crashreporter/CrashAnnotations.h.stub
 3:40.28 devtools/client/debugger/new/src/node.stub.stub
 3:40.38 Executing "/usr/bin/nodejs /tmp/B.Z6bhIa/BUILD/firefox-67.0/devtools/client/shared/build/build.js /tmp/B.Z6bhIa/BUILD/firefox-67.0/devtools/client/debugger/new/src/main.development.js /tmp/B.Z6bhIa/BUILD/firefox-67.0/devtools/client/debugger/new/src/main.js /tmp/B.Z6bhIa/BUILD/firefox-67.0/devtools/client/debugger/new/src/vendors.js"
 3:40.46 dns.js:221
 3:40.46     this._handle = new ChannelWrap();
 3:40.46                    ^
 3:40.46 Error: EFILE
 3:40.46     at new Resolver (dns.js:221:20)
 3:40.46     at dns.js:352:23
 3:40.46     at NativeModule.compile (bootstrap_node.js:613:7)
 3:40.46     at NativeModule.require (bootstrap_node.js:558:18)
 3:40.46     at net.js:49:13
 3:40.46     at NativeModule.compile (bootstrap_node.js:613:7)
 3:40.46     at NativeModule.require (bootstrap_node.js:558:18)
 3:40.46     at createWritableStdioStream (internal/process/stdio.js:159:17)
 3:40.46     at process.getStdout [as stdout] (internal/process/stdio.js:16:14)
 3:40.46     at console.js:249:38
 3:40.46 Failed with Command '[u'/usr/bin/nodejs', '/tmp/B.Z6bhIa/BUILD/firefox-67.0/devtools/client/shared/build/build.js', '/tmp/B.Z6bhIa/BUILD/firefox-67.0/devtools/client/debugger/new/src/main.development.js', '/tmp/B.Z6bhIa/BUILD/firefox-67.0/devtools/client/debugger/new/src/main.js', '/tmp/B.Z6bhIa/BUILD/firefox-67.0/devtools/client/debugger/new/src/vendors.js']' returned non-zero exit status 1.  Be sure to check that your mozconfig doesn't
 3:40.46             have --disable-nodejs in it.  If it does, try removing that line and
 3:40.46             building again.
 3:40.47 gmake[4]: *** [backend.mk:20: .deps/node.stub.stub] Error 1
 3:40.47 gmake[3]: *** [/tmp/B.Z6bhIa/BUILD/firefox-67.0/config/recurse.mk:101: devtools/client/debugger/new/src/export] Error 2
 3:40.47 gmake[2]: *** [/tmp/B.Z6bhIa/BUILD/firefox-67.0/config/recurse.mk:34: export] Error 2
 3:40.47 gmake[1]: *** [/tmp/B.Z6bhIa/BUILD/firefox-67.0/config/rules.mk:400: default] Error 2
 3:40.47 gmake: *** [client.mk:125: build] Error 2
 3:40.47 0 compiler warnings present.
error: Bad exit status from /tmp/B.Z6bhIa/BUILD/tmp/rpm-tmp.55669 (%build)


RPM build errors:
    Bad exit status from /tmp/B.Z6bhIa/BUILD/tmp/rpm-tmp.55669 (%build)
ended at: Mon Jun  3 20:47:18 2019, done in 0:04:13.659700
error: No files produced.
+ chmod -R u+rwX /tmp/B.Z6bhIa/BUILD
+ rm -rf /tmp/B.Z6bhIa/tmp /tmp/B.Z6bhIa/BUILD
+ rm -rf /tmp/B.Z6bhIa
Begin-PLD-Builder-Info
Build-Time: user:207.06s sys:48.43s real:377.99s (faults io:90 non-io:3840675)

End-PLD-Builder-Info
[Back to list of logs] [View rpm -qa of builder]