FailedOk

th/SRPMS[OK]
th/x32[OK]
th/i686[OK]
th/x86_64[OK]

ac/SRPMS[OK]
ac/i386[OK]
ac/i586[OK]
ac/i686[OK]
ac/alpha[OK]
ac/amd64[OK]
ac/athlon[OK]
ac/ppc[OK]
ac/sparc[OK]
ac/sparc64[OK]

Advanced Search
main()
Powered by PLD Linux
(c) 2002-2018 PLD Team
$Revision: 1.37 $
Powered by X.
Your IP: 23.20.25.122

firefox 4b30466e-d545-4a4a-bf99-cf8025950f36

Status:Failed
Source URL:ftp://buildlogs.pld-linux.org/th/x86_64/FAIL/firefox,4b30466e-d545-4a4a-bf99-cf8025950f36.bz2
text/plain URL:View!
full text:View!
rpm -qa of builder:View!
Date:2018/03/31 11:22:51
Runtime:0:14:48.028935

Toc:

  • error 1
  • 9:30.38 /tmp/B.kP_R8W/BUILD/mozilla-release-239e434d6d2b8e1e2b697c3416d1e96d48fe98e5/gfx/2d/ScaledFontFontconfig.cpp:400:29: error: no matching function for call to 'cairo_ft_font_face_create_for_pattern'
  • error 2
  • 9:30.51 gmake[4]: *** [/tmp/B.kP_R8W/BUILD/mozilla-release-239e434d6d2b8e1e2b697c3416d1e96d48fe98e5/config/rules.mk:1049: ScaledFontFontconfig.o] Error 1
  • error 3
  • 9:30.51 gmake[3]: *** [/tmp/B.kP_R8W/BUILD/mozilla-release-239e434d6d2b8e1e2b697c3416d1e96d48fe98e5/config/recurse.mk:73: gfx/2d/target] Error 2
  • error 4
  • 13:55.45 gmake[2]: *** [/tmp/B.kP_R8W/BUILD/mozilla-release-239e434d6d2b8e1e2b697c3416d1e96d48fe98e5/config/recurse.mk:33: compile] Error 2
  • error 5
  • 13:55.45 gmake[1]: *** [/tmp/B.kP_R8W/BUILD/mozilla-release-239e434d6d2b8e1e2b697c3416d1e96d48fe98e5/config/rules.mk:434: default] Error 2
  • error 6
  • error: Bad exit status from /tmp/B.kP_R8W/BUILD/tmp/rpm-tmp.85396 (%build)
  • error 7
  • RPM build errors:
  • error 8
  • error: No files produced.

Content:

 7:13.56 /tmp/B.kP_R8W/BUILD/mozilla-release-239e434d6d2b8e1e2b697c3416d1e96d48fe98e5/netwerk/sctp/src/netinet/sctp_pcb.c:2751:6: warning: code will never be executed [-Wunreachable-code]
 7:13.56         if (zero_address) {
 7:13.56             ^~~~~~~~~~~~
 7:13.59 /tmp/B.kP_R8W/BUILD/mozilla-release-239e434d6d2b8e1e2b697c3416d1e96d48fe98e5/netwerk/sctp/src/netinet/sctp_pcb.c:4155:3: warning: code will never be executed [-Wunreachable-code]
 7:13.59                 being_refed++;
 7:13.59                 ^~~~~~~~~~~
 7:13.59 /tmp/B.kP_R8W/BUILD/mozilla-release-239e434d6d2b8e1e2b697c3416d1e96d48fe98e5/netwerk/sctp/src/netinet/sctp_pcb.c:4153:3: warning: code will never be executed [-Wunreachable-code]
 7:13.59                 being_refed++;
 7:13.59                 ^~~~~~~~~~~
 7:13.59 /tmp/B.kP_R8W/BUILD/mozilla-release-239e434d6d2b8e1e2b697c3416d1e96d48fe98e5/netwerk/sctp/src/netinet/sctp_pcb.c:4151:3: warning: code will never be executed [-Wunreachable-code]
 7:13.59                 being_refed++;
 7:13.59                 ^~~~~~~~~~~
 7:14.65 libextensions_auth.a.desc
 7:14.91 /tmp/B.kP_R8W/BUILD/mozilla-release-239e434d6d2b8e1e2b697c3416d1e96d48fe98e5/netwerk/sctp/src/netinet/sctp_usrreq.c:1088:11: warning: 'return' will never be executed [-Wunreachable-code-return]
 7:14.91                 return (0);
 7:14.91                         ^
 7:15.04 /tmp/B.kP_R8W/BUILD/mozilla-release-239e434d6d2b8e1e2b697c3416d1e96d48fe98e5/netwerk/sctp/src/netinet/sctp_usrreq.c:6879:3: warning: code will never be executed [-Wunreachable-code]
 7:15.04                 sctp_bindx_delete_address(inp, addrs->addr,
 7:15.04                 ^~~~~~~~~~~~~~~~~~~~~~~~~
 7:15.04 /tmp/B.kP_R8W/BUILD/mozilla-release-239e434d6d2b8e1e2b697c3416d1e96d48fe98e5/netwerk/sctp/src/netinet/sctp_usrreq.c:6828:3: warning: code will never be executed [-Wunreachable-code]
 7:15.04                 sctp_bindx_add_address(so, inp, addrs->addr,
 7:15.04                 ^~~~~~~~~~~~~~~~~~~~~~
 7:15.20 4 warnings generated.
 7:16.56 libipc_glue.a.desc
 7:16.60 3 warnings generated.
 7:16.66    Compiling cose-c v0.1.5
 7:18.53 /tmp/B.kP_R8W/BUILD/mozilla-release-239e434d6d2b8e1e2b697c3416d1e96d48fe98e5/netwerk/sctp/src/user_socket.c:2589:27: warning: loop will run at most once (loop increment never executed) [-Wunreachable-code-loop-increment]
 7:18.54         for (i = 0; i < addrcnt; i++) {
 7:18.54                                  ^~~
 7:19.08 libplugin-container.a.desc
 7:19.19 1 warning generated.
 7:19.20 libnksctp_s.a.desc
 7:28.83    Compiling encoding_glue v0.1.0 (file:///tmp/B.kP_R8W/BUILD/mozilla-release-239e434d6d2b8e1e2b697c3416d1e96d48fe98e5/intl/encoding_glue)
 7:29.88    Compiling netwerk_helper v0.0.1 (file:///tmp/B.kP_R8W/BUILD/mozilla-release-239e434d6d2b8e1e2b697c3416d1e96d48fe98e5/netwerk/base/rust-helper)
 7:29.89 libjs_ipc.a.desc
 7:30.57 libintl_chardet.a.desc
 7:30.98    Compiling cubeb v0.3.0 (file:///tmp/B.kP_R8W/BUILD/mozilla-release-239e434d6d2b8e1e2b697c3416d1e96d48fe98e5/media/cubeb-rs/cubeb-api)
 7:31.11 warning: unused import: `str`
 7:31.11   --> /tmp/B.kP_R8W/BUILD/mozilla-release-239e434d6d2b8e1e2b697c3416d1e96d48fe98e5/media/cubeb-rs/cubeb-api/src/stream.rs:73:16
 7:31.11    |
 7:31.11 73 | use std::{ptr, str};
 7:31.11    |                ^^^
 7:31.11    |
 7:31.11    = note: #[warn(unused_imports)] on by default
 7:31.11 
 7:31.28 warning: variable does not need to be mutable
 7:31.28    --> /tmp/B.kP_R8W/BUILD/mozilla-release-239e434d6d2b8e1e2b697c3416d1e96d48fe98e5/media/cubeb-rs/cubeb-api/src/stream.rs:322:17
 7:31.28     |
 7:31.28 322 |             let mut output: &mut [CB::Frame] = if output_buffer.is_null() {
 7:31.28     |                 ----^^^^^^
 7:31.28     |                 |
 7:31.28     |                 help: remove this `mut`
 7:31.28     |
 7:31.28     = note: #[warn(unused_mut)] on by default
 7:31.28 
 7:32.27    Compiling parking_lot v0.4.4
 7:32.73 libjs_xpconnect_wrappers.a.desc
 7:34.27    Compiling regex v0.2.2
 7:37.19 libjs_xpconnect_loader.a.desc
 7:37.29    Compiling cubeb-pulse v0.0.2 (file:///tmp/B.kP_R8W/BUILD/mozilla-release-239e434d6d2b8e1e2b697c3416d1e96d48fe98e5/media/libcubeb/cubeb-pulse-rs)
 7:37.87 libhal.a.desc
 7:39.27 libmodules_libjar.a.desc
 7:39.39    Compiling mio-uds v0.6.4
 7:41.07 libmodules_libjar_zipwriter.a.desc
 7:46.27 libstorage_build.a.desc
 7:49.73 libextensions_permissions.a.desc
 7:51.48 libjs_xpconnect_src.a.desc
 7:53.78 libstorage.a.desc
 7:54.40 libextensions_cookie.a.desc
 7:56.28 librdf_datasource.a.desc
 8:00.23 librdf_build.a.desc
 8:01.83 librdf_base.a.desc
 8:02.24 libmedia_webrtc_signaling_src_common.a.desc
 8:15.78 libmedia_webrtc_signaling_src_mediapipeline.a.desc
 8:16.86 libmedia_webrtc_signaling_src_jsep.a.desc
 8:20.81 libmedia_webrtc_signaling_src_media-conduit.a.desc
 8:25.16    Compiling url v1.6.0
 8:30.37 libmedia_webrtc_signaling_src_sdp.a.desc
 8:33.36 libmedia_mtransport_ipc.a.desc
 8:33.45    Compiling phf_codegen v0.7.21
 8:38.91 liburiloader_base.a.desc
 8:41.28 libmedia_webrtc_signaling_src_peerconnection.a.desc
 8:49.14 liburiloader_exthandler.a.desc
 8:53.38 liburiloader_prefetch.a.desc
 8:56.08    Compiling serde_derive_internals v0.19.0 (https://github.com/gankro/serde?branch=deserialize_from_enums4#93e24f26)
 8:58.13 libparser_xml.a.desc
 8:59.29 libmedia_mtransport_build.a.desc
 9:01.24 libparser_htmlparser.a.desc
 9:01.53 libcaps.a.desc
 9:07.96 libparser_expat_lib.a.desc
 9:08.52 libgfx_ycbcr.a.desc
 9:09.24 ./Tokenizer.l:2061:16: warning: function 'yyinput' is not needed and will not be emitted [-Wunneeded-internal-declaration]
 9:09.24     static int yyinput (yyscan_t yyscanner)
 9:09.24                ^
 9:10.00 1 warning generated.
 9:12.20 libgfx_qcms.a.desc
 9:12.26    Compiling darling_core v0.2.0
 9:19.29    Compiling cssparser v0.23.2
 9:27.28 libgfx_src.a.desc
 9:30.38 /tmp/B.kP_R8W/BUILD/mozilla-release-239e434d6d2b8e1e2b697c3416d1e96d48fe98e5/gfx/2d/ScaledFontFontconfig.cpp:400:29: error: no matching function for call to 'cairo_ft_font_face_create_for_pattern'
 9:30.38   cairo_font_face_t* font = cairo_ft_font_face_create_for_pattern(pattern, nullptr, 0);
 9:30.38                             ^~~~~~~~~~~~~~~~~~~~~~~~~~~~~~~~~~~~~
 9:30.38 /usr/include/cairo/cairo-ft.h:104:1: note: candidate function not viable: requires single argument 'pattern', but 3 arguments were provided
 9:30.38 cairo_ft_font_face_create_for_pattern (FcPattern *pattern);
 9:30.38 ^
 9:30.50 1 error generated.
 9:30.51 gmake[4]: *** [/tmp/B.kP_R8W/BUILD/mozilla-release-239e434d6d2b8e1e2b697c3416d1e96d48fe98e5/config/rules.mk:1049: ScaledFontFontconfig.o] Error 1
 9:30.51 gmake[3]: *** [/tmp/B.kP_R8W/BUILD/mozilla-release-239e434d6d2b8e1e2b697c3416d1e96d48fe98e5/config/recurse.mk:73: gfx/2d/target] Error 2
 9:30.51 gmake[3]: *** Waiting for unfinished jobs....
 9:30.51    Compiling synstructure v0.5.2
 9:38.48 libparser_html.a.desc
 9:38.57    Compiling rayon v0.8.2
 9:42.13    Compiling env_logger v0.4.3
 9:42.19    Compiling cssparser-macros v0.3.0
 9:52.67    Compiling selectors v0.19.0 (file:///tmp/B.kP_R8W/BUILD/mozilla-release-239e434d6d2b8e1e2b697c3416d1e96d48fe98e5/servo/components/selectors)
 9:55.86    Compiling rust_url_capi v0.0.1 (file:///tmp/B.kP_R8W/BUILD/mozilla-release-239e434d6d2b8e1e2b697c3416d1e96d48fe98e5/netwerk/base/rust-url-capi)
 9:58.50    Compiling serde_derive v1.0.27 (https://github.com/gankro/serde?branch=deserialize_from_enums4#93e24f26)
 9:59.35 libgfx_angle.a.desc
 9:59.59 libgfx_gl.a.desc
10:01.06    Compiling malloc_size_of_derive v0.0.1 (file:///tmp/B.kP_R8W/BUILD/mozilla-release-239e434d6d2b8e1e2b697c3416d1e96d48fe98e5/servo/components/malloc_size_of_derive)
10:06.44    Compiling darling_macro v0.2.0
10:16.01    Compiling u2fhid v0.1.0 (file:///tmp/B.kP_R8W/BUILD/mozilla-release-239e434d6d2b8e1e2b697c3416d1e96d48fe98e5/dom/webauthn/u2f-hid-rs)
10:16.84    Compiling darling v0.2.0
10:17.20    Compiling style_derive v0.0.1 (file:///tmp/B.kP_R8W/BUILD/mozilla-release-239e434d6d2b8e1e2b697c3416d1e96d48fe98e5/servo/components/style_derive)
10:32.50    Compiling audioipc v0.1.0 (file:///tmp/B.kP_R8W/BUILD/mozilla-release-239e434d6d2b8e1e2b697c3416d1e96d48fe98e5/media/audioipc/audioipc)
10:32.54    Compiling malloc_size_of v0.0.1 (file:///tmp/B.kP_R8W/BUILD/mozilla-release-239e434d6d2b8e1e2b697c3416d1e96d48fe98e5/servo/components/malloc_size_of)
10:36.17    Compiling style_traits v0.0.1 (file:///tmp/B.kP_R8W/BUILD/mozilla-release-239e434d6d2b8e1e2b697c3416d1e96d48fe98e5/servo/components/style_traits)
10:42.01    Compiling audioipc-server v0.1.0 (file:///tmp/B.kP_R8W/BUILD/mozilla-release-239e434d6d2b8e1e2b697c3416d1e96d48fe98e5/media/audioipc/server)
10:42.14    Compiling audioipc-client v0.1.0 (file:///tmp/B.kP_R8W/BUILD/mozilla-release-239e434d6d2b8e1e2b697c3416d1e96d48fe98e5/media/audioipc/client)
10:45.50    Compiling style v0.0.1 (file:///tmp/B.kP_R8W/BUILD/mozilla-release-239e434d6d2b8e1e2b697c3416d1e96d48fe98e5/servo/components/style)
10:45.80 libipc_ipdl.a.desc
13:18.17    Compiling geckoservo v0.0.1 (file:///tmp/B.kP_R8W/BUILD/mozilla-release-239e434d6d2b8e1e2b697c3416d1e96d48fe98e5/servo/ports/geckolib)
13:18.77 warning: unnecessary parentheses around function argument
13:18.77     --> /tmp/B.kP_R8W/BUILD/mozilla-release-239e434d6d2b8e1e2b697c3416d1e96d48fe98e5/servo/ports/geckolib/glue.rs:4393:36
13:18.77      |
13:18.77 4393 |     let name = unsafe { Atom::from((&*name)) };
13:18.77      |                                    ^^^^^^^^ help: remove these parentheses
13:18.77      |
13:18.77      = note: #[warn(unused_parens)] on by default
13:18.77 
13:52.74    Compiling gkrust-shared v0.1.0 (file:///tmp/B.kP_R8W/BUILD/mozilla-release-239e434d6d2b8e1e2b697c3416d1e96d48fe98e5/toolkit/library/rust/shared)
13:53.93    Compiling gkrust v0.1.0 (file:///tmp/B.kP_R8W/BUILD/mozilla-release-239e434d6d2b8e1e2b697c3416d1e96d48fe98e5/toolkit/library/rust)
13:55.42     Finished release [optimized] target(s) in 696.90 secs
13:55.45 gmake[2]: *** [/tmp/B.kP_R8W/BUILD/mozilla-release-239e434d6d2b8e1e2b697c3416d1e96d48fe98e5/config/recurse.mk:33: compile] Error 2
13:55.45 gmake[1]: *** [/tmp/B.kP_R8W/BUILD/mozilla-release-239e434d6d2b8e1e2b697c3416d1e96d48fe98e5/config/rules.mk:434: default] Error 2
13:55.45 gmake: *** [client.mk:168: build] Error 2
13:55.46 27 compiler warnings present.
13:55.49 /usr/bin/notify-send --app-name=Mozilla Build System Mozilla Build System Build failed
error: Bad exit status from /tmp/B.kP_R8W/BUILD/tmp/rpm-tmp.85396 (%build)


RPM build errors:
    Bad exit status from /tmp/B.kP_R8W/BUILD/tmp/rpm-tmp.85396 (%build)
ended at: Sat Mar 31 11:22:35 2018, done in 0:14:48.028935
error: No files produced.
mesg: ttyname failed: Inappropriate ioctl for device
+ chmod -R u+rwX /tmp/B.kP_R8W/BUILD
+ rm -rf /tmp/B.kP_R8W/tmp /tmp/B.kP_R8W/BUILD
mesg: ttyname failed: Inappropriate ioctl for device
+ rm -rf /tmp/B.kP_R8W
Begin-PLD-Builder-Info
Build-Time: user:4294.55s sys:148.17s real:964.81s (faults io:257 non-io:25422361)

End-PLD-Builder-Info
[Back to list of logs] [View rpm -qa of builder]