FailedOk

th/SRPMS[OK]
th/x32[OK]
th/i686[OK]
th/x86_64[OK]

ac/SRPMS[OK]
ac/i386[OK]
ac/i586[OK]
ac/i686[OK]
ac/alpha[OK]
ac/amd64[OK]
ac/athlon[OK]
ac/ppc[OK]
ac/sparc[OK]
ac/sparc64[OK]

Advanced Search
main()
Powered by PLD Linux
(c) 2002-2019 PLD Team
$Revision: 1.37 $
Powered by VAX.
Your IP: 35.153.73.72

firefox 54bb4c80-77c1-45d1-aea7-9cb4785a7aa8

Status:Failed
Source URL:ftp://buildlogs.pld-linux.org/th/x86_64/FAIL/firefox,54bb4c80-77c1-45d1-aea7-9cb4785a7aa8.bz2
text/plain URL:View!
rpm -qa of builder:View!
Date:2019/05/29 00:38:33
Runtime:0:02:04.004538

Toc:

  • error 1
  • rpm: error: Failed build dependencies:
  • error 2
  • rpm: error: Failed build dependencies:
  • prep
  • Executing(%prep): /bin/sh -e /tmp/B.x9xnQx/BUILD/tmp/rpm-tmp.82452
  • build
  • Executing(%build): /bin/sh -e /tmp/B.x9xnQx/BUILD/tmp/rpm-tmp.74927
  • error 3
  • 0:57.10 Error: EFILE
  • error 4
  • 0:57.12 gmake[4]: *** [backend.mk:20: .deps/node.stub.stub] Error 1
  • error 5
  • 0:57.12 gmake[3]: *** [/tmp/B.x9xnQx/BUILD/firefox-67.0/config/recurse.mk:101: devtools/client/debugger/new/src/export] Error 2
  • error 6
  • 1:30.59 gmake[2]: *** [/tmp/B.x9xnQx/BUILD/firefox-67.0/config/recurse.mk:34: export] Error 2
  • error 7
  • 1:30.59 gmake[1]: *** [/tmp/B.x9xnQx/BUILD/firefox-67.0/config/rules.mk:400: default] Error 2
  • error 8
  • error: Bad exit status from /tmp/B.x9xnQx/BUILD/tmp/rpm-tmp.74927 (%build)
  • error 9
  • RPM build errors:
  • error 10
  • error: No files produced.

Content:

request from: baggins
checking if we should skip the build
started at: Wed May 29 00:34:07 2019
killing old processes on a builder
sending signal 9 to pid -1
Killed
cleaning up /tmp
fetching https://srcbuilder.pld-linux.org/th//srpms/54bb4c80-77c1-45d1-aea7-9cb4785a7aa8/firefox-67.0-0.1.src.rpm
fetched 328756614 bytes, 3390.1 K/s
installing srpm: firefox-67.0-0.1.src.rpm
+ install -d /tmp/B.x9xnQx/BUILD /tmp/B.x9xnQx/RPMS
+ LC_ALL=en_US.UTF-8
+ rpm -qp --changelog firefox-67.0-0.1.src.rpm
* Tue May 28 2019 PLD Linux Team <feedback@pld-linux.org>
- For complete changelog see: http://git.pld-linux.org/?p=packages/firefox.git;a=log;h=master
* Tue May 28 2019 Jakub Bogusz <qboosh@pld-linux.org> 4218e21
- requires libvpx 1.7.0 now * Sun May 26 2019 Jakub Bogusz <qboosh@pld-linux.org> 3bfbca3
- started play with 67.0 * Sun May 26 2019 Jakub Bogusz <qboosh@pld-linux.org> c33d2a9
- update vendor.js files * Sat May 25 2019 Jakub Bogusz <qboosh@pld-linux.org> 4b19dab
- pl for -geckodriver * Mon Apr 22 2019 Jakub Bogusz <qboosh@pld-linux.org> 8f587d7
- up to 66.0.3 - updated prefs,middle_click_paste patches * Mon Nov 05 2018 Jan Rękorajski <baggins@pld-linux.org> 38ba816
- BR rust-cbindgen * Sun Nov 04 2018 Jan Rękorajski <baggins@pld-linux.org> 232058a
- up to 63.0.1 * Sun Oct 07 2018 Jan Palus <jan.palus@fisglobal.com> b015547
- up to 62.0.3 (fixes CVE-2018-12386, CVE-2018-12387) * Sat Sep 22 2018 Jan Palus <atler@pld-linux.org> 2c0b1ea
- up to 62.0.2 * Wed Sep 12 2018 Jan Palus <atler@pld-linux.org> dfdbf76
- add lto bcond for building with link time optimization * Wed Sep 05 2018 Jan Palus <atler@pld-linux.org> 2297858
- updated BRs * Wed Sep 05 2018 Jan Palus <atler@pld-linux.org> 4e0397b
- up to 62.0 * Tue Aug 21 2018 Jan Palus <atler@pld-linux.org> 34e9432
- typo * Tue Aug 21 2018 Jan Palus <atler@pld-linux.org> 89e01bb
- do not build against system hunspell; rel 2 * Sat Aug 18 2018 Jan Palus <atler@pld-linux.org> 41b7ad7
- updated BRs * Sat Aug 18 2018 Jan Palus <atler@pld-linux.org> 52c8925
- add bcond for enabling legacy extensions support * Fri Aug 10 2018 Arkadiusz Miśkiewicz <arekm@maven.pl> 535a285
- up to 61.0.2 * Wed Jul 11 2018 Jan Palus <atler@pld-linux.org> 294e073
- use gold linker by default * Sun Jul 08 2018 Jan Palus <atler@pld-linux.org> 9e61831
- add bcond for building with gold linker * Sun Jul 08 2018 Jan Palus <atler@pld-linux.org> ede96c7
- enable verbose output during build + rpm -Uhv --nodeps --define '_topdir /tmp/B.x9xnQx' --define '_specdir %{_topdir}' --define '_sourcedir %{_specdir}' --define '_rpmdir %{_topdir}/RPMS' --define '_builddir %{_topdir}/BUILD' firefox-67.0-0.1.src.rpm Preparing... ################################################## firefox ################################################## + rm -f firefox-67.0-0.1.src.rpm + install -m 700 -d /tmp/B.x9xnQx/BUILD/tmp + TMPDIR=/tmp/B.x9xnQx/BUILD/tmp + exec nice -n 0 rpmbuild -bp --short-circuit --nodeps --define '_topdir /tmp/B.x9xnQx' --define '_specdir %{_topdir}' --define '_sourcedir %{_specdir}' --define '_rpmdir %{_topdir}/RPMS' --define '_builddir %{_topdir}/BUILD' --target x86_64-pld-linux --define 'prep exit 0' /tmp/B.x9xnQx/firefox.spec Building target platforms: x86_64-pld-linux checking BuildConflict-ing packages no BuildConflicts found checking BR rpm: error: Failed build dependencies: rpm: rust-cbindgen >= 0.8.2 is needed by firefox-67.0-0.1.src rpm: Building target platforms: x86_64-pld-linux updating poldek cache... ready is up to date Retrieving th::packages.ndir.md... th is up to date Retrieving th::packages.ndir.md... th is up to date Retrieving th-ready::packages.ndir.md... th-ready is up to date Retrieving th-ready::packages.ndir.md... th-ready is up to date Retrieving th-test::packages.ndir.md... Retrieving th-test::packages.ndir.diff.toc.gz... Retrieving diff::packages.ndir.2019.05.28-08.29.03.gz... ..............................done Retrieving diff::packages.ndir.dscr.2019.05.28-08.29.03.gz... Loading [pndir]th-test... Applying packages.ndir.2019.05.28-08.29.03.gz... Retrieving diff::packages.ndir.2019.05.28-09.26.02.gz... ..............................done Retrieving diff::packages.ndir.dscr.2019.05.28-09.26.02.gz... Applying packages.ndir.2019.05.28-09.26.02.gz... Retrieving diff::packages.ndir.2019.05.28-10.01.01.gz... Retrieving diff::packages.ndir.dscr.2019.05.28-10.01.01.gz... Applying packages.ndir.2019.05.28-10.01.01.gz... Writing /root/.poldek-cache/[...]/packages.ndir.gz... Retrieving th-test::packages.ndir.md... Retrieving th-test::packages.ndir.diff.toc.gz... Retrieving diff::packages.ndir.2019.05.28-09.02.01.gz... ..............................done Retrieving diff::packages.ndir.dscr.2019.05.28-09.02.01.gz... Loading [pndir]th-test... Applying packages.ndir.2019.05.28-09.02.01.gz... Retrieving diff::packages.ndir.2019.05.28-09.05.02.gz... ..............................done Retrieving diff::packages.ndir.dscr.2019.05.28-09.05.02.gz... ..............................done Applying packages.ndir.2019.05.28-09.05.02.gz... Retrieving diff::packages.ndir.2019.05.28-09.26.02.gz... ..............................done Retrieving diff::packages.ndir.dscr.2019.05.28-09.26.02.gz... Applying packages.ndir.2019.05.28-09.26.02.gz... Retrieving diff::packages.ndir.2019.05.28-09.36.01.gz... Retrieving diff::packages.ndir.dscr.2019.05.28-09.36.01.gz... Applying packages.ndir.2019.05.28-09.36.01.gz... Retrieving diff::packages.ndir.2019.05.28-10.01.01.gz... ..............................done Retrieving diff::packages.ndir.dscr.2019.05.28-10.01.01.gz... Applying packages.ndir.2019.05.28-10.01.01.gz... Retrieving diff::packages.ndir.2019.05.28-15.33.01.gz... ..............................done Retrieving diff::packages.ndir.dscr.2019.05.28-15.33.01.gz... Applying packages.ndir.2019.05.28-15.33.01.gz... Retrieving diff::packages.ndir.2019.05.28-15.58.01.gz... ..............................done Retrieving diff::packages.ndir.dscr.2019.05.28-15.58.01.gz... Applying packages.ndir.2019.05.28-15.58.01.gz... Writing /root/.poldek-cache/[...]/packages.ndir.gz... checking conflicting packages in BRed packages poldek: Loading [pndir]ready... poldek: Loading [pndir]th-test... poldek: Loading [pndir]th-test... poldek: Loading [pndir]th-ready... poldek: Loading [pndir]th-ready... poldek: Loading [pndir]th... poldek: Loading [pndir]th... poldek: 32492 packages read poldek: Removed 4820 duplicate packages from available set poldek: Processing dependencies... poldek: There are 1 package to install: poldek: I rust-cbindgen-0.8.7-2.x86_64 poldek: This operation will use 4.4MB of disk space. poldek: Need to get 1.1MB of archives. poldek: Executing pm-command.sh --upgrade -vh --test --root / --define _check_dirname_deps 1... poldek: Preparing... ################################################## no conflicts found checking BR rpm: error: Failed build dependencies: rpm: rust-cbindgen >= 0.8.2 is needed by firefox-67.0-0.1.src rpm: Building target platforms: x86_64-pld-linux installing BR: rust\-cbindgen + poldek --noask --caplookup -Q -v '--ignore=hhvm-*' '--ignore=php4-*' '--ignore=php52-*' '--ignore=php54-*' '--ignore=php55-*' '--ignore=php56-*' '--ignore=php70-*' '--ignore=php71-*' '--ignore=php72-*' '--ignore=php73-*' --upgrade rust-cbindgen Loading [pndir]ready... Loading [pndir]th-test... Loading [pndir]th-test... Loading [pndir]th-ready... Loading [pndir]th-ready... Loading [pndir]th... Loading [pndir]th... 32492 packages read Removed 4820 duplicate packages from available set Processing dependencies... There are 1 package to install: I rust-cbindgen-0.8.7-2.x86_64 This operation will use 4.4MB of disk space. Need to get 1.1MB of archives. Executing pm-command.sh --upgrade -vh --root / --define _check_dirname_deps 1... Preparing... ################################################## rust-cbindgen ################################################## building RPM using: set -ex; : build-id: 54bb4c80-77c1-45d1-aea7-9cb4785a7aa8; TMPDIR=/tmp/B.x9xnQx/BUILD/tmp exec nice -n 0 rpmbuild -bb --define '_smp_mflags -j9' --define '_make_opts -Otarget' --define '_pld_builder 1' --define '_topdir /tmp/B.x9xnQx' --define '_specdir %{_topdir}' --define '_sourcedir %{_specdir}' --define '_rpmdir %{_topdir}/RPMS' --define '_builddir %{_topdir}/BUILD' --target x86_64-pld-linux /tmp/B.x9xnQx/firefox.spec + : build-id: 54bb4c80-77c1-45d1-aea7-9cb4785a7aa8 + TMPDIR=/tmp/B.x9xnQx/BUILD/tmp + exec nice -n 0 rpmbuild -bb --define '_smp_mflags -j9' --define '_make_opts -Otarget' --define '_pld_builder 1' --define '_topdir /tmp/B.x9xnQx' --define '_specdir %{_topdir}' --define '_sourcedir %{_specdir}' --define '_rpmdir %{_topdir}/RPMS' --define '_builddir %{_topdir}/BUILD' --target x86_64-pld-linux /tmp/B.x9xnQx/firefox.spec Building target platforms: x86_64-pld-linux Executing(%prep): /bin/sh -e /tmp/B.x9xnQx/BUILD/tmp/rpm-tmp.82452 + umask 022 + cd /tmp/B.x9xnQx/BUILD + cd /tmp/B.x9xnQx/BUILD + rm -rf firefox-67.0 + /usr/bin/xz -dc /tmp/B.x9xnQx/firefox-67.0.source.tar.xz + /bin/tar -xf - + STATUS=0 + '[' 0 -ne 0 ']' + cd firefox-67.0 + unpack -qq /tmp/B.x9xnQx/ach.xpi + typeset 'args=-qq' 'file=/tmp/B.x9xnQx/ach.xpi' + cp -p /tmp/B.x9xnQx/ach.xpi . + STATUS=0 + '[' 0 -ne 0 ']' + unpack -qq /tmp/B.x9xnQx/af.xpi + typeset 'args=-qq' 'file=/tmp/B.x9xnQx/af.xpi' + cp -p /tmp/B.x9xnQx/af.xpi . + STATUS=0 + '[' 0 -ne 0 ']' + unpack -qq /tmp/B.x9xnQx/an.xpi + typeset 'args=-qq' 'file=/tmp/B.x9xnQx/an.xpi' + cp -p /tmp/B.x9xnQx/an.xpi . + STATUS=0 + '[' 0 -ne 0 ']' + unpack -qq /tmp/B.x9xnQx/ar.xpi + typeset 'args=-qq' 'file=/tmp/B.x9xnQx/ar.xpi' + cp -p /tmp/B.x9xnQx/ar.xpi . + STATUS=0 + '[' 0 -ne 0 ']' + unpack -qq /tmp/B.x9xnQx/as.xpi + typeset 'args=-qq' 'file=/tmp/B.x9xnQx/as.xpi' + cp -p /tmp/B.x9xnQx/as.xpi . + STATUS=0 + '[' 0 -ne 0 ']' + unpack -qq /tmp/B.x9xnQx/ast.xpi + typeset 'args=-qq' 'file=/tmp/B.x9xnQx/ast.xpi' + cp -p /tmp/B.x9xnQx/ast.xpi . + STATUS=0 + '[' 0 -ne 0 ']' + unpack -qq /tmp/B.x9xnQx/az.xpi + typeset 'args=-qq' 'file=/tmp/B.x9xnQx/az.xpi' + cp -p /tmp/B.x9xnQx/az.xpi . + STATUS=0 + '[' 0 -ne 0 ']' + unpack -qq /tmp/B.x9xnQx/be.xpi + typeset 'args=-qq' 'file=/tmp/B.x9xnQx/be.xpi' + cp -p /tmp/B.x9xnQx/be.xpi . + STATUS=0 + '[' 0 -ne 0 ']' + unpack -qq /tmp/B.x9xnQx/bg.xpi + typeset 'args=-qq' 'file=/tmp/B.x9xnQx/bg.xpi' + cp -p /tmp/B.x9xnQx/bg.xpi . + STATUS=0 + '[' 0 -ne 0 ']' + unpack -qq /tmp/B.x9xnQx/bn-BD.xpi + typeset 'args=-qq' 'file=/tmp/B.x9xnQx/bn-BD.xpi' + cp -p /tmp/B.x9xnQx/bn-BD.xpi . + STATUS=0 + '[' 0 -ne 0 ']' + unpack -qq /tmp/B.x9xnQx/bn-IN.xpi + typeset 'args=-qq' 'file=/tmp/B.x9xnQx/bn-IN.xpi' + cp -p /tmp/B.x9xnQx/bn-IN.xpi . + STATUS=0 + '[' 0 -ne 0 ']' + unpack -qq /tmp/B.x9xnQx/br.xpi + typeset 'args=-qq' 'file=/tmp/B.x9xnQx/br.xpi' + cp -p /tmp/B.x9xnQx/br.xpi . + STATUS=0 + '[' 0 -ne 0 ']' + unpack -qq /tmp/B.x9xnQx/bs.xpi + typeset 'args=-qq' 'file=/tmp/B.x9xnQx/bs.xpi' + cp -p /tmp/B.x9xnQx/bs.xpi . + STATUS=0 + '[' 0 -ne 0 ']' + unpack -qq /tmp/B.x9xnQx/ca.xpi + typeset 'args=-qq' 'file=/tmp/B.x9xnQx/ca.xpi' + cp -p /tmp/B.x9xnQx/ca.xpi . + STATUS=0 + '[' 0 -ne 0 ']' + unpack -qq /tmp/B.x9xnQx/cak.xpi + typeset 'args=-qq' 'file=/tmp/B.x9xnQx/cak.xpi' + cp -p /tmp/B.x9xnQx/cak.xpi . + STATUS=0 + '[' 0 -ne 0 ']' + unpack -qq /tmp/B.x9xnQx/cs.xpi + typeset 'args=-qq' 'file=/tmp/B.x9xnQx/cs.xpi' + cp -p /tmp/B.x9xnQx/cs.xpi . + STATUS=0 + '[' 0 -ne 0 ']' + unpack -qq /tmp/B.x9xnQx/cy.xpi + typeset 'args=-qq' 'file=/tmp/B.x9xnQx/cy.xpi' + cp -p /tmp/B.x9xnQx/cy.xpi . + STATUS=0 + '[' 0 -ne 0 ']' + unpack -qq /tmp/B.x9xnQx/da.xpi + typeset 'args=-qq' 'file=/tmp/B.x9xnQx/da.xpi' + cp -p /tmp/B.x9xnQx/da.xpi . + STATUS=0 + '[' 0 -ne 0 ']' + unpack -qq /tmp/B.x9xnQx/de.xpi + typeset 'args=-qq' 'file=/tmp/B.x9xnQx/de.xpi' + cp -p /tmp/B.x9xnQx/de.xpi . + STATUS=0 + '[' 0 -ne 0 ']' + unpack -qq /tmp/B.x9xnQx/dsb.xpi + typeset 'args=-qq' 'file=/tmp/B.x9xnQx/dsb.xpi' + cp -p /tmp/B.x9xnQx/dsb.xpi . + STATUS=0 + '[' 0 -ne 0 ']' + unpack -qq /tmp/B.x9xnQx/el.xpi + typeset 'args=-qq' 'file=/tmp/B.x9xnQx/el.xpi' + cp -p /tmp/B.x9xnQx/el.xpi . + STATUS=0 + '[' 0 -ne 0 ']' + unpack -qq /tmp/B.x9xnQx/en-CA.xpi + typeset 'args=-qq' 'file=/tmp/B.x9xnQx/en-CA.xpi' + cp -p /tmp/B.x9xnQx/en-CA.xpi . + STATUS=0 + '[' 0 -ne 0 ']' + unpack -qq /tmp/B.x9xnQx/en-GB.xpi + typeset 'args=-qq' 'file=/tmp/B.x9xnQx/en-GB.xpi' + cp -p /tmp/B.x9xnQx/en-GB.xpi . + STATUS=0 + '[' 0 -ne 0 ']' + unpack -qq /tmp/B.x9xnQx/en-US.xpi + typeset 'args=-qq' 'file=/tmp/B.x9xnQx/en-US.xpi' + cp -p /tmp/B.x9xnQx/en-US.xpi . + STATUS=0 + '[' 0 -ne 0 ']' + unpack -qq /tmp/B.x9xnQx/en-ZA.xpi + typeset 'args=-qq' 'file=/tmp/B.x9xnQx/en-ZA.xpi' + cp -p /tmp/B.x9xnQx/en-ZA.xpi . + STATUS=0 + '[' 0 -ne 0 ']' + unpack -qq /tmp/B.x9xnQx/eo.xpi + typeset 'args=-qq' 'file=/tmp/B.x9xnQx/eo.xpi' + cp -p /tmp/B.x9xnQx/eo.xpi . + STATUS=0 + '[' 0 -ne 0 ']' + unpack -qq /tmp/B.x9xnQx/es-AR.xpi + typeset 'args=-qq' 'file=/tmp/B.x9xnQx/es-AR.xpi' + cp -p /tmp/B.x9xnQx/es-AR.xpi . + STATUS=0 + '[' 0 -ne 0 ']' + unpack -qq /tmp/B.x9xnQx/es-CL.xpi + typeset 'args=-qq' 'file=/tmp/B.x9xnQx/es-CL.xpi' + cp -p /tmp/B.x9xnQx/es-CL.xpi . + STATUS=0 + '[' 0 -ne 0 ']' + unpack -qq /tmp/B.x9xnQx/es-ES.xpi + typeset 'args=-qq' 'file=/tmp/B.x9xnQx/es-ES.xpi' + cp -p /tmp/B.x9xnQx/es-ES.xpi . + STATUS=0 + '[' 0 -ne 0 ']' + unpack -qq /tmp/B.x9xnQx/es-MX.xpi + typeset 'args=-qq' 'file=/tmp/B.x9xnQx/es-MX.xpi' + cp -p /tmp/B.x9xnQx/es-MX.xpi . + STATUS=0 + '[' 0 -ne 0 ']' + unpack -qq /tmp/B.x9xnQx/et.xpi + typeset 'args=-qq' 'file=/tmp/B.x9xnQx/et.xpi' + cp -p /tmp/B.x9xnQx/et.xpi . + STATUS=0 + '[' 0 -ne 0 ']' + unpack -qq /tmp/B.x9xnQx/eu.xpi + typeset 'args=-qq' 'file=/tmp/B.x9xnQx/eu.xpi' + cp -p /tmp/B.x9xnQx/eu.xpi . + STATUS=0 + '[' 0 -ne 0 ']' + unpack -qq /tmp/B.x9xnQx/fa.xpi + typeset 'args=-qq' 'file=/tmp/B.x9xnQx/fa.xpi' + cp -p /tmp/B.x9xnQx/fa.xpi . + STATUS=0 + '[' 0 -ne 0 ']' + unpack -qq /tmp/B.x9xnQx/ff.xpi + typeset 'args=-qq' 'file=/tmp/B.x9xnQx/ff.xpi' + cp -p /tmp/B.x9xnQx/ff.xpi . + STATUS=0 + '[' 0 -ne 0 ']' + unpack -qq /tmp/B.x9xnQx/fi.xpi + typeset 'args=-qq' 'file=/tmp/B.x9xnQx/fi.xpi' + cp -p /tmp/B.x9xnQx/fi.xpi . + STATUS=0 + '[' 0 -ne 0 ']' + unpack -qq /tmp/B.x9xnQx/fr.xpi + typeset 'args=-qq' 'file=/tmp/B.x9xnQx/fr.xpi' + cp -p /tmp/B.x9xnQx/fr.xpi . + STATUS=0 + '[' 0 -ne 0 ']' + unpack -qq /tmp/B.x9xnQx/fy-NL.xpi + typeset 'args=-qq' 'file=/tmp/B.x9xnQx/fy-NL.xpi' + cp -p /tmp/B.x9xnQx/fy-NL.xpi . + STATUS=0 + '[' 0 -ne 0 ']' + unpack -qq /tmp/B.x9xnQx/ga-IE.xpi + typeset 'args=-qq' 'file=/tmp/B.x9xnQx/ga-IE.xpi' + cp -p /tmp/B.x9xnQx/ga-IE.xpi . + STATUS=0 + '[' 0 -ne 0 ']' + unpack -qq /tmp/B.x9xnQx/gd.xpi + typeset 'args=-qq' 'file=/tmp/B.x9xnQx/gd.xpi' + cp -p /tmp/B.x9xnQx/gd.xpi . + STATUS=0 + '[' 0 -ne 0 ']' + unpack -qq /tmp/B.x9xnQx/gl.xpi + typeset 'args=-qq' 'file=/tmp/B.x9xnQx/gl.xpi' + cp -p /tmp/B.x9xnQx/gl.xpi . + STATUS=0 + '[' 0 -ne 0 ']' + unpack -qq /tmp/B.x9xnQx/gn.xpi + typeset 'args=-qq' 'file=/tmp/B.x9xnQx/gn.xpi' + cp -p /tmp/B.x9xnQx/gn.xpi . + STATUS=0 + '[' 0 -ne 0 ']' + unpack -qq /tmp/B.x9xnQx/gu-IN.xpi + typeset 'args=-qq' 'file=/tmp/B.x9xnQx/gu-IN.xpi' + cp -p /tmp/B.x9xnQx/gu-IN.xpi . + STATUS=0 + '[' 0 -ne 0 ']' + unpack -qq /tmp/B.x9xnQx/he.xpi + typeset 'args=-qq' 'file=/tmp/B.x9xnQx/he.xpi' + cp -p /tmp/B.x9xnQx/he.xpi . + STATUS=0 + '[' 0 -ne 0 ']' + unpack -qq /tmp/B.x9xnQx/hi-IN.xpi + typeset 'args=-qq' 'file=/tmp/B.x9xnQx/hi-IN.xpi' + cp -p /tmp/B.x9xnQx/hi-IN.xpi . + STATUS=0 + '[' 0 -ne 0 ']' + unpack -qq /tmp/B.x9xnQx/hr.xpi + typeset 'args=-qq' 'file=/tmp/B.x9xnQx/hr.xpi' + cp -p /tmp/B.x9xnQx/hr.xpi . + STATUS=0 + '[' 0 -ne 0 ']' + unpack -qq /tmp/B.x9xnQx/hsb.xpi + typeset 'args=-qq' 'file=/tmp/B.x9xnQx/hsb.xpi' + cp -p /tmp/B.x9xnQx/hsb.xpi . + STATUS=0 + '[' 0 -ne 0 ']' + unpack -qq /tmp/B.x9xnQx/hu.xpi + typeset 'args=-qq' 'file=/tmp/B.x9xnQx/hu.xpi' + cp -p /tmp/B.x9xnQx/hu.xpi . + STATUS=0 + '[' 0 -ne 0 ']' + unpack -qq /tmp/B.x9xnQx/hy-AM.xpi + typeset 'args=-qq' 'file=/tmp/B.x9xnQx/hy-AM.xpi' + cp -p /tmp/B.x9xnQx/hy-AM.xpi . + STATUS=0 + '[' 0 -ne 0 ']' + unpack -qq /tmp/B.x9xnQx/ia.xpi + typeset 'args=-qq' 'file=/tmp/B.x9xnQx/ia.xpi' + cp -p /tmp/B.x9xnQx/ia.xpi . + STATUS=0 + '[' 0 -ne 0 ']' + unpack -qq /tmp/B.x9xnQx/id.xpi + typeset 'args=-qq' 'file=/tmp/B.x9xnQx/id.xpi' + cp -p /tmp/B.x9xnQx/id.xpi . + STATUS=0 + '[' 0 -ne 0 ']' + unpack -qq /tmp/B.x9xnQx/is.xpi + typeset 'args=-qq' 'file=/tmp/B.x9xnQx/is.xpi' + cp -p /tmp/B.x9xnQx/is.xpi . + STATUS=0 + '[' 0 -ne 0 ']' + unpack -qq /tmp/B.x9xnQx/it.xpi + typeset 'args=-qq' 'file=/tmp/B.x9xnQx/it.xpi' + cp -p /tmp/B.x9xnQx/it.xpi . + STATUS=0 + '[' 0 -ne 0 ']' + unpack -qq /tmp/B.x9xnQx/ja.xpi + typeset 'args=-qq' 'file=/tmp/B.x9xnQx/ja.xpi' + cp -p /tmp/B.x9xnQx/ja.xpi . + STATUS=0 + '[' 0 -ne 0 ']' + unpack -qq /tmp/B.x9xnQx/ka.xpi + typeset 'args=-qq' 'file=/tmp/B.x9xnQx/ka.xpi' + cp -p /tmp/B.x9xnQx/ka.xpi . + STATUS=0 + '[' 0 -ne 0 ']' + unpack -qq /tmp/B.x9xnQx/kab.xpi + typeset 'args=-qq' 'file=/tmp/B.x9xnQx/kab.xpi' + cp -p /tmp/B.x9xnQx/kab.xpi . + STATUS=0 + '[' 0 -ne 0 ']' + unpack -qq /tmp/B.x9xnQx/kk.xpi + typeset 'args=-qq' 'file=/tmp/B.x9xnQx/kk.xpi' + cp -p /tmp/B.x9xnQx/kk.xpi . + STATUS=0 + '[' 0 -ne 0 ']' + unpack -qq /tmp/B.x9xnQx/km.xpi + typeset 'args=-qq' 'file=/tmp/B.x9xnQx/km.xpi' + cp -p /tmp/B.x9xnQx/km.xpi . + STATUS=0 + '[' 0 -ne 0 ']' + unpack -qq /tmp/B.x9xnQx/kn.xpi + typeset 'args=-qq' 'file=/tmp/B.x9xnQx/kn.xpi' + cp -p /tmp/B.x9xnQx/kn.xpi . + STATUS=0 + '[' 0 -ne 0 ']' + unpack -qq /tmp/B.x9xnQx/ko.xpi + typeset 'args=-qq' 'file=/tmp/B.x9xnQx/ko.xpi' + cp -p /tmp/B.x9xnQx/ko.xpi . + STATUS=0 + '[' 0 -ne 0 ']' + unpack -qq /tmp/B.x9xnQx/lij.xpi + typeset 'args=-qq' 'file=/tmp/B.x9xnQx/lij.xpi' + cp -p /tmp/B.x9xnQx/lij.xpi . + STATUS=0 + '[' 0 -ne 0 ']' + unpack -qq /tmp/B.x9xnQx/lt.xpi + typeset 'args=-qq' 'file=/tmp/B.x9xnQx/lt.xpi' + cp -p /tmp/B.x9xnQx/lt.xpi . + STATUS=0 + '[' 0 -ne 0 ']' + unpack -qq /tmp/B.x9xnQx/lv.xpi + typeset 'args=-qq' 'file=/tmp/B.x9xnQx/lv.xpi' + cp -p /tmp/B.x9xnQx/lv.xpi . + STATUS=0 + '[' 0 -ne 0 ']' + unpack -qq /tmp/B.x9xnQx/mai.xpi + typeset 'args=-qq' 'file=/tmp/B.x9xnQx/mai.xpi' + cp -p /tmp/B.x9xnQx/mai.xpi . + STATUS=0 + '[' 0 -ne 0 ']' + unpack -qq /tmp/B.x9xnQx/mk.xpi + typeset 'args=-qq' 'file=/tmp/B.x9xnQx/mk.xpi' + cp -p /tmp/B.x9xnQx/mk.xpi . + STATUS=0 + '[' 0 -ne 0 ']' + unpack -qq /tmp/B.x9xnQx/ml.xpi + typeset 'args=-qq' 'file=/tmp/B.x9xnQx/ml.xpi' + cp -p /tmp/B.x9xnQx/ml.xpi . + STATUS=0 + '[' 0 -ne 0 ']' + unpack -qq /tmp/B.x9xnQx/mr.xpi + typeset 'args=-qq' 'file=/tmp/B.x9xnQx/mr.xpi' + cp -p /tmp/B.x9xnQx/mr.xpi . + STATUS=0 + '[' 0 -ne 0 ']' + unpack -qq /tmp/B.x9xnQx/ms.xpi + typeset 'args=-qq' 'file=/tmp/B.x9xnQx/ms.xpi' + cp -p /tmp/B.x9xnQx/ms.xpi . + STATUS=0 + '[' 0 -ne 0 ']' + unpack -qq /tmp/B.x9xnQx/my.xpi + typeset 'args=-qq' 'file=/tmp/B.x9xnQx/my.xpi' + cp -p /tmp/B.x9xnQx/my.xpi . + STATUS=0 + '[' 0 -ne 0 ']' + unpack -qq /tmp/B.x9xnQx/nb-NO.xpi + typeset 'args=-qq' 'file=/tmp/B.x9xnQx/nb-NO.xpi' + cp -p /tmp/B.x9xnQx/nb-NO.xpi . + STATUS=0 + '[' 0 -ne 0 ']' + unpack -qq /tmp/B.x9xnQx/ne-NP.xpi + typeset 'args=-qq' 'file=/tmp/B.x9xnQx/ne-NP.xpi' + cp -p /tmp/B.x9xnQx/ne-NP.xpi . + STATUS=0 + '[' 0 -ne 0 ']' + unpack -qq /tmp/B.x9xnQx/nl.xpi + typeset 'args=-qq' 'file=/tmp/B.x9xnQx/nl.xpi' + cp -p /tmp/B.x9xnQx/nl.xpi . + STATUS=0 + '[' 0 -ne 0 ']' + unpack -qq /tmp/B.x9xnQx/nn-NO.xpi + typeset 'args=-qq' 'file=/tmp/B.x9xnQx/nn-NO.xpi' + cp -p /tmp/B.x9xnQx/nn-NO.xpi . + STATUS=0 + '[' 0 -ne 0 ']' + unpack -qq /tmp/B.x9xnQx/oc.xpi + typeset 'args=-qq' 'file=/tmp/B.x9xnQx/oc.xpi' + cp -p /tmp/B.x9xnQx/oc.xpi . + STATUS=0 + '[' 0 -ne 0 ']' + unpack -qq /tmp/B.x9xnQx/or.xpi + typeset 'args=-qq' 'file=/tmp/B.x9xnQx/or.xpi' + cp -p /tmp/B.x9xnQx/or.xpi . + STATUS=0 + '[' 0 -ne 0 ']' + unpack -qq /tmp/B.x9xnQx/pa-IN.xpi + typeset 'args=-qq' 'file=/tmp/B.x9xnQx/pa-IN.xpi' + cp -p /tmp/B.x9xnQx/pa-IN.xpi . + STATUS=0 + '[' 0 -ne 0 ']' + unpack -qq /tmp/B.x9xnQx/pl.xpi + typeset 'args=-qq' 'file=/tmp/B.x9xnQx/pl.xpi' + cp -p /tmp/B.x9xnQx/pl.xpi . + STATUS=0 + '[' 0 -ne 0 ']' + unpack -qq /tmp/B.x9xnQx/pt-BR.xpi + typeset 'args=-qq' 'file=/tmp/B.x9xnQx/pt-BR.xpi' + cp -p /tmp/B.x9xnQx/pt-BR.xpi . + STATUS=0 + '[' 0 -ne 0 ']' + unpack -qq /tmp/B.x9xnQx/pt-PT.xpi + typeset 'args=-qq' 'file=/tmp/B.x9xnQx/pt-PT.xpi' + cp -p /tmp/B.x9xnQx/pt-PT.xpi . + STATUS=0 + '[' 0 -ne 0 ']' + unpack -qq /tmp/B.x9xnQx/rm.xpi + typeset 'args=-qq' 'file=/tmp/B.x9xnQx/rm.xpi' + cp -p /tmp/B.x9xnQx/rm.xpi . + STATUS=0 + '[' 0 -ne 0 ']' + unpack -qq /tmp/B.x9xnQx/ro.xpi + typeset 'args=-qq' 'file=/tmp/B.x9xnQx/ro.xpi' + cp -p /tmp/B.x9xnQx/ro.xpi . + STATUS=0 + '[' 0 -ne 0 ']' + unpack -qq /tmp/B.x9xnQx/ru.xpi + typeset 'args=-qq' 'file=/tmp/B.x9xnQx/ru.xpi' + cp -p /tmp/B.x9xnQx/ru.xpi . + STATUS=0 + '[' 0 -ne 0 ']' + unpack -qq /tmp/B.x9xnQx/si.xpi + typeset 'args=-qq' 'file=/tmp/B.x9xnQx/si.xpi' + cp -p /tmp/B.x9xnQx/si.xpi . + STATUS=0 + '[' 0 -ne 0 ']' + unpack -qq /tmp/B.x9xnQx/sk.xpi + typeset 'args=-qq' 'file=/tmp/B.x9xnQx/sk.xpi' + cp -p /tmp/B.x9xnQx/sk.xpi . + STATUS=0 + '[' 0 -ne 0 ']' + unpack -qq /tmp/B.x9xnQx/sl.xpi + typeset 'args=-qq' 'file=/tmp/B.x9xnQx/sl.xpi' + cp -p /tmp/B.x9xnQx/sl.xpi . + STATUS=0 + '[' 0 -ne 0 ']' + unpack -qq /tmp/B.x9xnQx/son.xpi + typeset 'args=-qq' 'file=/tmp/B.x9xnQx/son.xpi' + cp -p /tmp/B.x9xnQx/son.xpi . + STATUS=0 + '[' 0 -ne 0 ']' + unpack -qq /tmp/B.x9xnQx/sq.xpi + typeset 'args=-qq' 'file=/tmp/B.x9xnQx/sq.xpi' + cp -p /tmp/B.x9xnQx/sq.xpi . + STATUS=0 + '[' 0 -ne 0 ']' + unpack -qq /tmp/B.x9xnQx/sr.xpi + typeset 'args=-qq' 'file=/tmp/B.x9xnQx/sr.xpi' + cp -p /tmp/B.x9xnQx/sr.xpi . + STATUS=0 + '[' 0 -ne 0 ']' + unpack -qq /tmp/B.x9xnQx/sv-SE.xpi + typeset 'args=-qq' 'file=/tmp/B.x9xnQx/sv-SE.xpi' + cp -p /tmp/B.x9xnQx/sv-SE.xpi . + STATUS=0 + '[' 0 -ne 0 ']' + unpack -qq /tmp/B.x9xnQx/ta.xpi + typeset 'args=-qq' 'file=/tmp/B.x9xnQx/ta.xpi' + cp -p /tmp/B.x9xnQx/ta.xpi . + STATUS=0 + '[' 0 -ne 0 ']' + unpack -qq /tmp/B.x9xnQx/te.xpi + typeset 'args=-qq' 'file=/tmp/B.x9xnQx/te.xpi' + cp -p /tmp/B.x9xnQx/te.xpi . + STATUS=0 + '[' 0 -ne 0 ']' + unpack -qq /tmp/B.x9xnQx/th.xpi + typeset 'args=-qq' 'file=/tmp/B.x9xnQx/th.xpi' + cp -p /tmp/B.x9xnQx/th.xpi . + STATUS=0 + '[' 0 -ne 0 ']' + unpack -qq /tmp/B.x9xnQx/tr.xpi + typeset 'args=-qq' 'file=/tmp/B.x9xnQx/tr.xpi' + cp -p /tmp/B.x9xnQx/tr.xpi . + STATUS=0 + '[' 0 -ne 0 ']' + unpack -qq /tmp/B.x9xnQx/uk.xpi + typeset 'args=-qq' 'file=/tmp/B.x9xnQx/uk.xpi' + cp -p /tmp/B.x9xnQx/uk.xpi . + STATUS=0 + '[' 0 -ne 0 ']' + unpack -qq /tmp/B.x9xnQx/ur.xpi + typeset 'args=-qq' 'file=/tmp/B.x9xnQx/ur.xpi' + cp -p /tmp/B.x9xnQx/ur.xpi . + STATUS=0 + '[' 0 -ne 0 ']' + unpack -qq /tmp/B.x9xnQx/uz.xpi + typeset 'args=-qq' 'file=/tmp/B.x9xnQx/uz.xpi' + cp -p /tmp/B.x9xnQx/uz.xpi . + STATUS=0 + '[' 0 -ne 0 ']' + unpack -qq /tmp/B.x9xnQx/vi.xpi + typeset 'args=-qq' 'file=/tmp/B.x9xnQx/vi.xpi' + cp -p /tmp/B.x9xnQx/vi.xpi . + STATUS=0 + '[' 0 -ne 0 ']' + unpack -qq /tmp/B.x9xnQx/xh.xpi + typeset 'args=-qq' 'file=/tmp/B.x9xnQx/xh.xpi' + cp -p /tmp/B.x9xnQx/xh.xpi . + STATUS=0 + '[' 0 -ne 0 ']' + unpack -qq /tmp/B.x9xnQx/zh-CN.xpi + typeset 'args=-qq' 'file=/tmp/B.x9xnQx/zh-CN.xpi' + cp -p /tmp/B.x9xnQx/zh-CN.xpi . + STATUS=0 + '[' 0 -ne 0 ']' + unpack -qq /tmp/B.x9xnQx/zh-TW.xpi + typeset 'args=-qq' 'file=/tmp/B.x9xnQx/zh-TW.xpi' + cp -p /tmp/B.x9xnQx/zh-TW.xpi . + STATUS=0 + '[' 0 -ne 0 ']' + /bin/id -u + '[' 1000 '=' 0 ']' + /bin/id -u + '[' 1000 '=' 0 ']' + /bin/chmod -Rf a+rX,u+w,g-w,o-w . + echo 'Patch #4 (firefox-prefs.patch):' Patch #4 (firefox-prefs.patch): + '[' -f /tmp/B.x9xnQx/firefox-prefs.patch ']' + /bin/cat /tmp/B.x9xnQx/firefox-prefs.patch + /usr/bin/patch -s -p1 + echo 'Patch #5 (firefox-pld-bookmarks.patch):' Patch #5 (firefox-pld-bookmarks.patch): + '[' -f /tmp/B.x9xnQx/firefox-pld-bookmarks.patch ']' + /bin/cat /tmp/B.x9xnQx/firefox-pld-bookmarks.patch + /usr/bin/patch -s -p1 + echo 'Patch #6 (firefox-no-subshell.patch):' Patch #6 (firefox-no-subshell.patch): + '[' -f /tmp/B.x9xnQx/firefox-no-subshell.patch ']' + /bin/cat /tmp/B.x9xnQx/firefox-no-subshell.patch + /usr/bin/patch -s -p2 + echo 'Patch #7 (firefox-middle_click_paste.patch):' Patch #7 (firefox-middle_click_paste.patch): + '[' -f /tmp/B.x9xnQx/firefox-middle_click_paste.patch ']' + /bin/cat /tmp/B.x9xnQx/firefox-middle_click_paste.patch + /usr/bin/patch -s -p1 + echo 'Patch #8 (firefox-system-virtualenv.patch):' Patch #8 (firefox-system-virtualenv.patch): + '[' -f /tmp/B.x9xnQx/firefox-system-virtualenv.patch ']' + /bin/cat /tmp/B.x9xnQx/firefox-system-virtualenv.patch + /usr/bin/patch -s -p2 + echo 'Patch #9 (firefox-Disable-Firefox-Health-Report.patch):' Patch #9 (firefox-Disable-Firefox-Health-Report.patch): + '[' -f /tmp/B.x9xnQx/firefox-Disable-Firefox-Health-Report.patch ']' + /bin/cat /tmp/B.x9xnQx/firefox-Disable-Firefox-Health-Report.patch + /usr/bin/patch -s -p1 + exit 0 Executing(%build): /bin/sh -e /tmp/B.x9xnQx/BUILD/tmp/rpm-tmp.74927 TMP=/home/users/builder/tmp HOME=/home/users/builder PATH=/home/users/builder/GNUstep/Tools:/usr/local/bin:/usr/bin:/bin:/home/users/builder/bin TMPDIR=/tmp/B.x9xnQx/BUILD/tmp + umask 022 + cd /tmp/B.x9xnQx/BUILD + cd firefox-67.0 + cp -p /usr/share/automake/config.guess /usr/share/automake/config.sub build/autoconf + <<"EOF" + >.mozconfig + cat + AUTOCONF=/usr/bin/autoconf2_13 ./mach build -v Config object not found by mach. 0:00.78 Clobber not needed. 0:00.78 Adding make options from /tmp/B.x9xnQx/BUILD/firefox-67.0/.mozconfig MOZ_OBJDIR=/tmp/B.x9xnQx/BUILD/firefox-67.0/obj-x86_64 OBJDIR=/tmp/B.x9xnQx/BUILD/firefox-67.0/obj-x86_64 FOUND_MOZCONFIG=/tmp/B.x9xnQx/BUILD/firefox-67.0/.mozconfig export FOUND_MOZCONFIG 0:00.79 /usr/bin/gmake -f client.mk -s configure 0:00.80 cd /tmp/B.x9xnQx/BUILD/firefox-67.0/obj-x86_64 0:00.80 /tmp/B.x9xnQx/BUILD/firefox-67.0/configure 0:00.95 Creating Python environment 0:05.10 New python executable in /tmp/B.x9xnQx/BUILD/firefox-67.0/obj-x86_64/_virtualenvs/init/bin/python2.7 0:05.10 Also creating executable in /tmp/B.x9xnQx/BUILD/firefox-67.0/obj-x86_64/_virtualenvs/init/bin/python 0:05.10 Installing setuptools, pip, wheel...done. 0:16.03 running build_ext 0:16.03 building 'psutil._psutil_linux' extension 0:16.03 x86_64-pld-linux-gcc -pthread -fno-strict-aliasing -O2 -fwrapv -pipe -Wformat -Werror=format-security -gdwarf-4 -fno-debug-types-section -fvar-tracking-assignments -g2 -Wp,-D_FORTIFY_SOURCE=2 -fstack-protector-strong --param=ssp-buffer-size=4 -fPIC -march=x86-64 -gdwarf-4 -fno-debug-types-section -fvar-tracking-assignments -g2 -DNDEBUG -O2 -fwrapv -pipe -Wformat -Werror=format-security -gdwarf-4 -fno-debug-types-section -fvar-tracking-assignments -g2 -Wp,-D_FORTIFY_SOURCE=2 -fstack-protector-strong --param=ssp-buffer-size=4 -fPIC -march=x86-64 -gdwarf-4 -fno-debug-types-section -fvar-tracking-assignments -g2 -fPIC -DPSUTIL_POSIX=1 -DPSUTIL_VERSION=543 -DPSUTIL_LINUX=1 -I/usr/include/python2.7 -c psutil/_psutil_common.c -o build/temp.linux-x86_64-2.7/psutil/_psutil_common.o 0:16.03 x86_64-pld-linux-gcc -pthread -fno-strict-aliasing -O2 -fwrapv -pipe -Wformat -Werror=format-security -gdwarf-4 -fno-debug-types-section -fvar-tracking-assignments -g2 -Wp,-D_FORTIFY_SOURCE=2 -fstack-protector-strong --param=ssp-buffer-size=4 -fPIC -march=x86-64 -gdwarf-4 -fno-debug-types-section -fvar-tracking-assignments -g2 -DNDEBUG -O2 -fwrapv -pipe -Wformat -Werror=format-security -gdwarf-4 -fno-debug-types-section -fvar-tracking-assignments -g2 -Wp,-D_FORTIFY_SOURCE=2 -fstack-protector-strong --param=ssp-buffer-size=4 -fPIC -march=x86-64 -gdwarf-4 -fno-debug-types-section -fvar-tracking-assignments -g2 -fPIC -DPSUTIL_POSIX=1 -DPSUTIL_VERSION=543 -DPSUTIL_LINUX=1 -I/usr/include/python2.7 -c psutil/_psutil_posix.c -o build/temp.linux-x86_64-2.7/psutil/_psutil_posix.o 0:16.03 x86_64-pld-linux-gcc -pthread -fno-strict-aliasing -O2 -fwrapv -pipe -Wformat -Werror=format-security -gdwarf-4 -fno-debug-types-section -fvar-tracking-assignments -g2 -Wp,-D_FORTIFY_SOURCE=2 -fstack-protector-strong --param=ssp-buffer-size=4 -fPIC -march=x86-64 -gdwarf-4 -fno-debug-types-section -fvar-tracking-assignments -g2 -DNDEBUG -O2 -fwrapv -pipe -Wformat -Werror=format-security -gdwarf-4 -fno-debug-types-section -fvar-tracking-assignments -g2 -Wp,-D_FORTIFY_SOURCE=2 -fstack-protector-strong --param=ssp-buffer-size=4 -fPIC -march=x86-64 -gdwarf-4 -fno-debug-types-section -fvar-tracking-assignments -g2 -fPIC -DPSUTIL_POSIX=1 -DPSUTIL_VERSION=543 -DPSUTIL_LINUX=1 -I/usr/include/python2.7 -c psutil/_psutil_linux.c -o build/temp.linux-x86_64-2.7/psutil/_psutil_linux.o 0:16.03 creating build/lib.linux-x86_64-2.7 0:16.03 creating build/lib.linux-x86_64-2.7/psutil 0:16.03 x86_64-pld-linux-gcc -pthread -shared -Wl,--as-needed -Wl,--no-copy-dt-needed-entries -Wl,-z,relro -Wl,-z,combreloc build/temp.linux-x86_64-2.7/psutil/_psutil_common.o build/temp.linux-x86_64-2.7/psutil/_psutil_posix.o build/temp.linux-x86_64-2.7/psutil/_psutil_linux.o -L/usr/lib64 -lpython2.7 -o build/lib.linux-x86_64-2.7/psutil/_psutil_linux.so 0:16.03 building 'psutil._psutil_posix' extension 0:16.03 x86_64-pld-linux-gcc -pthread -fno-strict-aliasing -O2 -fwrapv -pipe -Wformat -Werror=format-security -gdwarf-4 -fno-debug-types-section -fvar-tracking-assignments -g2 -Wp,-D_FORTIFY_SOURCE=2 -fstack-protector-strong --param=ssp-buffer-size=4 -fPIC -march=x86-64 -gdwarf-4 -fno-debug-types-section -fvar-tracking-assignments -g2 -DNDEBUG -O2 -fwrapv -pipe -Wformat -Werror=format-security -gdwarf-4 -fno-debug-types-section -fvar-tracking-assignments -g2 -Wp,-D_FORTIFY_SOURCE=2 -fstack-protector-strong --param=ssp-buffer-size=4 -fPIC -march=x86-64 -gdwarf-4 -fno-debug-types-section -fvar-tracking-assignments -g2 -fPIC -DPSUTIL_POSIX=1 -DPSUTIL_VERSION=543 -DPSUTIL_LINUX=1 -I/usr/include/python2.7 -c psutil/_psutil_common.c -o build/temp.linux-x86_64-2.7/psutil/_psutil_common.o 0:16.03 x86_64-pld-linux-gcc -pthread -fno-strict-aliasing -O2 -fwrapv -pipe -Wformat -Werror=format-security -gdwarf-4 -fno-debug-types-section -fvar-tracking-assignments -g2 -Wp,-D_FORTIFY_SOURCE=2 -fstack-protector-strong --param=ssp-buffer-size=4 -fPIC -march=x86-64 -gdwarf-4 -fno-debug-types-section -fvar-tracking-assignments -g2 -DNDEBUG -O2 -fwrapv -pipe -Wformat -Werror=format-security -gdwarf-4 -fno-debug-types-section -fvar-tracking-assignments -g2 -Wp,-D_FORTIFY_SOURCE=2 -fstack-protector-strong --param=ssp-buffer-size=4 -fPIC -march=x86-64 -gdwarf-4 -fno-debug-types-section -fvar-tracking-assignments -g2 -fPIC -DPSUTIL_POSIX=1 -DPSUTIL_VERSION=543 -DPSUTIL_LINUX=1 -I/usr/include/python2.7 -c psutil/_psutil_posix.c -o build/temp.linux-x86_64-2.7/psutil/_psutil_posix.o 0:16.03 x86_64-pld-linux-gcc -pthread -shared -Wl,--as-needed -Wl,--no-copy-dt-needed-entries -Wl,-z,relro -Wl,-z,combreloc build/temp.linux-x86_64-2.7/psutil/_psutil_common.o build/temp.linux-x86_64-2.7/psutil/_psutil_posix.o -L/usr/lib64 -lpython2.7 -o build/lib.linux-x86_64-2.7/psutil/_psutil_posix.so 0:16.03 copying build/lib.linux-x86_64-2.7/psutil/_psutil_linux.so -> psutil 0:16.03 copying build/lib.linux-x86_64-2.7/psutil/_psutil_posix.so -> psutil 0:16.03 Error processing command. Ignoring because optional. (optional:packages.txt:comm/build/virtualenv_packages.txt) 0:16.03 Reexecuting in the virtualenv 0:16.27 Adding configure options from /tmp/B.x9xnQx/BUILD/firefox-67.0/.mozconfig 0:16.27 --enable-application=browser 0:16.27 --host=x86_64-pld-linux 0:16.27 --prefix=/usr 0:16.27 --disable-debug 0:16.27 --disable-strip 0:16.27 --disable-install-strip 0:16.27 --disable-tests 0:16.27 --disable-crashreporter 0:16.27 --disable-gconf 0:16.27 --disable-necko-wifi 0:16.27 --disable-updater 0:16.27 --enable-alsa 0:16.27 --enable-chrome-format=omni 0:16.27 --enable-default-toolkit=cairo-gtk3 0:16.27 --enable-extensions=default 0:16.27 --enable-geckodriver 0:16.27 --enable-linker=gold 0:16.27 --enable-elf-hack 0:16.27 --enable-readline 0:16.27 --enable-startup-notification 0:16.27 --enable-system-ffi 0:16.27 --enable-system-sqlite 0:16.27 --enable-official-branding 0:16.27 --with-distribution-id=org.pld-linux 0:16.27 --with-system-bz2 0:16.27 --with-system-icu 0:16.28 --with-system-jpeg 0:16.28 --with-system-libevent 0:16.28 --with-system-libvpx 0:16.28 --with-system-nspr 0:16.28 --with-system-nss 0:16.28 --with-system-pixman 0:16.28 --with-system-png 0:16.28 --with-system-zlib 0:16.28 BINDGEN_CFLAGS=-I/usr/include/nspr -I/usr/include/pixman-1 0:16.28 CC=x86_64-pld-linux-gcc 0:16.28 CXXFLAGS=-O2 -fwrapv -pipe -Wformat -gdwarf-4 -fno-debug-types-section -fvar-tracking-assignments -g2 -Wp,-D_FORTIFY_SOURCE=2 -fstack-protector-strong --param=ssp-buffer-size=4 -Werror=trampolines -fPIC -march=x86-64 -gdwarf-4 -fno-debug-types-section -fvar-tracking-assignments -g2 -D_FILE_OFFSET_BITS=64 0:16.28 CFLAGS=-O2 -fwrapv -pipe -Wformat -gdwarf-4 -fno-debug-types-section -fvar-tracking-assignments -g2 -Wp,-D_FORTIFY_SOURCE=2 -fstack-protector-strong --param=ssp-buffer-size=4 -Werror=trampolines -fPIC -march=x86-64 -gdwarf-4 -fno-debug-types-section -fvar-tracking-assignments -g2 -D_FILE_OFFSET_BITS=64 0:16.28 CXX=x86_64-pld-linux-g++ 0:16.28 EPOCHREALTIME=1559083022.622286 0:16.28 RANDOM=18648 0:16.28 checking for vcs source checkout... no 0:16.35 checking for a shell... /bin/sh 0:16.37 checking for host system type... x86_64-pld-linux-gnu 0:16.37 checking for target system type... x86_64-pld-linux-gnu 0:16.89 checking whether cross compiling... no 0:17.07 checking for Python 3... /usr/bin/python3 (3.7.3) 0:17.09 checking for yasm... /usr/bin/yasm 0:17.09 checking yasm version... 1.3.0 0:17.10 checking for the target C compiler... /usr/bin/x86_64-pld-linux-gcc 0:17.14 checking whether the target C compiler can be used... yes 0:17.14 checking the target C compiler version... 8.3.0 0:17.17 checking the target C compiler works... yes 0:17.17 checking for the target C++ compiler... /usr/bin/x86_64-pld-linux-g++ 0:17.19 checking whether the target C++ compiler can be used... yes 0:17.19 checking the target C++ compiler version... 8.3.0 0:17.23 checking the target C++ compiler works... yes 0:17.23 checking for the host C compiler... /usr/bin/x86_64-pld-linux-gcc 0:17.27 checking whether the host C compiler can be used... yes 0:17.27 checking the host C compiler version... 8.3.0 0:17.30 checking the host C compiler works... yes 0:17.30 checking for the host C++ compiler... /usr/bin/x86_64-pld-linux-g++ 0:17.32 checking whether the host C++ compiler can be used... yes 0:17.32 checking the host C++ compiler version... 8.3.0 0:17.35 checking the host C++ compiler works... yes 0:17.38 checking for 64-bit OS... yes 0:17.40 checking for llvm_profdata... /usr/bin/llvm-profdata 0:17.40 checking for nasm... /usr/bin/nasm 0:17.41 checking nasm version... 2.14.02 0:17.42 checking for linker... gold 0:17.42 checking for the assembler... /usr/bin/x86_64-pld-linux-gcc 0:17.44 checking whether the C compiler supports -fsanitize=fuzzer-no-link... no 0:17.45 checking for ar... /usr/bin/ar 0:17.45 checking for pkg_config... /usr/bin/pkg-config 0:17.45 checking for pkg-config version... 0.29.2 0:17.49 checking for stdint.h... yes 0:17.52 checking for inttypes.h... yes 0:17.56 checking for malloc.h... yes 0:17.60 checking for alloca.h... yes 0:17.61 checking for sys/byteorder.h... no 0:17.65 checking for getopt.h... yes 0:17.68 checking for unistd.h... yes 0:17.72 checking for nl_types.h... yes 0:17.75 checking for cpuid.h... yes 0:17.78 checking for sys/statvfs.h... yes 0:17.82 checking for sys/statfs.h... yes 0:17.85 checking for sys/vfs.h... yes 0:17.88 checking for sys/mount.h... yes 0:17.92 checking for sys/quota.h... yes 0:17.96 checking for linux/quota.h... yes 0:18.00 checking for linux/if_addr.h... yes 0:18.04 checking for linux/rtnetlink.h... yes 0:18.08 checking for sys/queue.h... yes 0:18.11 checking for sys/types.h... yes 0:18.16 checking for netinet/in.h... yes 0:18.19 checking for byteswap.h... yes 0:18.23 checking for linux/perf_event.h... yes 0:18.25 checking for perf_event_open system call... yes 0:18.28 checking whether the C compiler supports -Wbitfield-enum-conversion... no 0:18.30 checking whether the C++ compiler supports -Wbitfield-enum-conversion... no 0:18.32 checking whether the C compiler supports -Wshadow-field-in-constructor-modified... no 0:18.33 checking whether the C++ compiler supports -Wshadow-field-in-constructor-modified... no 0:18.35 checking whether the C compiler supports -Wunreachable-code-return... no 0:18.36 checking whether the C++ compiler supports -Wunreachable-code-return... no 0:18.38 checking whether the C compiler supports -Wclass-varargs... no 0:18.39 checking whether the C++ compiler supports -Wclass-varargs... no 0:18.41 checking whether the C compiler supports -Wfloat-overflow-conversion... no 0:18.42 checking whether the C++ compiler supports -Wfloat-overflow-conversion... no 0:18.44 checking whether the C compiler supports -Wfloat-zero-conversion... no 0:18.46 checking whether the C++ compiler supports -Wfloat-zero-conversion... no 0:18.46 checking whether the C compiler supports -Wloop-analysis... no 0:18.48 checking whether the C++ compiler supports -Wloop-analysis... no 0:18.51 checking whether the C++ compiler supports -Wc++1z-compat... yes 0:18.52 checking whether the C++ compiler supports -Wc++2a-compat... no 0:18.54 checking whether the C++ compiler supports -Wcomma... no 0:18.56 checking whether the C compiler supports -Wduplicated-cond... yes 0:18.60 checking whether the C++ compiler supports -Wduplicated-cond... yes 0:18.63 checking whether the C++ compiler supports -Wimplicit-fallthrough... yes 0:18.64 checking whether the C compiler supports -Wstring-conversion... no 0:18.66 checking whether the C++ compiler supports -Wstring-conversion... no 0:18.67 checking whether the C compiler supports -Wtautological-overlap-compare... no 0:18.69 checking whether the C++ compiler supports -Wtautological-overlap-compare... no 0:18.71 checking whether the C compiler supports -Wtautological-unsigned-enum-zero-compare... no 0:18.73 checking whether the C++ compiler supports -Wtautological-unsigned-enum-zero-compare... no 0:18.74 checking whether the C compiler supports -Wtautological-unsigned-zero-compare... no 0:18.76 checking whether the C++ compiler supports -Wtautological-unsigned-zero-compare... no 0:18.77 checking whether the C++ compiler supports -Wno-inline-new-delete... no 0:18.81 checking whether the C compiler supports -Wno-error=maybe-uninitialized... yes 0:18.84 checking whether the C++ compiler supports -Wno-error=maybe-uninitialized... yes 0:18.86 checking whether the C compiler supports -Wno-error=deprecated-declarations... yes 0:18.90 checking whether the C++ compiler supports -Wno-error=deprecated-declarations... yes 0:18.93 checking whether the C compiler supports -Wno-error=array-bounds... yes 0:18.96 checking whether the C++ compiler supports -Wno-error=array-bounds... yes 0:18.99 checking whether the C compiler supports -Wno-error=free-nonheap-object... yes 0:19.03 checking whether the C++ compiler supports -Wno-error=free-nonheap-object... yes 0:19.05 checking whether the C compiler supports -Wno-error=multistatement-macros... yes 0:19.09 checking whether the C++ compiler supports -Wno-error=multistatement-macros... yes 0:19.11 checking whether the C compiler supports -Wno-error=return-std-move... no 0:19.11 checking whether the C++ compiler supports -Wno-error=return-std-move... no 0:19.15 checking whether the C compiler supports -Wno-error=class-memaccess... yes 0:19.18 checking whether the C++ compiler supports -Wno-error=class-memaccess... yes 0:19.19 checking whether the C compiler supports -Wno-error=atomic-alignment... no 0:19.21 checking whether the C++ compiler supports -Wno-error=atomic-alignment... no 0:19.22 checking whether the C compiler supports -Wno-error=deprecated-copy... no 0:19.23 checking whether the C++ compiler supports -Wno-error=deprecated-copy... no 0:19.27 checking whether the C compiler supports -Wformat... yes 0:19.29 checking whether the C++ compiler supports -Wformat... yes 0:19.32 checking whether the C compiler supports -Wformat-security... no 0:19.34 checking whether the C++ compiler supports -Wformat-security... no 0:19.38 checking whether the C compiler supports -Wformat-overflow=2... yes 0:19.41 checking whether the C++ compiler supports -Wformat-overflow=2... yes 0:19.43 checking whether the C compiler supports -Wno-gnu-zero-variadic-macro-arguments... no 0:19.45 checking whether the C++ compiler supports -Wno-gnu-zero-variadic-macro-arguments... no 0:19.49 checking whether the C++ compiler supports -fno-sized-deallocation... yes 0:19.50 checking for alsa... yes 0:19.51 checking MOZ_ALSA_CFLAGS... 0:19.52 checking MOZ_ALSA_LIBS... -lasound 0:19.52 checking for libpulse... yes 0:19.53 checking MOZ_PULSEAUDIO_CFLAGS... -D_REENTRANT 0:19.54 checking MOZ_PULSEAUDIO_LIBS... -lpulse 0:19.54 checking for rustc... /usr/bin/rustc 0:19.54 checking for cargo... /usr/bin/cargo 0:19.60 checking rustc version... 1.34.0 0:19.62 checking cargo version... 1.34.0 0:19.93 checking for rustdoc... /usr/bin/rustdoc 0:19.93 checking for cbindgen... /usr/bin/cbindgen 0:19.93 checking cbindgen version... 0.8.7 0:19.94 checking for rustfmt... /usr/bin/rustfmt 0:19.94 checking for llvm-config... /usr/bin/llvm-config 0:20.19 checking bindgen cflags... -x c++ -fno-sized-deallocation -DTRACING=1 -DIMPL_LIBXUL -DMOZILLA_INTERNAL_API -DRUST_BINDGEN -DOS_POSIX=1 -DOS_LINUX=1 -I/usr/include/nspr -I/usr/include/pixman-1 0:20.20 checking for libffi > 3.0.9... yes 0:20.21 checking MOZ_FFI_CFLAGS... 0:20.23 checking MOZ_FFI_LIBS... -lffi 0:20.24 checking for nodejs... /usr/bin/nodejs (8.16.0) 0:20.25 checking for gtk+-wayland-3.0 >= 3.10 xkbcommon >= 0.4.1... yes 0:20.27 checking MOZ_WAYLAND_CFLAGS... -pthread -I/usr/include/gtk-3.0 -I/usr/include/at-spi2-atk/2.0 -I/usr/include/at-spi-2.0 -I/usr/include/dbus-1.0 -I/usr/lib64/dbus-1.0/include -I/usr/include/gtk-3.0 -I/usr/include/gio-unix-2.0 -I/usr/include/cairo -I/usr/include/libdrm -I/usr/include/pango-1.0 -I/usr/include/fribidi -I/usr/include/atk-1.0 -I/usr/include/cairo -I/usr/include/pixman-1 -I/usr/include/freetype2 -I/usr/include/harfbuzz -I/usr/include/libpng16 -I/usr/include/gdk-pixbuf-2.0 -I/usr/include/libmount -I/usr/include/blkid -I/usr/include/uuid -I/usr/include/glib-2.0 -I/usr/lib64/glib-2.0/include 0:20.27 checking MOZ_WAYLAND_LIBS... -lgtk-3 -lgdk-3 -lpangocairo-1.0 -lpango-1.0 -latk-1.0 -lcairo-gobject -lcairo -lgdk_pixbuf-2.0 -lgio-2.0 -lgobject-2.0 -lglib-2.0 -lxkbcommon 0:20.28 checking for pango >= 1.22.0 pangoft2 >= 1.22.0 pangocairo >= 1.22.0... yes 0:20.29 checking MOZ_PANGO_CFLAGS... -I/usr/include/pango-1.0 -I/usr/include/fribidi -I/usr/include/cairo -I/usr/include/pixman-1 -I/usr/include/uuid -I/usr/include/freetype2 -I/usr/include/harfbuzz -I/usr/include/glib-2.0 -I/usr/lib64/glib-2.0/include -I/usr/include/libpng16 0:20.29 checking MOZ_PANGO_LIBS... -lpangoft2-1.0 -lfontconfig -lfreetype -lpangocairo-1.0 -lpango-1.0 -lgobject-2.0 -lglib-2.0 -lcairo 0:20.30 checking for fontconfig >= 2.7.0... yes 0:20.32 checking _FONTCONFIG_CFLAGS... -I/usr/include/uuid -I/usr/include/freetype2 -I/usr/include/libpng16 -I/usr/include/harfbuzz -I/usr/include/glib-2.0 -I/usr/lib64/glib-2.0/include 0:20.32 checking _FONTCONFIG_LIBS... -lfontconfig -lfreetype 0:20.33 checking for freetype2 >= 6.1.0... yes 0:20.33 checking _FT2_CFLAGS... -I/usr/include/freetype2 -I/usr/include/libpng16 -I/usr/include/harfbuzz -I/usr/include/glib-2.0 -I/usr/lib64/glib-2.0/include 0:20.34 checking _FT2_LIBS... -lfreetype 0:20.34 checking for tar... /usr/bin/gtar 0:20.34 checking for unzip... /usr/bin/unzip 0:20.34 checking for zip... /usr/bin/zip 0:20.35 checking for gn... not found 0:20.35 checking for the Mozilla API key... no 0:20.35 checking for the Google Location Service API key... no 0:20.35 checking for the Google Safebrowsing API key... no 0:20.35 checking for the Bing API key... no 0:20.35 checking for the Adjust SDK key... no 0:20.35 checking for the Leanplum SDK key... no 0:20.35 checking for the Pocket API key... no 0:20.36 checking for vpx >= 1.7.0... yes 0:20.37 checking MOZ_LIBVPX_CFLAGS... 0:20.38 checking MOZ_LIBVPX_LIBS... -lvpx -lm 0:20.41 checking for vpx/vpx_decoder.h... yes 0:20.47 checking for vpx_codec_dec_init_ver... yes 0:20.53 checking for jpeg_destroy_compress... yes 0:20.56 checking for sufficient jpeg library version... yes 0:20.60 checking for sufficient libjpeg-turbo JCS_EXTENSIONS... yes 0:20.61 checking for awk... /usr/bin/gawk 0:20.61 checking for perl... /usr/bin/perl 0:20.62 checking for minimum required perl version >= 5.006... 5.028002 0:20.64 checking for full perl installation... yes 0:20.64 checking for gmake... /usr/bin/gmake 0:20.64 checking for watchman... not found 0:20.64 checking for xargs... /bin/xargs 0:20.64 checking for rpmbuild... /usr/bin/rpmbuild 0:20.67 checking for llvm-objdump... /usr/bin/llvm-objdump 0:20.67 checking for autoconf... /usr/bin/autoconf2_13 0:21.13 creating cache ./config.cache 0:21.15 checking host system type... x86_64-pld-linux-gnu 0:21.17 checking target system type... x86_64-pld-linux-gnu 0:21.18 checking build system type... x86_64-pld-linux-gnu 0:21.18 checking for objcopy... /usr/bin/objcopy 0:21.19 checking for gcc... (cached) /usr/bin/x86_64-pld-linux-gcc -std=gnu99 0:21.19 checking whether the C compiler (/usr/bin/x86_64-pld-linux-gcc -std=gnu99 -O2 -fwrapv -pipe -Wformat -gdwarf-4 -fno-debug-types-section -fvar-tracking-assignments -g2 -Wp,-D_FORTIFY_SOURCE=2 -fstack-protector-strong --param=ssp-buffer-size=4 -Werror=trampolines -fPIC -march=x86-64 -gdwarf-4 -fno-debug-types-section -fvar-tracking-assignments -g2 -D_FILE_OFFSET_BITS=64 -fuse-ld=gold) works... (cached) yes 0:21.19 checking whether the C compiler (/usr/bin/x86_64-pld-linux-gcc -std=gnu99 -O2 -fwrapv -pipe -Wformat -gdwarf-4 -fno-debug-types-section -fvar-tracking-assignments -g2 -Wp,-D_FORTIFY_SOURCE=2 -fstack-protector-strong --param=ssp-buffer-size=4 -Werror=trampolines -fPIC -march=x86-64 -gdwarf-4 -fno-debug-types-section -fvar-tracking-assignments -g2 -D_FILE_OFFSET_BITS=64 -fuse-ld=gold) is a cross-compiler... no 0:21.19 checking whether we are using GNU C... (cached) yes 0:21.19 checking whether /usr/bin/x86_64-pld-linux-gcc -std=gnu99 accepts -g... (cached) yes 0:21.19 checking for c++... (cached) /usr/bin/x86_64-pld-linux-g++ 0:21.19 checking whether the C++ compiler (/usr/bin/x86_64-pld-linux-g++ -O2 -fwrapv -pipe -Wformat -gdwarf-4 -fno-debug-types-section -fvar-tracking-assignments -g2 -Wp,-D_FORTIFY_SOURCE=2 -fstack-protector-strong --param=ssp-buffer-size=4 -Werror=trampolines -fPIC -march=x86-64 -gdwarf-4 -fno-debug-types-section -fvar-tracking-assignments -g2 -D_FILE_OFFSET_BITS=64 -fuse-ld=gold) works... (cached) yes 0:21.19 checking whether the C++ compiler (/usr/bin/x86_64-pld-linux-g++ -O2 -fwrapv -pipe -Wformat -gdwarf-4 -fno-debug-types-section -fvar-tracking-assignments -g2 -Wp,-D_FORTIFY_SOURCE=2 -fstack-protector-strong --param=ssp-buffer-size=4 -Werror=trampolines -fPIC -march=x86-64 -gdwarf-4 -fno-debug-types-section -fvar-tracking-assignments -g2 -D_FILE_OFFSET_BITS=64 -fuse-ld=gold) is a cross-compiler... no 0:21.19 checking whether we are using GNU C++... (cached) yes 0:21.19 checking whether /usr/bin/x86_64-pld-linux-g++ accepts -g... (cached) yes 0:21.19 checking for ranlib... ranlib 0:21.19 checking for /usr/bin/x86_64-pld-linux-gcc... /usr/bin/x86_64-pld-linux-gcc -std=gnu99 0:21.19 checking for strip... strip 0:21.19 checking for otool... no 0:21.57 checking for X... libraries /usr/lib64, headers 0:21.63 checking for dnet_ntoa in -ldnet... no 0:21.68 checking for dnet_ntoa in -ldnet_stub... no 0:21.73 checking for gethostbyname... yes 0:21.78 checking for connect... yes 0:21.83 checking for remove... yes 0:21.88 checking for shmat... yes 0:21.94 checking for IceConnectionNumber in -lICE... yes 0:22.03 checking for --noexecstack option to as... yes 0:22.08 checking for -z noexecstack option to ld... yes 0:22.12 checking for -z text option to ld... yes 0:22.17 checking for -z relro option to ld... yes 0:22.22 checking for -z nocopyreloc option to ld... yes 0:22.27 checking for -Bsymbolic-functions option to ld... yes 0:22.33 checking for --build-id=sha1 option to ld... yes 0:22.37 checking for --ignore-unresolved-symbol option to ld... no 0:22.40 checking if toolchain supports -mssse3 option... yes 0:22.43 checking if toolchain supports -msse4.1 option... yes 0:22.45 checking for x86 AVX2 asm support in compiler... yes 0:22.98 checking whether the linker supports Identical Code Folding... yes 0:23.36 checking whether removing dead symbols breaks debugging... no 0:23.38 checking for working const... yes 0:23.40 checking for mode_t... yes 0:23.41 checking for off_t... yes 0:23.42 checking for pid_t... yes 0:23.44 checking for size_t... yes 0:23.62 checking whether 64-bits std::atomic requires -latomic... no 0:23.65 checking for dirent.h that defines DIR... yes 0:23.74 checking for opendir in -ldir... no 0:23.81 checking for sockaddr_in.sin_len... false 0:23.86 checking for sockaddr_in6.sin6_len... false 0:23.93 checking for sockaddr.sa_len... false 0:24.05 checking for gethostbyname_r in -lc_r... no 0:24.28 checking for library containing dlopen... -ldl 0:24.36 checking for dlfcn.h... yes 0:24.46 checking for dladdr... yes 0:24.56 checking for memmem... yes 0:24.67 checking for socket in -lsocket... no 0:24.76 checking for XDrawLines in -lX11... yes 0:24.85 checking for XextAddDisplay in -lXext... yes 0:24.94 checking for XtFree in -lXt... yes 0:25.03 checking for xcb_connect in -lxcb... yes 0:25.08 checking for xcb_shm_query_version in -lxcb-shm... yes 0:25.14 checking for XGetXCBConnection in -lX11-xcb... yes 0:25.54 checking for pthread_create in -lpthreads... no 0:25.86 checking for pthread_create in -lpthread... yes 0:26.20 checking whether /usr/bin/x86_64-pld-linux-gcc -std=gnu99 accepts -pthread... yes 0:26.24 checking for pthread.h... yes 0:26.29 checking for stat64... yes 0:26.35 checking for lstat64... yes 0:26.41 checking for truncate64... yes 0:26.49 checking for statvfs64... yes 0:26.72 checking for statvfs... yes 0:26.95 checking for statfs64... yes 0:27.07 checking for statfs... yes 0:27.23 checking for getpagesize... yes 0:27.39 checking for gmtime_r... yes 0:27.60 checking for localtime_r... yes 0:27.79 checking for arc4random... no 0:27.99 checking for arc4random_buf... no 0:28.12 checking for mallinfo... yes 0:28.17 checking for gettid... no 0:28.23 checking for lchown... yes 0:28.28 checking for setpriority... yes 0:28.33 checking for strerror... yes 0:28.39 checking for syscall... yes 0:28.44 checking for clock_gettime(CLOCK_MONOTONIC)... 0:28.48 checking for pthread_cond_timedwait_monotonic_np... 0:28.55 checking for res_ninit()... yes 0:28.59 checking for an implementation of va_copy()... yes 0:28.62 checking whether va_list can be copied by value... no 0:28.68 checking for __thread keyword for TLS variables... yes 0:28.73 checking for localeconv... yes 0:28.77 checking for malloc.h... yes 0:28.83 checking for strndup... yes 0:28.89 checking for posix_memalign... yes 0:28.93 checking for memalign... yes 0:28.99 checking for malloc_usable_size... yes 0:29.01 checking whether malloc_usable_size definition can use const argument... no 0:29.03 checking for valloc in malloc.h... yes 0:29.04 checking for valloc in unistd.h... no 0:29.06 checking for _aligned_malloc in malloc.h... no 0:29.06 checking NSPR selection... system 0:29.06 checking for nspr-config... /usr/bin/nspr-config 0:29.09 checking for NSPR - version >= 4.21... yes 0:29.18 checking for libevent... yes 0:29.18 checking MOZ_LIBEVENT_CFLAGS... 0:29.19 checking MOZ_LIBEVENT_LIBS... -levent 0:29.19 checking for nss-config... /usr/bin/nss-config 0:29.21 checking for NSS - version >= 3.42... yes 0:29.26 checking for gzread in -lz... yes 0:29.37 checking for png_get_valid in -lpng... yes 0:29.42 checking for png_get_acTL in -lpng... yes 0:29.47 checking if app-specific confvars.sh exists... /tmp/B.x9xnQx/BUILD/firefox-67.0/browser/confvars.sh 0:29.48 checking for gtk+-3.0 >= 3.4.0 gtk+-unix-print-3.0 glib-2.0 gobject-2.0 gio-unix-2.0 ... yes 0:29.48 checking MOZ_GTK3_CFLAGS... -pthread -I/usr/include/gtk-3.0/unix-print -I/usr/include/gtk-3.0 -I/usr/include/at-spi2-atk/2.0 -I/usr/include/at-spi-2.0 -I/usr/include/dbus-1.0 -I/usr/lib64/dbus-1.0/include -I/usr/include/gtk-3.0 -I/usr/include/cairo -I/usr/include/libdrm -I/usr/include/pango-1.0 -I/usr/include/fribidi -I/usr/include/atk-1.0 -I/usr/include/cairo -I/usr/include/pixman-1 -I/usr/include/freetype2 -I/usr/include/harfbuzz -I/usr/include/libpng16 -I/usr/include/gdk-pixbuf-2.0 -I/usr/include/gio-unix-2.0 -I/usr/include/libmount -I/usr/include/blkid -I/usr/include/uuid -I/usr/include/glib-2.0 -I/usr/lib64/glib-2.0/include 0:29.48 checking MOZ_GTK3_LIBS... -lgtk-3 -lgdk-3 -lpangocairo-1.0 -lpango-1.0 -latk-1.0 -lcairo-gobject -lcairo -lgdk_pixbuf-2.0 -lgio-2.0 -lgobject-2.0 -lglib-2.0 0:29.49 checking for gtk+-2.0 >= 2.18.0 gtk+-unix-print-2.0 glib-2.0 >= 2.22 gobject-2.0 gio-unix-2.0 gdk-x11-2.0... yes 0:29.50 checking MOZ_GTK2_CFLAGS... -pthread -I/usr/include/gtk-2.0 -I/usr/include/gtk-unix-print-2.0 -I/usr/include/gtk-2.0 -I/usr/include/atk-1.0 -I/usr/include/gtk-2.0 -I/usr/lib64/gtk-2.0/include -I/usr/include/pango-1.0 -I/usr/include/fribidi -I/usr/include/gio-unix-2.0 -I/usr/include/gdk-pixbuf-2.0 -I/usr/include/libmount -I/usr/include/blkid -I/usr/include/cairo -I/usr/include/pixman-1 -I/usr/include/uuid -I/usr/include/freetype2 -I/usr/include/harfbuzz -I/usr/include/glib-2.0 -I/usr/lib64/glib-2.0/include -I/usr/include/libpng16 0:29.50 checking MOZ_GTK2_LIBS... -lgtk-x11-2.0 -latk-1.0 -lpangoft2-1.0 -lgdk-x11-2.0 -lpangocairo-1.0 -lpango-1.0 -lgio-2.0 -lfontconfig -lfreetype -lXrender -lXinerama -lXi -lXrandr -lXcursor -lXcomposite -lXdamage -lXfixes -lgdk_pixbuf-2.0 -lgobject-2.0 -lglib-2.0 -lcairo -lX11 -lXext 0:29.51 checking for libstartup-notification-1.0 >= 0.8... yes 0:29.51 checking MOZ_STARTUP_NOTIFICATION_CFLAGS... -I/usr/include/startup-notification-1.0 0:29.51 checking MOZ_STARTUP_NOTIFICATION_LIBS... -lstartup-notification-1 0:29.52 checking for dbus-1 >= 0.60... yes 0:29.52 checking MOZ_DBUS_CFLAGS... -I/usr/include/dbus-1.0 -I/usr/lib64/dbus-1.0/include 0:29.52 checking MOZ_DBUS_LIBS... -ldbus-1 0:29.52 checking for dbus-glib-1 >= 0.60... yes 0:29.53 checking MOZ_DBUS_GLIB_CFLAGS... -I/usr/include/dbus-1.0 -I/usr/lib64/dbus-1.0/include -I/usr/include/glib-2.0 -I/usr/lib64/glib-2.0/include 0:29.53 checking MOZ_DBUS_GLIB_LIBS... -ldbus-glib-1 -ldbus-1 -lgobject-2.0 -lglib-2.0 0:29.60 checking for linux/joystick.h... yes 0:29.60 checking for wget... wget 0:29.61 checking for sqlite3 >= 3.27.2... yes 0:29.61 checking SQLITE_CFLAGS... 0:29.61 checking SQLITE_LIBS... -lsqlite3 0:29.65 checking for valid C compiler optimization flags... yes 0:29.71 checking for __cxa_demangle... yes 0:29.75 checking for unwind.h... yes 0:29.81 checking for _Unwind_Backtrace... yes 0:29.81 checking for -pipe support... yes 0:31.22 checking what kind of list files are supported by the linker... linkerscript 0:31.23 checking for glib-2.0 >= 1.3.7 gobject-2.0... yes 0:31.23 checking GLIB_CFLAGS... -I/usr/include/glib-2.0 -I/usr/lib64/glib-2.0/include 0:31.23 checking GLIB_LIBS... -lgobject-2.0 -lglib-2.0 0:31.29 checking for FT_Bitmap_Size.y_ppem... yes 0:31.34 checking for FT_GlyphSlot_Embolden... yes 0:32.46 checking for FT_Load_Sfnt_Table... yes 0:32.52 checking for fontconfig/fcfreetype.h... yes 0:32.53 checking for pixman-1 >= 0.19.2... yes 0:32.53 checking MOZ_PIXMAN_CFLAGS... -I/usr/include/pixman-1 0:32.53 checking MOZ_PIXMAN_LIBS... -lpixman-1 0:32.55 checking for icu-i18n >= 63.1... yes 0:32.55 checking MOZ_ICU_CFLAGS... 0:32.55 checking MOZ_ICU_LIBS... -licui18n -licuuc -licudata 0:32.62 checking for posix_fadvise... yes 0:32.67 checking for posix_fallocate... yes 0:32.76 updating cache ./config.cache 0:32.76 creating ./config.data 0:32.78 js/src> configuring 0:32.78 js/src> running /tmp/B.x9xnQx/BUILD/firefox-67.0/configure.py --enable-project=js --disable-crashreporter --enable-extensions=default --disable-gconf --disable-install-strip --disable-necko-wifi --enable-official-branding --enable-readline --enable-startup-notification --disable-strip --enable-system-pixman --enable-system-sqlite --disable-updater --prefix=/usr --with-distribution-id=org.pld-linux --with-system-bz2 --with-system-icu --with-system-libevent --with-system-nss --with-system-png --with-system-zlib --host=x86_64-pld-linux-gnu --target=x86_64-pld-linux-gnu --disable-tests --disable-debug --disable-rust-debug --enable-release --enable-optimize --enable-xcode-checks --without-ccache --without-toolchain-prefix --enable-debug-symbols --disable-profile-generate --disable-profile-use --without-pgo-profile-path --disable-lto --disable-address-sanitizer --disable-undefined-sanitizer --disable-coverage --enable-linker=gold --disable-clang-plugin --disable-mozsearch-plugin --disable-stdcxx-compat --enable-jemalloc --disable-replace-malloc --without-linux-headers --disable-warnings-as-errors --disable-valgrind --without-libclang-path --without-clang-path --disable-js-shell --disable-shared-js --disable-export-js --enable-ion --disable-simulator --disable-instruments --disable-callgrind --disable-profiling --disable-vtune --disable-gc-trace --disable-gczeal --disable-small-chunk-size --disable-trace-logging --disable-oom-breakpoint --disable-perf --disable-jitspew --disable-masm-verbose --disable-more-deterministic --enable-ctypes --with-system-ffi --disable-fuzzing --disable-pipeline-operator --disable-binast --disable-cranelift --disable-wasm-codegen-debug --disable-typed-objects --disable-wasm-bulk-memory --disable-wasm-reftypes --disable-wasm-gc --disable-wasm-private-reftypes --with-nspr-cflags=-I/usr/include/nspr --with-nspr-libs=-L/usr/lib64 -lplds4 -lplc4 -lnspr4 -lpthread -ldl --prefix=/tmp/B.x9xnQx/BUILD/firefox-67.0/obj-x86_64/dist JS_STANDALONE= 0:32.81 js/src> checking for vcs source checkout... no 0:32.86 js/src> checking for a shell... /bin/sh 0:32.88 js/src> checking for host system type... x86_64-pld-linux-gnu 0:32.89 js/src> checking for target system type... x86_64-pld-linux-gnu 0:33.38 js/src> checking for Python 3... /usr/bin/python3 (3.7.3) 0:33.38 js/src> checking whether cross compiling... no 0:33.39 js/src> checking for yasm... /usr/bin/yasm 0:33.40 js/src> checking yasm version... 1.3.0 0:33.41 js/src> checking for the target C compiler... /usr/bin/x86_64-pld-linux-gcc 0:33.43 js/src> checking whether the target C compiler can be used... yes 0:33.43 js/src> checking the target C compiler version... 8.3.0 0:33.46 js/src> checking the target C compiler works... yes 0:33.47 js/src> checking for the target C++ compiler... /usr/bin/x86_64-pld-linux-g++ 0:33.49 js/src> checking whether the target C++ compiler can be used... yes 0:33.49 js/src> checking the target C++ compiler version... 8.3.0 0:33.53 js/src> checking the target C++ compiler works... yes 0:33.53 js/src> checking for the host C compiler... /usr/bin/x86_64-pld-linux-gcc 0:33.55 js/src> checking whether the host C compiler can be used... yes 0:33.55 js/src> checking the host C compiler version... 8.3.0 0:33.58 js/src> checking the host C compiler works... yes 0:33.58 js/src> checking for the host C++ compiler... /usr/bin/x86_64-pld-linux-g++ 0:33.60 js/src> checking whether the host C++ compiler can be used... yes 0:33.61 js/src> checking the host C++ compiler version... 8.3.0 0:33.64 js/src> checking the host C++ compiler works... yes 0:33.68 js/src> checking for 64-bit OS... yes 0:33.68 js/src> checking for llvm_profdata... /usr/bin/llvm-profdata 0:33.68 js/src> checking for nasm... /usr/bin/nasm 0:33.70 js/src> checking nasm version... 2.14.02 0:33.71 js/src> checking for linker... gold 0:33.71 js/src> checking for the assembler... /usr/bin/x86_64-pld-linux-gcc 0:33.74 js/src> checking whether the C compiler supports -fsanitize=fuzzer-no-link... no 0:33.74 js/src> checking for ar... /usr/bin/ar 0:33.74 js/src> checking for pkg_config... /usr/bin/pkg-config 0:33.76 js/src> checking for pkg-config version... 0.29.2 0:33.79 js/src> checking for stdint.h... yes 0:33.83 js/src> checking for inttypes.h... yes 0:33.87 js/src> checking for malloc.h... yes 0:33.90 js/src> checking for alloca.h... yes 0:33.92 js/src> checking for sys/byteorder.h... no 0:33.96 js/src> checking for getopt.h... yes 0:33.99 js/src> checking for unistd.h... yes 0:34.03 js/src> checking for nl_types.h... yes 0:34.06 js/src> checking for cpuid.h... yes 0:34.10 js/src> checking for sys/statvfs.h... yes 0:34.14 js/src> checking for sys/statfs.h... yes 0:34.17 js/src> checking for sys/vfs.h... yes 0:34.21 js/src> checking for sys/mount.h... yes 0:34.25 js/src> checking for sys/quota.h... yes 0:34.29 js/src> checking for linux/quota.h... yes 0:34.33 js/src> checking for linux/if_addr.h... yes 0:34.38 js/src> checking for linux/rtnetlink.h... yes 0:34.41 js/src> checking for sys/queue.h... yes 0:34.45 js/src> checking for sys/types.h... yes 0:34.49 js/src> checking for netinet/in.h... yes 0:34.53 js/src> checking for byteswap.h... yes 0:34.57 js/src> checking for linux/perf_event.h... yes 0:34.61 js/src> checking for perf_event_open system call... yes 0:34.63 js/src> checking whether the C compiler supports -Wbitfield-enum-conversion... no 0:34.64 js/src> checking whether the C++ compiler supports -Wbitfield-enum-conversion... no 0:34.66 js/src> checking whether the C compiler supports -Wshadow-field-in-constructor-modified... no 0:34.68 js/src> checking whether the C++ compiler supports -Wshadow-field-in-constructor-modified... no 0:34.70 js/src> checking whether the C compiler supports -Wunreachable-code-return... no 0:34.72 js/src> checking whether the C++ compiler supports -Wunreachable-code-return... no 0:34.74 js/src> checking whether the C compiler supports -Wclass-varargs... no 0:34.75 js/src> checking whether the C++ compiler supports -Wclass-varargs... no 0:34.77 js/src> checking whether the C compiler supports -Wfloat-overflow-conversion... no 0:34.79 js/src> checking whether the C++ compiler supports -Wfloat-overflow-conversion... no 0:34.81 js/src> checking whether the C compiler supports -Wfloat-zero-conversion... no 0:34.82 js/src> checking whether the C++ compiler supports -Wfloat-zero-conversion... no 0:34.84 js/src> checking whether the C compiler supports -Wloop-analysis... no 0:34.85 js/src> checking whether the C++ compiler supports -Wloop-analysis... no 0:34.89 js/src> checking whether the C++ compiler supports -Wc++1z-compat... yes 0:34.91 js/src> checking whether the C++ compiler supports -Wc++2a-compat... no 0:34.91 js/src> checking whether the C++ compiler supports -Wcomma... no 0:34.95 js/src> checking whether the C compiler supports -Wduplicated-cond... yes 0:34.98 js/src> checking whether the C++ compiler supports -Wduplicated-cond... yes 0:35.01 js/src> checking whether the C++ compiler supports -Wimplicit-fallthrough... yes 0:35.03 js/src> checking whether the C compiler supports -Wstring-conversion... no 0:35.04 js/src> checking whether the C++ compiler supports -Wstring-conversion... no 0:35.06 js/src> checking whether the C compiler supports -Wtautological-overlap-compare... no 0:35.08 js/src> checking whether the C++ compiler supports -Wtautological-overlap-compare... no 0:35.10 js/src> checking whether the C compiler supports -Wtautological-unsigned-enum-zero-compare... no 0:35.12 js/src> checking whether the C++ compiler supports -Wtautological-unsigned-enum-zero-compare... no 0:35.14 js/src> checking whether the C compiler supports -Wtautological-unsigned-zero-compare... no 0:35.15 js/src> checking whether the C++ compiler supports -Wtautological-unsigned-zero-compare... no 0:35.17 js/src> checking whether the C++ compiler supports -Wno-inline-new-delete... no 0:35.21 js/src> checking whether the C compiler supports -Wno-error=maybe-uninitialized... yes 0:35.23 js/src> checking whether the C++ compiler supports -Wno-error=maybe-uninitialized... yes 0:35.27 js/src> checking whether the C compiler supports -Wno-error=deprecated-declarations... yes 0:35.31 js/src> checking whether the C++ compiler supports -Wno-error=deprecated-declarations... yes 0:35.33 js/src> checking whether the C compiler supports -Wno-error=array-bounds... yes 0:35.37 js/src> checking whether the C++ compiler supports -Wno-error=array-bounds... yes 0:35.41 js/src> checking whether the C compiler supports -Wno-error=free-nonheap-object... yes 0:35.44 js/src> checking whether the C++ compiler supports -Wno-error=free-nonheap-object... yes 0:35.47 js/src> checking whether the C compiler supports -Wno-error=multistatement-macros... yes 0:35.51 js/src> checking whether the C++ compiler supports -Wno-error=multistatement-macros... yes 0:35.52 js/src> checking whether the C compiler supports -Wno-error=return-std-move... no 0:35.54 js/src> checking whether the C++ compiler supports -Wno-error=return-std-move... no 0:35.57 js/src> checking whether the C compiler supports -Wno-error=class-memaccess... yes 0:35.61 js/src> checking whether the C++ compiler supports -Wno-error=class-memaccess... yes 0:35.62 js/src> checking whether the C compiler supports -Wno-error=atomic-alignment... no 0:35.64 js/src> checking whether the C++ compiler supports -Wno-error=atomic-alignment... no 0:35.65 js/src> checking whether the C compiler supports -Wno-error=deprecated-copy... no 0:35.67 js/src> checking whether the C++ compiler supports -Wno-error=deprecated-copy... no 0:35.70 js/src> checking whether the C compiler supports -Wformat... yes 0:35.73 js/src> checking whether the C++ compiler supports -Wformat... yes 0:35.76 js/src> checking whether the C compiler supports -Wformat-security... no 0:35.79 js/src> checking whether the C++ compiler supports -Wformat-security... no 0:35.83 js/src> checking whether the C compiler supports -Wformat-overflow=2... yes 0:35.86 js/src> checking whether the C++ compiler supports -Wformat-overflow=2... yes 0:35.88 js/src> checking whether the C compiler supports -Wno-gnu-zero-variadic-macro-arguments... no 0:35.90 js/src> checking whether the C++ compiler supports -Wno-gnu-zero-variadic-macro-arguments... no 0:35.94 js/src> checking whether the C++ compiler supports -Wno-noexcept-type... yes 0:35.98 js/src> checking whether the C++ compiler supports -fno-sized-deallocation... yes 0:35.98 js/src> checking for rustc... /usr/bin/rustc 0:35.98 js/src> checking for cargo... /usr/bin/cargo 0:36.03 js/src> checking rustc version... 1.34.0 0:36.06 js/src> checking cargo version... 1.34.0 0:36.45 js/src> checking for rustdoc... /usr/bin/rustdoc 0:36.45 js/src> checking for rustfmt... /usr/bin/rustfmt 0:36.46 js/src> checking for llvm-config... /usr/bin/llvm-config 0:36.60 js/src> checking bindgen cflags... -x c++ -fno-sized-deallocation -DTRACING=1 -DIMPL_LIBXUL -DMOZILLA_INTERNAL_API -DRUST_BINDGEN -DOS_POSIX=1 -DOS_LINUX=1 -I/usr/include/nspr -I/usr/include/pixman-1 0:36.61 js/src> checking for libffi > 3.0.9... yes 0:36.62 js/src> checking MOZ_FFI_CFLAGS... 0:36.64 js/src> checking MOZ_FFI_LIBS... -lffi 0:36.64 js/src> checking for awk... /usr/bin/gawk 0:36.64 js/src> checking for perl... /usr/bin/perl 0:36.65 js/src> checking for minimum required perl version >= 5.006... 5.028002 0:36.67 js/src> checking for full perl installation... yes 0:36.67 js/src> checking for gmake... /usr/bin/gmake 0:36.67 js/src> checking for watchman... not found 0:36.67 js/src> checking for xargs... /bin/xargs 0:36.67 js/src> checking for rpmbuild... /usr/bin/rpmbuild 0:36.70 js/src> checking for llvm-objdump... /usr/bin/llvm-objdump 0:36.70 js/src> checking for autoconf... /usr/bin/autoconf2_13 0:36.70 js/src> Refreshing /tmp/B.x9xnQx/BUILD/firefox-67.0/js/src/old-configure with /usr/bin/autoconf2_13 0:36.91 js/src> loading cache /tmp/B.x9xnQx/BUILD/firefox-67.0/obj-x86_64/./config.cache 0:36.94 js/src> checking host system type... x86_64-pld-linux-gnu 0:36.95 js/src> checking target system type... x86_64-pld-linux-gnu 0:36.97 js/src> checking build system type... x86_64-pld-linux-gnu 0:36.97 js/src> checking for gcc... (cached) /usr/bin/x86_64-pld-linux-gcc -std=gnu99 0:36.97 js/src> checking whether the C compiler (/usr/bin/x86_64-pld-linux-gcc -std=gnu99 -O2 -fwrapv -pipe -Wformat -gdwarf-4 -fno-debug-types-section -fvar-tracking-assignments -g2 -Wp,-D_FORTIFY_SOURCE=2 -fstack-protector-strong --param=ssp-buffer-size=4 -Werror=trampolines -fPIC -march=x86-64 -gdwarf-4 -fno-debug-types-section -fvar-tracking-assignments -g2 -D_FILE_OFFSET_BITS=64 -fuse-ld=gold) works... (cached) yes 0:36.97 js/src> checking whether the C compiler (/usr/bin/x86_64-pld-linux-gcc -std=gnu99 -O2 -fwrapv -pipe -Wformat -gdwarf-4 -fno-debug-types-section -fvar-tracking-assignments -g2 -Wp,-D_FORTIFY_SOURCE=2 -fstack-protector-strong --param=ssp-buffer-size=4 -Werror=trampolines -fPIC -march=x86-64 -gdwarf-4 -fno-debug-types-section -fvar-tracking-assignments -g2 -D_FILE_OFFSET_BITS=64 -fuse-ld=gold) is a cross-compiler... no 0:36.97 js/src> checking whether we are using GNU C... (cached) yes 0:36.97 js/src> checking whether /usr/bin/x86_64-pld-linux-gcc -std=gnu99 accepts -g... (cached) yes 0:36.97 js/src> checking for c++... (cached) /usr/bin/x86_64-pld-linux-g++ 0:36.97 js/src> checking whether the C++ compiler (/usr/bin/x86_64-pld-linux-g++ -O2 -fwrapv -pipe -Wformat -gdwarf-4 -fno-debug-types-section -fvar-tracking-assignments -g2 -Wp,-D_FORTIFY_SOURCE=2 -fstack-protector-strong --param=ssp-buffer-size=4 -Werror=trampolines -fPIC -march=x86-64 -gdwarf-4 -fno-debug-types-section -fvar-tracking-assignments -g2 -D_FILE_OFFSET_BITS=64 -fuse-ld=gold) works... (cached) yes 0:36.97 js/src> checking whether the C++ compiler (/usr/bin/x86_64-pld-linux-g++ -O2 -fwrapv -pipe -Wformat -gdwarf-4 -fno-debug-types-section -fvar-tracking-assignments -g2 -Wp,-D_FORTIFY_SOURCE=2 -fstack-protector-strong --param=ssp-buffer-size=4 -Werror=trampolines -fPIC -march=x86-64 -gdwarf-4 -fno-debug-types-section -fvar-tracking-assignments -g2 -D_FILE_OFFSET_BITS=64 -fuse-ld=gold) is a cross-compiler... no 0:36.97 js/src> checking whether we are using GNU C++... (cached) yes 0:36.97 js/src> checking whether /usr/bin/x86_64-pld-linux-g++ accepts -g... (cached) yes 0:36.98 js/src> checking for ranlib... (cached) ranlib 0:36.98 js/src> checking for /usr/bin/x86_64-pld-linux-gcc... (cached) /usr/bin/x86_64-pld-linux-gcc -std=gnu99 0:36.98 js/src> checking for strip... (cached) strip 0:36.98 js/src> checking for sb-conf... no 0:36.98 js/src> checking for ve... no 0:36.98 js/src> checking for X... (cached) libraries /usr/lib64, headers 0:36.99 js/src> checking for dnet_ntoa in -ldnet... (cached) no 0:36.99 js/src> checking for dnet_ntoa in -ldnet_stub... (cached) no 0:36.99 js/src> checking for gethostbyname... (cached) yes 0:36.99 js/src> checking for connect... (cached) yes 0:36.99 js/src> checking for remove... (cached) yes 0:37.00 js/src> checking for shmat... (cached) yes 0:37.00 js/src> checking for IceConnectionNumber in -lICE... (cached) yes 0:37.10 js/src> checking for --noexecstack option to as... yes 0:37.15 js/src> checking for -z noexecstack option to ld... yes 0:37.20 js/src> checking for -z text option to ld... yes 0:37.24 js/src> checking for -z relro option to ld... yes 0:37.29 js/src> checking for -z nocopyreloc option to ld... yes 0:37.33 js/src> checking for -Bsymbolic-functions option to ld... yes 0:37.39 js/src> checking for --build-id=sha1 option to ld... yes 0:37.46 js/src> checking whether the linker supports Identical Code Folding... yes 0:37.77 js/src> checking whether removing dead symbols breaks debugging... no 0:37.77 js/src> checking for working const... (cached) yes 0:37.77 js/src> checking for mode_t... (cached) yes 0:37.77 js/src> checking for off_t... (cached) yes 0:37.77 js/src> checking for pid_t... (cached) yes 0:37.77 js/src> checking for size_t... (cached) yes 0:37.81 js/src> checking for ssize_t... yes 0:37.81 js/src> checking whether 64-bits std::atomic requires -latomic... (cached) no 0:37.81 js/src> checking for dirent.h that defines DIR... (cached) yes 0:37.87 js/src> checking for opendir... yes 0:37.87 js/src> checking for gethostbyname_r in -lc_r... (cached) no 0:37.87 js/src> checking for library containing dlopen... (cached) -ldl 0:37.87 js/src> checking for dlfcn.h... (cached) yes 0:37.88 js/src> checking for socket in -lsocket... (cached) no 0:37.88 js/src> checking for pthread_create in -lpthreads... (cached) no 0:37.89 js/src> checking for pthread_create in -lpthread... (cached) yes 0:37.94 js/src> checking whether /usr/bin/x86_64-pld-linux-gcc -std=gnu99 accepts -pthread... yes 0:37.99 js/src> checking for getc_unlocked... yes 0:38.05 js/src> checking for _getc_nolock... no 0:38.05 js/src> checking for gmtime_r... (cached) yes 0:38.05 js/src> checking for localtime_r... (cached) yes 0:38.10 js/src> checking for pthread_getname_np... yes 0:38.16 js/src> checking for pthread_get_name_np... no 0:38.16 js/src> checking for clock_gettime(CLOCK_MONOTONIC)... (cached) 0:38.22 js/src> checking for sin in -lm... yes 0:38.27 js/src> checking for sincos in -lm... yes 0:38.33 js/src> checking for __sincos in -lm... no 0:38.33 js/src> checking for res_ninit()... (cached) yes 0:38.38 js/src> checking for nl_langinfo and CODESET... yes 0:38.38 js/src> checking for an implementation of va_copy()... (cached) yes 0:38.38 js/src> checking whether va_list can be copied by value... (cached) no 0:38.38 js/src> checking for __thread keyword for TLS variables... (cached) yes 0:38.39 js/src> checking for localeconv... (cached) yes 0:38.39 js/src> checking NSPR selection... command-line 0:38.43 js/src> checking for valid optimization flags... yes 0:38.43 js/src> checking for __cxa_demangle... (cached) yes 0:38.43 js/src> checking for -pipe support... yes 0:38.47 js/src> checking for tm_zone tm_gmtoff in struct tm... yes 0:38.52 js/src> checking what kind of list files are supported by the linker... linkerscript 0:38.58 js/src> checking for readline in -lreadline... yes 0:38.58 js/src> checking for icu-i18n >= 63.1... yes 0:38.58 js/src> checking MOZ_ICU_CFLAGS... 0:38.58 js/src> checking MOZ_ICU_LIBS... -licui18n -licuuc -licudata 0:38.60 js/src> checking for posix_fadvise... (cached) yes 0:38.60 js/src> checking for posix_fallocate... (cached) yes 0:38.60 js/src> checking for malloc.h... (cached) yes 0:38.60 js/src> checking for strndup... (cached) yes 0:38.61 js/src> checking for posix_memalign... (cached) yes 0:38.61 js/src> checking for memalign... (cached) yes 0:38.62 js/src> checking for malloc_usable_size... (cached) yes 0:38.64 js/src> checking whether malloc_usable_size definition can use const argument... no 0:38.66 js/src> checking for valloc in malloc.h... yes 0:38.67 js/src> checking for valloc in unistd.h... no 0:38.68 js/src> checking for _aligned_malloc in malloc.h... no 0:38.69 js/src> checking for localeconv... (cached) yes 0:38.70 js/src> updating cache /tmp/B.x9xnQx/BUILD/firefox-67.0/obj-x86_64/./config.cache 0:38.70 js/src> creating ./config.data 0:38.72 js/src> Creating config.status 0:38.80 Creating config.status 0:39.08 Reticulating splines... 0:41.04 0:02.02 File already read. Skipping: /tmp/B.x9xnQx/BUILD/firefox-67.0/gfx/angle/targets/angle_common/moz.build 0:53.85 Finished reading 1745 moz.build files in 3.84s 0:53.85 Read 14 gyp files in parallel contributing 0.00s to total wall time 0:53.85 Processed into 8601 build config descriptors in 4.09s 0:53.85 RecursiveMake backend executed in 5.77s 0:53.85 2959 total backend files; 2959 created; 0 updated; 0 unchanged; 0 deleted; 23 -> 1097 Makefile 0:53.85 FasterMake backend executed in 0.54s 0:53.85 14 total backend files; 14 created; 0 updated; 0 unchanged; 0 deleted 0:53.85 Total wall time: 14.82s; CPU time: 14.71s; Efficiency: 99%; Untracked: 0.58s Configure complete! Be sure to run |mach build| to pick up any changes 0:54.39 Clobber not needed. 0:54.39 Adding make options from /tmp/B.x9xnQx/BUILD/firefox-67.0/.mozconfig MOZ_OBJDIR=/tmp/B.x9xnQx/BUILD/firefox-67.0/obj-x86_64 OBJDIR=/tmp/B.x9xnQx/BUILD/firefox-67.0/obj-x86_64 FOUND_MOZCONFIG=/tmp/B.x9xnQx/BUILD/firefox-67.0/.mozconfig export FOUND_MOZCONFIG 0:54.40 /usr/bin/gmake -f client.mk BUILD_VERBOSE_LOG=1 0:54.43 /usr/bin/gmake -j8 -C /tmp/B.x9xnQx/BUILD/firefox-67.0/obj-x86_64 0:54.43 gmake[1]: Entering directory '/tmp/B.x9xnQx/BUILD/firefox-67.0/obj-x86_64' 0:54.47 gmake[2]: Entering directory '/tmp/B.x9xnQx/BUILD/firefox-67.0/obj-x86_64' 0:54.51 /usr/bin/gmake recurse_pre-export 0:54.51 gmake[3]: Entering directory '/tmp/B.x9xnQx/BUILD/firefox-67.0/obj-x86_64' 0:54.54 /tmp/B.x9xnQx/BUILD/firefox-67.0/obj-x86_64/_virtualenvs/init/bin/python -m mozbuild.action.process_install_manifest --track install_dist_include.track dist/include _build_manifests/install/dist_include 0:54.54 /tmp/B.x9xnQx/BUILD/firefox-67.0/obj-x86_64/_virtualenvs/init/bin/python -m mozbuild.action.process_install_manifest --track install_dist_public.track dist/public _build_manifests/install/dist_public 0:54.54 /tmp/B.x9xnQx/BUILD/firefox-67.0/obj-x86_64/_virtualenvs/init/bin/python -m mozbuild.action.process_install_manifest --track install_dist_private.track dist/private _build_manifests/install/dist_private 0:54.54 /tmp/B.x9xnQx/BUILD/firefox-67.0/obj-x86_64/_virtualenvs/init/bin/python -m mozbuild.action.process_install_manifest --track install_dist_xpi-stage.track dist/xpi-stage _build_manifests/install/dist_xpi-stage 0:54.54 /tmp/B.x9xnQx/BUILD/firefox-67.0/obj-x86_64/_virtualenvs/init/bin/python -m mozbuild.action.process_install_manifest --track install__tests.track _tests _build_manifests/install/_tests 0:54.54 /tmp/B.x9xnQx/BUILD/firefox-67.0/obj-x86_64/_virtualenvs/init/bin/python -m mozbuild.action.process_install_manifest --track install_dist_bin.track dist/bin _build_manifests/install/dist_bin 0:54.66 Elapsed: 0.00s; From dist/public: Kept 0 existing; Added/updated 0; Removed 0 files and 0 directories. 0:54.67 Elapsed: 0.00s; From dist/xpi-stage: Kept 0 existing; Added/updated 5; Removed 0 files and 0 directories. 0:54.68 Elapsed: 0.00s; From dist/private: Kept 0 existing; Added/updated 0; Removed 0 files and 0 directories. 0:54.76 Elapsed: 0.10s; From _tests: Kept 12 existing; Added/updated 481; Removed 0 files and 0 directories. 0:54.98 Elapsed: 0.31s; From dist/bin: Kept 248 existing; Added/updated 2310; Removed 0 files and 0 directories. 0:55.09 Elapsed: 0.43s; From dist/include: Kept 1573 existing; Added/updated 3542; Removed 0 files and 0 directories. 0:55.10 gmake[3]: Leaving directory '/tmp/B.x9xnQx/BUILD/firefox-67.0/obj-x86_64' 0:55.10 gmake[2]: Leaving directory '/tmp/B.x9xnQx/BUILD/firefox-67.0/obj-x86_64' 0:55.10 gmake[2]: Entering directory '/tmp/B.x9xnQx/BUILD/firefox-67.0/obj-x86_64' 0:55.14 ./mozilla-config.h.stub 0:55.14 /tmp/B.x9xnQx/BUILD/firefox-67.0/obj-x86_64/_virtualenvs/init/bin/python -m mozbuild.action.file_generate /tmp/B.x9xnQx/BUILD/firefox-67.0/python/mozbuild/mozbuild/action/process_define_files.py process_define_file mozilla-config.h .deps/mozilla-config.h.pp .deps/mozilla-config.h.stub /tmp/B.x9xnQx/BUILD/firefox-67.0/mozilla-config.h.in 0:55.27 ./buildid.h.stub 0:55.27 /tmp/B.x9xnQx/BUILD/firefox-67.0/obj-x86_64/_virtualenvs/init/bin/python -m mozbuild.action.file_generate /tmp/B.x9xnQx/BUILD/firefox-67.0/build/variables.py buildid_header buildid.h .deps/buildid.h.pp .deps/buildid.h.stub 0:55.40 ./source-repo.h.stub 0:55.40 /tmp/B.x9xnQx/BUILD/firefox-67.0/obj-x86_64/_virtualenvs/init/bin/python -m mozbuild.action.file_generate /tmp/B.x9xnQx/BUILD/firefox-67.0/build/variables.py source_repo_header source-repo.h .deps/source-repo.h.pp .deps/source-repo.h.stub 0:55.53 /tmp/B.x9xnQx/BUILD/firefox-67.0/obj-x86_64/_virtualenvs/init/bin/python /tmp/B.x9xnQx/BUILD/firefox-67.0/config/nsinstall.py -t -m 644 'buildid.h' 'dist/include' 0:55.53 /tmp/B.x9xnQx/BUILD/firefox-67.0/obj-x86_64/_virtualenvs/init/bin/python /tmp/B.x9xnQx/BUILD/firefox-67.0/config/nsinstall.py -t -m 644 'mozilla-config.h' 'dist/include' 0:55.53 /tmp/B.x9xnQx/BUILD/firefox-67.0/obj-x86_64/_virtualenvs/init/bin/python /tmp/B.x9xnQx/BUILD/firefox-67.0/config/nsinstall.py -t -m 644 'source-repo.h' 'dist/include' 0:55.60 /usr/bin/gmake recurse_export 0:55.60 gmake[3]: Entering directory '/tmp/B.x9xnQx/BUILD/firefox-67.0/obj-x86_64' 0:55.65 gmake[4]: Entering directory '/tmp/B.x9xnQx/BUILD/firefox-67.0/obj-x86_64/config' 0:55.65 mkdir -p '.deps/' 0:55.65 mkdir -p '../dist/host/bin/' 0:55.65 config/host_nsinstall.o 0:55.65 /usr/bin/x86_64-pld-linux-gcc -std=gnu99 -o host_nsinstall.o -c -DXP_UNIX -freorder-blocks -O2 -DNDEBUG=1 -DTRIMMED=1 -D_UNICODE -DUNICODE -I/tmp/B.x9xnQx/BUILD/firefox-67.0/config -I/tmp/B.x9xnQx/BUILD/firefox-67.0/obj-x86_64/config -I/tmp/B.x9xnQx/BUILD/firefox-67.0/obj-x86_64/dist/include -MD -MP -MF .deps/host_nsinstall.o.pp -I/usr/include/nspr /tmp/B.x9xnQx/BUILD/firefox-67.0/config/nsinstall.c 0:55.65 config/host_pathsub.o 0:55.65 /usr/bin/x86_64-pld-linux-gcc -std=gnu99 -o host_pathsub.o -c -DXP_UNIX -freorder-blocks -O2 -DNDEBUG=1 -DTRIMMED=1 -D_UNICODE -DUNICODE -I/tmp/B.x9xnQx/BUILD/firefox-67.0/config -I/tmp/B.x9xnQx/BUILD/firefox-67.0/obj-x86_64/config -I/tmp/B.x9xnQx/BUILD/firefox-67.0/obj-x86_64/dist/include -MD -MP -MF .deps/host_pathsub.o.pp -I/usr/include/nspr /tmp/B.x9xnQx/BUILD/firefox-67.0/config/pathsub.c 0:55.80 config/nsinstall_real 0:55.80 /usr/bin/x86_64-pld-linux-gcc -std=gnu99 -o nsinstall_real -DXP_UNIX -freorder-blocks -O2 host_nsinstall.o host_pathsub.o 0:55.82 /tmp/B.x9xnQx/BUILD/firefox-67.0/obj-x86_64/_virtualenvs/init/bin/python -m mozbuild.action.check_binary --host nsinstall_real 0:55.94 cp nsinstall_real nsinstall.tmp 0:55.94 mv nsinstall.tmp nsinstall 0:55.94 ../config/nsinstall -R -m 755 'nsinstall' '../dist/bin' 0:55.94 gmake[4]: Leaving directory '/tmp/B.x9xnQx/BUILD/firefox-67.0/obj-x86_64/config' 0:55.95 gmake[4]: Entering directory '/tmp/B.x9xnQx/BUILD/firefox-67.0/obj-x86_64/config' 0:55.95 config/stl.sentinel.stub 0:55.95 /tmp/B.x9xnQx/BUILD/firefox-67.0/obj-x86_64/_virtualenvs/init/bin/python -m mozbuild.action.file_generate /tmp/B.x9xnQx/BUILD/firefox-67.0/config/make-stl-wrappers.py gen_wrappers stl.sentinel .deps/stl.sentinel.pp .deps/stl.sentinel.stub ../dist/stl_wrappers gcc /tmp/B.x9xnQx/BUILD/firefox-67.0/config/gcc-stl-wrapper.template.h new algorithm atomic cassert climits cmath cstdarg cstdio cstdlib cstring cwchar deque functional ios iosfwd iostream istream iterator limits list map memory ostream regex set stack string thread tuple type_traits unordered_map unordered_set utility vector xutility 0:56.09 config/system-header.sentinel.stub 0:56.11 /tmp/B.x9xnQx/BUILD/firefox-67.0/obj-x86_64/_virtualenvs/init/bin/python -m mozbuild.action.file_generate /tmp/B.x9xnQx/BUILD/firefox-67.0/config/make-system-wrappers.py gen_wrappers system-header.sentinel .deps/system-header.sentinel.pp .deps/system-header.sentinel.stub ../dist/system_wrappers new algorithm atomic cassert climits cmath cstdarg cstdio cstdlib cstring cwchar deque functional ios iosfwd iostream istream iterator limits list map memory ostream regex set stack string thread tuple type_traits unordered_map unordered_set utility vector xutility A4Stuff.h activscp.h AEDataModel.h AEObjects.h AEPackObject.h AERegistry.h AEUtils.h afxcmn.h afxcoll.h afxcview.h afxdisp.h afxdtctl.h afxext.h afxmt.h afxpriv.h afxtempl.h afxwin.h Aliases.h all.h alloca.h alloc.h alsa/asoundlib.h ansi_parms.h a.out.h app/Cursor.h Appearance.h AppFileInfo.h AppKit.h AppleEvents.h Application.h app/Message.h app/MessageRunner.h arpa/inet.h arpa/nameser.h array asm/page.h asm/sigcontext.h asm/signal.h ASRegistry.h assert.h atk/atk.h atlcom.h atlconv.h atlctl.cpp atlctl.h ATLCTL.H atlhost.h atlimpl.cpp atlwin.cpp atomic.h ATSTypes.h ATSUnicode.h Balloons.h base64.h base/pblock.h base/PCR_Base.h base/session.h basetyps.h be/app/Application.h Beep.h be/kernel/image.h be/kernel/OS.h bfd.h Bitmap.h bitset blapi.h blapit.h bsd/libc.h bsd/syscall.h bstring.h builtin.h Button.h byteswap.h cairo-atsui.h cairo-beos.h cairo-directfb.h cairo-ft.h cairo-glitz.h cairo-gobject.h cairo.h cairo-pdf.h cairo-ps.h cairo-qpainter.h cairo-qt.h cairo-quartz.h cairo-tee.h cairo-win32.h cairo-xlib.h cairo-xlib-xrender.h callconv.h Carbon/Carbon.h CarbonEvents.h Carbon.h c_asm.h cctype cderr.h cerrno certdb.h cert.h certt.h CFBase.h CFBundle.h CFData.h CFDictionary.h cf.h CFNumber.h CFPlugIn.h CFPreferences.h CFString.h CFURL.h CGAffineTransform.h CheckBox.h ciferfam.h Clipboard.h cmmf.h cmmft.h cmplrs/stsupport.h cms.h cmsreclist.h cmst.h Cocoa/Cocoa.h CodeFragments.h comdef.h commctrl.h COMMCTRL.H commdlg.h compat.h complex condapi.h ConditionalMacros.h conio.h console.h ControlDefinitions.h Controls.h CoreFoundation/CoreFoundation.h CoreServices/CoreServices.h CPalmRec.cpp Cpalmrec.h CPCatgry.cpp CPDbBMgr.h CPString.cpp CPString.h crmf.h crmft.h crtdbg.h crt_externs.h crypt.h cryptohi.h cryptoht.h cstddef ctime ctype.h curl/curl.h curl/easy.h curses.h cxxabi.h DateTimeUtils.h dbus/dbus-glib.h dbus/dbus-glib-lowlevel.h dbus/dbus.h ddeml.h Debug.h dem.h descrip.h Devices.h dfb_types.h dfiff.h dgiff.h Dialogs.h direct/build.h direct/clock.h direct/conf.h direct/debug.h direct/direct.h directfb_keyboard.h directfb_strings.h direct.h direct/hash.h direct/interface.h direct/interface_implementation.h direct/list.h direct/log.h direct/memcpy.h direct/mem.h direct/messages.h direct/modules.h direct/serial.h direct/signals.h direct/stream.h direct/system.h direct/thread.h direct/trace.h direct/tree.h direct/types.h direct/utf8.h direct/util.h dirent.h DiskInit.h dlfcn.h dlgs.h dl.h docobj.h dos/dosextens.h dos.h Drag.h DriverServices.h DriverSynchronization.h DropInPanel.h dvidef.h ecl-exp.h elf.h endian.h Entry.h err.h errno.h Errors.h Events.h exception exdisp.h ExDisp.h exe386.h execinfo.h extras.h fcntl.h features.h fenv.h ffi.h fibdef.h File.h filehdr.h files.h Files.h FindDirectory.h Finder.h FinderRegistry.h FixMath.h float.h fnmatch.h Folders.h fontconfig/fcfreetype.h fontconfig/fontconfig.h Font.h Fonts.h fp.h fpieee.h frame/log.h frame/req.h freetype/freetype.h freetype/ftadvanc.h freetype/ftbitmap.h freetype/ftcache.h freetype/ftfntfmt.h freetype/ftglyph.h freetype/ftlcdfil.h freetype/ftoutln.h freetype/ftsizes.h freetype/ftsynth.h freetype/ftxf86.h freetype.h freetype/t1tables.h freetype/ttnameid.h freetype/tttables.h fribidi/fribidi.h FSp_fopen.h fstream fstream.h ft2build.h ftadvanc.h ftbitmap.h ftcache.h ftfntfmt.h ftglyph.h ftlcdfil.h ftoutln.h fts.h ftsizes.h ftsynth.h ftxf86.h fusion/arena.h fusion/build.h fusion/call.h fusion/conf.h fusion/fusion.h fusion/fusion_internal.h fusion/hash.h fusion/lock.h fusion/object.h fusion/property.h fusion/protocol.h fusion/reactor.h fusion/ref.h fusion/shmalloc.h fusion/shm/pool.h fusion/shm/shm.h fusion/shm/shm_internal.h fusion/types.h fusion/vector.h gconf/gconf-client.h Gdiplus.h gdk/gdkdirectfb.h gdk/gdk.h gdk/gdkkeysyms.h gdk/gdkprivate.h gdk/gdkwayland.h gdk/gdkx.h gdk-pixbuf/gdk-pixbuf.h Gestalt.h getopt.h gio/gio.h glibconfig.h glib.h glib-object.h glob.h gmodule.h gnome.h gnu/libc-version.h gps.h grp.h gssapi_generic.h gssapi/gssapi_generic.h gssapi/gssapi.h gssapi.h gst/app/gstappsink.h gst/app/gstappsrc.h gst/gst.h gst/video/video.h gtk/gtk.h gtk/gtkunixprint.h gtk/gtkx.h hasht.h HIToolbox/HIToolbox.h hlink.h ia64/sys/inline.h Icons.h iconv.h ieeefp.h ifaddrs.h image.h imagehlp.h imm.h initguid.h initializer_list InterfaceDefs.h InternetConfig.h IntlResources.h ints.h intshcut.h inttypes.h iodef.h io.h IOKit/IOKitLib.h IOKit/IOMessage.h IOKit/pwr_mgt/IOPMLib.h iomanip iostream.h jar-ds.h jarfile.h jar.h JavaControl.h JavaEmbedding/JavaControl.h JavaVM/jni.h JManager.h JNIEnvTests.h jni.h JVMManagerTests.h Kerberos/Kerberos.h kernel/image.h kernel/OS.h key.h keyhi.h keyt.h keythi.h kvm.h LAction.h langinfo.h LApplication.h LArray.h LArrayIterator.h LAttachable.h LAttachment.h LaunchServices.h lber.h LBroadcaster.h LButton.h lcache.h LCaption.h LCheckBox.h LCicnButton.h LClipboard.h LCommander.h LComparator.h LControl.h ldap.h ldaplog.h ldappr.h ldap_ssl.h LDataStream.h ldfcn.h LDialogBox.h ldif.h LDocApplication.h LDocument.h LDragAndDrop.h LDragTask.h LEditField.h LEditText.h LEventDispatcher.h LFile.h LFileStream.h LFileTypeList.h LFocusBox.h LGrafPortView.h LHandleStream.h libc_r.h libelf.h libelf/libelf.h libgen.h libgnome/gnome-url.h libgnome/libgnome.h libgnomeui/gnome-icon-lookup.h libgnomeui/gnome-icon-theme.h libgnomeui/gnome-ui-init.h libutil.h limits.h link.h linux/ioprio.h linux/kernel.h linux/limits.h linux/rtc.h linux/version.h List.h Lists.h LListBox.h LListener.h LMenuBar.h LMenu.h LModelDirector.h LModelObject.h LModelProperty.h loader.h locale locale.h LOffscreenView.h logkeys.h logstrng.h Looper.h LowMem.h LPane.h LPeriodical.h LPicture.h LPlaceHolder.h LPrintout.h LProgressBar.h LPushButton.h LRadioGroup.h LRadioGroupView.h LRunArray.h LScroller.h LSharable.h LSingleDoc.h LStaticText.h LStdControl.h LStream.h LString.h LTabGroup.h LTabGroupView.h LTableArrayStorage.h LTableMonoGeometry.h LTableSingleSelector.h LTableView.h LTextEditView.h LTextTableView.h LUndoer.h LVariableArray.h LView.h LWindow.h m68881.h MacErrors.h MacHeadersCarbon.h machine/ansi.h machine/builtins.h machine/clock.h machine/endian.h machine/frame.h machine/inline.h machine/limits.h machine/signal.h machine/trap.h mach/mach_host.h mach/mach_init.h mach/mach_interface.h mach/mach_port.h mach-o/dyld.h MacLocales.h MacMemory.h MacTCP.h MacTypes.h MacWindows.h malloc.h malloc_np.h mapicode.h mapidefs.h mapiguid.h mapi.h mapitags.h mapiutil.h mapix.h Math64.h math.h mbstring.h mem.h memory.h Memory.h MenuBar.h Menu.h Menus.h Message.h Mime.h MixedMode.h mlang.h mmsystem.h model.h Movies.h mpw/errno.h mshtmhst.h mshtml.h mswsock.h Multiprocessing.h mutex.h Navigation.h ncompat.h ncurses.h netCore.h netdb.h net/if.h netinet/in.h netinet/in_systm.h netinet/tcp.h newexe.h new.h nl_types.h NodeInfo.h nspr.h nssb64.h nssb64t.h nssbase.h nssbaset.h nssck.api nssckbi.h nssckepv.h nssckft.h nssckfwc.h nssckfw.h nssckfwt.h nssckg.h nssckmdt.h nssckt.h nss.h nssilckt.h nssilock.h nsslocks.h nssrwlk.h nssrwlkt.h nssutil.h nsswitch.h objbase.h objidl.h Objsafe.h ocsp.h ocspt.h ojiapitests.h ole2.h oleidl.h OpenGL/OpenGL.h OpenTptInternet.h OpenTransport.h OS.h osreldate.h OSUtils.h p12.h p12plcy.h p12t.h Packages.h Palettes.h PALM_CMN.H pango/pango-break.h pango/pangocairo.h pango/pangofc-decoder.h pango/pangofc-font.h pango/pangofc-fontmap.h pango/pango-fontmap.h pango/pango.h pango/pango-modules.h pango/pango-utils.h pango/pangoxft.h pascal.h Patches.h Path.h pcfs/pc_dir.h Pgenerr.h PGenErr.h Ph.h pixman.h pk11func.h pk11pqg.h pk11priv.h pk11pub.h pk11sdr.h pkcs11f.h pkcs11.h pkcs11n.h pkcs11p.h pkcs11t.h pkcs11u.h pkcs12.h pkcs12t.h pkcs7t.h plarena.h plarenas.h plbase64.h plerror.h plgetopt.h plhash.h plstr.h PLStringFuncs.h PMApplication.h pmddim.h poll.h Polygon.h portable.h port.h portreg.h Power.h PP_ClassHeaders.cp PP_Constants.h PPCToolbox.h PP_DebugHeaders.cp PP_KeyCodes.h PP_Macros.h PP_Messages.h PP_Prefix.h PP_Resources.h PP_Types.h pratom.h prbit.h prclist.h prcmon.h prcountr.h prcpucfg.h prcvar.h prdtoa.h preenc.h prenv.h prerr.h prerror.h prinet.h prinit.h prinrval.h Printing.h Print/PMPrintingDialogExtensions.h prio.h pripcsem.h private prlink.h prlock.h prlog.h prlong.h prmem.h prmon.h prmwait.h prnetdb.h Processes.h process.h Process.h prolock.h proto/dos.h proto/exec.h prpdce.h prprf.h prproces.h prrng.h prrwlock.h prshma.h prshm.h prsystem.h prthread.h prtime.h prtpool.h prtrace.h prtypes.h prvrsion.h prwin16.h psap.h Pt.h pthread.h pthread_np.h pulse/pulseaudio.h pwd.h Python.h QDOffscreen.h queue Quickdraw.h QuickDraw.h QuickTimeComponents.h quipu/attr.h regex.h Region.h resolv.h Resources.h Retrace.h rld_interface.h Roster.h rpc.h rpcproxy.h rpc/types.h sane/sane.h sane/sanei.h sane/saneopts.h sanitizer/asan_interface.h sched.h Scrap.h Screen.h Script.h ScrollBar.h secasn1.h secasn1t.h seccomon.h secder.h secdert.h secdig.h secdigt.h secerr.h sec.h sechash.h secitem.h secmime.h secmod.h secmodt.h secoid.h secoidt.h secpkcs5.h secpkcs7.h secport.h secrng.h security.h secutil.h semaphore.h servprov.h setjmp.h SFNTLayoutTypes.h SFNTTypes.h sha1.h share.h shellapi.h shlguid.h shlobj.h shsign.h sigcontext.h signal.h SimpleGameSound.h SIOUX.h size_t.h smime.h sndio.h someincludefile.h soundcard.h Sound.h soundtouch/SoundTouchFactory.h soundtouch/SoundTouch.h spawn.h sqlite3.h sslerr.h ssl.h sslproto.h sslt.h sstream StandardFile.h starlet.h stat.h statreg.cpp statreg.h stdarg.h stdbool.h stddef.h stdint.h stdio.h stdlib.h storage/FindDirectory.h StorageKit.h StringCompare.h string.h String.h strings.h Strings.h StringView.h stropts.h strstrea.h structs.h stsdef.h SupportDefs.h support/String.h support/SupportDefs.h support/TLS.h svrcore.h symconst.h sym.h synch.h syncmgr.h sys/atomic_op.h sys/auxv.h sys/bitypes.h sys/byteorder.h syscall.h sys/cdefs.h sys/cfgodm.h sys/elf.h sys/endian.h sys/epoll.h sys/errno.h sys/eventfd.h sys/fault.h sys/fcntl.h sys/file.h sys/filio.h sys/frame.h sys/immu.h sys/inotify.h sys/inttypes.h sys/ioccom.h sys/ioctl.h sys/ipc.h sys/klog.h sys/ldr.h sys/link.h sys/locking.h syslog.h sys/lwp.h sys/machine.h sys/mman.h sys/mmu.h sys/mount.h sys/mpctl.h sys/msg.h sys/param.h sys/pda.h sys/poll.h sys/ppc.h sys/prctl.h sys/priv.h sys/procfs.h sys/pstat.h sys/ptrace.h sys/queue.h sys/quota.h sys/reboot.h sys/reg.h sys/regset.h sys/resource.h sys/sched.h sys/select.h sys/sem.h sys/sendfile.h sys/shm.h sys/siginfo.h sys/signal.h sys/socket.h sys/sockio.h sys/sparc/frame.h sys/stack.h sys/statfs.h sys/stat.h sys/statvfs.h sys/syscall.h sys/sysctl.h sys/sysinfo.h sys/sysmacros.h sys/sysmp.h sys/syssgi.h sys/systeminfo.h sys/system_properties.h sys/thr.h sys/timeb.h sys/time.h sys/times.h sys/ttycom.h sys/types.h sys/ucontext.h sys/uio.h sys/un.h sys/unistd.h sys/user.h sys/utsname.h sys/vfs.h sys/wait.h t1tables.h tables.h TArray.h TArrayIterator.h task.h tchar.h TCHAR.H termios.h TextCommon.h TextEdit.h TextEncodingConverter.h TextServices.h TextUtils.h TextView.h th/PCR_Th.h thread.h ThreadManagerTests.h Threads.h time.h Timer.h tlhelp32.h ToolUtils.h tr1/functional trace.h Traps.h ttnameid.h tttables.h typeinfo types.h Types.h UAppleEventsMgr.h UAttachments.h ucontext.h uconv.h UCursor.h UDebugging.h UDesktop.h UDrawingState.h UDrawingUtils.h UEnvironment.h UEventMgr.h UException.h UExtractFromAEDesc.h UGWorld.h UKeyFilters.h ulocks.h ulserrno.h UMemoryMgr.h UModalDialogs.h UNavServicesDialogs.h UnicodeBlockObjects.h UnicodeConverter.h UnicodeUtilities.h unidef.h unikbd.h unistd.h unix.h unixio.h unknwn.h unwind.h UPrinting.h UQuickTime.h UReanimator.h URegions.h URegistrar.h UResourceMgr.h urlhist.h urlmon.h UScrap.h UScreenPort.h UTCUtils.h UTETextAction.h UTEViewTextAction.h UTextEdit.h UTextTraits.h utilmodt.h utilpars.h utilparst.h utilrename.h utime.h UWindows.h values.h varargs.h vcclr.h View.h Volume.h wab.h wait.h wchar.h wctype.h winbase.h win/compobj.h windef.h Window.h windows.h Windows.h windowsx.h Wininet.h winnls.h winperf.h winreg.h Winreg.h winsock2.h winsock.h winspool.h winsvc.h winuser.h winver.h wmem.h workbench/startup.h wtypes.h wx/image.h wx/listctrl.h wx/log.h wx/toolbar.h wx/wx.h wx/xrc/xmlres.h X11/cursorfont.h X11/extensions/Print.h X11/extensions/scrnsaver.h X11/extensions/shape.h X11/extensions/Xcomposite.h X11/extensions/Xdamage.h X11/extensions/Xfixes.h X11/extensions/Xrender.h X11/extensions/XShm.h X11/ImUtil.h X11/Intrinsic.h X11/keysymdef.h X11/keysym.h X11/Shell.h X11/StringDefs.h X11/Xatom.h X11/Xft/Xft.h X11/Xfuncproto.h X11/X.h X11/XKBlib.h X11/Xlib.h X11/Xlibint.h X11/Xlib-xcb.h X11/Xlocale.h X11/Xos.h X11/Xutil.h xcb/shm.h xcb/xcb.h xlocale.h zmouse.h libavcodec/avfft.h png.h zlib.h libsn/sn-common.h libsn/sn.h libsn/sn-launchee.h libsn/sn-launcher.h libsn/sn-monitor.h libsn/sn-util.h event2/event_compat.h event2/event.h event2/event_struct.h event.h vpx_mem/vpx_mem.h vpx/svc_context.h vpx/vp8cx.h vpx/vp8dx.h vpx/vpx_codec.h vpx/vpx_decoder.h vpx/vpx_encoder.h unicode/locid.h unicode/numsys.h unicode/plurrule.h unicode/timezone.h unicode/ucal.h unicode/uchar.h unicode/uclean.h unicode/ucol.h unicode/udat.h unicode/udatpg.h unicode/udisplaycontext.h unicode/uenum.h unicode/unistr.h unicode/unorm.h unicode/unum.h unicode/upluralrules.h unicode/ureldatefmt.h unicode/ustring.h unicode/utypes.h xkbcommon/xkbcommon.h wayland-client.h wayland-egl.h wayland-util.h 0:56.34 gmake[4]: Leaving directory '/tmp/B.x9xnQx/BUILD/firefox-67.0/obj-x86_64/config' 0:56.35 gmake[4]: Entering directory '/tmp/B.x9xnQx/BUILD/firefox-67.0/obj-x86_64/build' 0:56.35 build/application.ini.stub 0:56.35 /tmp/B.x9xnQx/BUILD/firefox-67.0/obj-x86_64/_virtualenvs/init/bin/python -m mozbuild.action.file_generate /tmp/B.x9xnQx/BUILD/firefox-67.0/python/mozbuild/mozbuild/action/preprocessor.py generate application.ini .deps/application.ini.pp .deps/application.ini.stub /tmp/B.x9xnQx/BUILD/firefox-67.0/build/application.ini.in -DMOZ_APP_VERSION=67.0 '-DMOZ_APP_ID={ec8030f7-c20a-464f-9b0e-13a3a9e97384}' -DTOPOBJDIR=/tmp/B.x9xnQx/BUILD/firefox-67.0/obj-x86_64 -DMOZ_APP_VENDOR=Mozilla -DGRE_MILESTONE=67.0 -DMOZ_APP_BASENAME=Firefox -DMOZ_PROFILE_MIGRATOR=1 -DMOZ_BUILD_APP_IS_BROWSER=1 -DMOZ_APP_REMOTINGNAME=firefox -DMAR_CHANNEL_ID=firefox-mozilla-release 0:56.35 gmake[4]: Entering directory '/tmp/B.x9xnQx/BUILD/firefox-67.0/obj-x86_64/memory/build' 0:56.35 gmake[4]: Nothing to be done for 'export'. 0:56.35 gmake[4]: Leaving directory '/tmp/B.x9xnQx/BUILD/firefox-67.0/obj-x86_64/memory/build' 0:56.35 gmake[4]: Entering directory '/tmp/B.x9xnQx/BUILD/firefox-67.0/obj-x86_64/js/src' 0:56.35 js/src/js-confdefs.h.stub 0:56.35 /tmp/B.x9xnQx/BUILD/firefox-67.0/obj-x86_64/_virtualenvs/init/bin/python -m mozbuild.action.file_generate /tmp/B.x9xnQx/BUILD/firefox-67.0/python/mozbuild/mozbuild/action/process_define_files.py process_define_file js-confdefs.h .deps/js-confdefs.h.pp .deps/js-confdefs.h.stub /tmp/B.x9xnQx/BUILD/firefox-67.0/js/src/js-confdefs.h.in 0:56.35 gmake[4]: Entering directory '/tmp/B.x9xnQx/BUILD/firefox-67.0/obj-x86_64/mozglue/build' 0:56.35 gmake[4]: Nothing to be done for 'export'. 0:56.35 gmake[4]: Leaving directory '/tmp/B.x9xnQx/BUILD/firefox-67.0/obj-x86_64/mozglue/build' 0:56.36 gmake[4]: Entering directory '/tmp/B.x9xnQx/BUILD/firefox-67.0/obj-x86_64/xpcom' 0:56.36 xpcom/xpcom-config.h.stub 0:56.36 /tmp/B.x9xnQx/BUILD/firefox-67.0/obj-x86_64/_virtualenvs/init/bin/python -m mozbuild.action.file_generate /tmp/B.x9xnQx/BUILD/firefox-67.0/python/mozbuild/mozbuild/action/process_define_files.py process_define_file xpcom-config.h .deps/xpcom-config.h.pp .deps/xpcom-config.h.stub /tmp/B.x9xnQx/BUILD/firefox-67.0/xpcom/xpcom-config.h.in 0:56.36 gmake[4]: Entering directory '/tmp/B.x9xnQx/BUILD/firefox-67.0/obj-x86_64/media/libtheora' 0:56.36 gmake[4]: Nothing to be done for 'export'. 0:56.36 gmake[4]: Leaving directory '/tmp/B.x9xnQx/BUILD/firefox-67.0/obj-x86_64/media/libtheora' 0:56.36 gmake[4]: Entering directory '/tmp/B.x9xnQx/BUILD/firefox-67.0/obj-x86_64/security/apps' 0:56.36 security/apps/xpcshell.inc.stub 0:56.36 /tmp/B.x9xnQx/BUILD/firefox-67.0/obj-x86_64/_virtualenvs/init/bin/python -m mozbuild.action.file_generate /tmp/B.x9xnQx/BUILD/firefox-67.0/security/apps/gen_cert_header.py xpcshellRoot xpcshell.inc .deps/xpcshell.inc.pp .deps/xpcshell.inc.stub /tmp/B.x9xnQx/BUILD/firefox-67.0/security/manager/ssl/tests/unit/test_signed_apps/xpcshellTestRoot.der 0:56.36 gmake[4]: Entering directory '/tmp/B.x9xnQx/BUILD/firefox-67.0/obj-x86_64/media/libopus' 0:56.36 gmake[4]: Nothing to be done for 'export'. 0:56.36 gmake[4]: Leaving directory '/tmp/B.x9xnQx/BUILD/firefox-67.0/obj-x86_64/media/libopus' 0:56.36 gmake[4]: Entering directory '/tmp/B.x9xnQx/BUILD/firefox-67.0/obj-x86_64/netwerk' 0:56.36 netwerk/necko-config.h.stub 0:56.36 /tmp/B.x9xnQx/BUILD/firefox-67.0/obj-x86_64/_virtualenvs/init/bin/python -m mozbuild.action.file_generate /tmp/B.x9xnQx/BUILD/firefox-67.0/python/mozbuild/mozbuild/action/process_define_files.py process_define_file necko-config.h .deps/necko-config.h.pp .deps/necko-config.h.stub /tmp/B.x9xnQx/BUILD/firefox-67.0/netwerk/necko-config.h.in 0:56.36 gmake[4]: Entering directory '/tmp/B.x9xnQx/BUILD/firefox-67.0/obj-x86_64/media/libdav1d' 0:56.36 media/libdav1d/16bd_cdef_apply_tmpl.c.stub 0:56.36 /tmp/B.x9xnQx/BUILD/firefox-67.0/obj-x86_64/_virtualenvs/init/bin/python -m mozbuild.action.file_generate /tmp/B.x9xnQx/BUILD/firefox-67.0/media/libdav1d/generate_source.py add_define 16bd_cdef_apply_tmpl.c .deps/16bd_cdef_apply_tmpl.c.pp .deps/16bd_cdef_apply_tmpl.c.stub /tmp/B.x9xnQx/BUILD/firefox-67.0/third_party/dav1d/src/cdef_apply_tmpl.c BITDEPTH 16 0:56.37 gmake[4]: Entering directory '/tmp/B.x9xnQx/BUILD/firefox-67.0/obj-x86_64/ipc/ipdl' 0:56.37 rm -f PMediaTransport.ipdl 0:56.37 gmake[4]: Entering directory '/tmp/B.x9xnQx/BUILD/firefox-67.0/obj-x86_64/ipc/app' 0:56.37 gmake[4]: Nothing to be done for 'export'. 0:56.37 gmake[4]: Leaving directory '/tmp/B.x9xnQx/BUILD/firefox-67.0/obj-x86_64/ipc/app' 0:56.37 /tmp/B.x9xnQx/BUILD/firefox-67.0/obj-x86_64/_virtualenvs/init/bin/python -m mozbuild.action.preprocessor -DNDEBUG=1 -DTRIMMED=1 -DOS_POSIX=1 -DOS_LINUX=1 -DSTATIC_EXPORTABLE_JS_API -DMOZ_HAS_MOZGLUE -DMOZILLA_INTERNAL_API -DIMPL_LIBXUL -DACCESSIBILITY=1 -DATK_MAJOR_VERSION=2 -DATK_MINOR_VERSION=32 -DATK_REV_VERSION=0 -DBROWSER_CHROME_URL=chrome://browser/content/browser.xul -DBROWSER_CHROME_URL_QUOTED='"chrome://browser/content/browser.xul"' -DBUILD_CTYPES=1 -DCROSS_COMPILE='' -DENABLE_INTL_API=1 -DENABLE_SYSTEM_EXTENSION_DIRS=1 -DEXPOSE_INTL_API=1 -DFORCE_PR_LOG=1 -DFUNCPROTO=15 -DGDK_VERSION_MAX_ALLOWED=GDK_VERSION_3_4 -DGLIB_VERSION_MAX_ALLOWED=GLIB_VERSION_2_32 -DGLIB_VERSION_MIN_REQUIRED=GLIB_VERSION_2_26 -DGL_PROVIDER_EGL=1 -DHAVE_64BIT_BUILD=1 -DHAVE_ALLOCA_H=1 -DHAVE_BYTESWAP_H=1 -DHAVE_CLOCK_MONOTONIC=1 -DHAVE_CPUID_H=1 -DHAVE_DIRENT_H=1 -DHAVE_DLADDR=1 -DHAVE_DLOPEN=1 -DHAVE_FONTCONFIG_FCFREETYPE_H=1 -DHAVE_FT_BITMAP_SIZE_Y_PPEM=1 -DHAVE_FT_GLYPHSLOT_EMBOLDEN=1 -DHAVE_FT_LOAD_SFNT_TABLE=1 -DHAVE_GETOPT_H=1 -DHAVE_GMTIME_R=1 -DHAVE_INTTYPES_H=1 -DHAVE_LCHOWN=1 -DHAVE_LIBPNG=1 -DHAVE_LINUX_IF_ADDR_H=1 -DHAVE_LINUX_PERF_EVENT_H=1 -DHAVE_LINUX_QUOTA_H=1 -DHAVE_LINUX_RTNETLINK_H=1 -DHAVE_LOCALECONV=1 -DHAVE_LOCALTIME_R=1 -DHAVE_LSTAT64=1 -DHAVE_MALLINFO=1 -DHAVE_MALLOC_H=1 -DHAVE_MALLOC_USABLE_SIZE=1 -DHAVE_MEMALIGN=1 -DHAVE_MEMMEM=1 -DHAVE_NETINET_IN_H=1 -DHAVE_NL_TYPES_H=1 -DHAVE_POSIX_FADVISE=1 -DHAVE_POSIX_FALLOCATE=1 -DHAVE_POSIX_MEMALIGN=1 -DHAVE_PTHREAD_H=1 -DHAVE_RES_NINIT=1 -DHAVE_SETPRIORITY=1 -DHAVE_STAT64=1 -DHAVE_STDINT_H=1 -DHAVE_STRERROR=1 -DHAVE_STRNDUP=1 -DHAVE_SYSCALL=1 -DHAVE_SYS_QUEUE_H=1 -DHAVE_SYS_QUOTA_H=1 -DHAVE_SYS_TYPES_H=1 -DHAVE_THREAD_TLS_KEYWORD=1 -DHAVE_TRUNCATE64=1 -DHAVE_UNISTD_H=1 -DHAVE_VALLOC=1 -DHAVE_VA_COPY=1 -DHAVE_VA_LIST_AS_ARRAY=1 -DHAVE_VISIBILITY_ATTRIBUTE=1 -DHAVE_VISIBILITY_HIDDEN_ATTRIBUTE=1 -DHAVE_VPX_VPX_DECODER_H=1 -DHAVE__UNWIND_BACKTRACE=1 -DHAVE___CXA_DEMANGLE=1 -DJS_64BIT=1 -DJS_CODEGEN_X64=1 -DJS_DEFAULT_JITREPORT_GRANULARITY=3 -DJS_PUNBOX64=1 -DMALLOC_H='<malloc.h>' -DMALLOC_USABLE_SIZE_CONST_PTR='' -DMOZILLA_UAVERSION='"67.0"' -DMOZILLA_VERSION='"67.0"' -DMOZILLA_VERSION_U=67.0 -DMOZ_ACCESSIBILITY_ATK=1 -DMOZ_ALSA=1 -DMOZ_APP_UA_NAME='""' -DMOZ_APP_UA_VERSION='"67.0"' -DMOZ_AV1=1 -DMOZ_BLOCK_PROFILE_DOWNGRADE=1 -DMOZ_BUILD_APP=browser -DMOZ_BUILD_WEBRENDER=1 -DMOZ_BUNDLED_FONTS=1 -DMOZ_CONTENT_SANDBOX=1 -DMOZ_DATA_REPORTING=1 -DMOZ_DAV1D_ASM=1 -DMOZ_DEDICATED_PROFILES=1 -DMOZ_DISTRIBUTION_ID='"org.pld-linux"' -DMOZ_DLL_PREFIX='"lib"' -DMOZ_DLL_SUFFIX='".so"' -DMOZ_ENABLE_DBUS=1 -DMOZ_ENABLE_SIGNMAR=1 -DMOZ_ENABLE_SKIA=1 -DMOZ_ENABLE_STARTUP_NOTIFICATION=1 -DMOZ_FFMPEG=1 -DMOZ_FFVPX=1 -DMOZ_FMP4=1 -DMOZ_GECKO_PROFILER=1 -DMOZ_GLUE_IN_PROGRAM=1 -DMOZ_GMP_SANDBOX=1 -DMOZ_HAS_REMOTE=1 -DMOZ_INSTRUMENT_EVENT_LOOP=1 -DMOZ_LIBAV_FFT=1 -DMOZ_LOGGING=1 -DMOZ_MACBUNDLE_ID=org.pld-linux.firefox -DMOZ_MEMORY=1 -DMOZ_OFFICIAL_BRANDING=1 -DMOZ_PEERCONNECTION=1 -DMOZ_PHOENIX=1 -DMOZ_PLACES=1 -DMOZ_PROFILER_MEMORY=1 -DMOZ_PULSEAUDIO=1 -DMOZ_RAW=1 -DMOZ_SAMPLE_TYPE_FLOAT32=1 -DMOZ_SANDBOX=1 -DMOZ_SCTP=1 -DMOZ_SERVICES_HEALTHREPORT=1 -DMOZ_SRTP=1 -DMOZ_STATIC_JS=1 -DMOZ_SYSTEM_ICU=1 -DMOZ_SYSTEM_SQLITE=1 -DMOZ_TREE_CAIRO=1 -DMOZ_UPDATE_CHANNEL=default -DMOZ_USER_DIR='".mozilla"' -DMOZ_VORBIS=1 -DMOZ_WAYLAND=1 -DMOZ_WEBM_ENCODER=1 -DMOZ_WEBRTC=1 -DMOZ_WEBRTC_ASSERT_ALWAYS=1 -DMOZ_WEBRTC_SIGNALING=1 -DMOZ_WEBSPEECH=1 -DMOZ_WEBSPEECH_TEST_BACKEND=1 -DMOZ_WIDGET_GTK=1 -DMOZ_X11=1 -DMOZ_XUL=1 -DNO_NSPR_10_SUPPORT=1 -DNS_PRINTING=1 -DNS_PRINT_PREVIEW=1 -DRELEASE_OR_BETA=1 -DSTATIC_JS_API=1 -DSTDC_HEADERS=1 -DTARGET_XPCOM_ABI='"x86_64-gcc3"' -DUSE_SKIA=1 -DU_USING_ICU_NAMESPACE=0 -DVA_COPY=va_copy -DXP_LINUX=1 -DXP_UNIX=1 -D_REENTRANT=1 -DAB_CD=en-US /tmp/B.x9xnQx/BUILD/firefox-67.0/dom/media/webrtc/PMediaTransport.ipdl -o PMediaTransport.ipdl 0:56.40 gmake[4]: Entering directory '/tmp/B.x9xnQx/BUILD/firefox-67.0/obj-x86_64/gfx/cairo/cairo/src' 0:56.40 ../../../../config/nsinstall -R -m 644 'cairo-features.h' '../../../../dist/include/cairo' 0:56.40 gmake[4]: Leaving directory '/tmp/B.x9xnQx/BUILD/firefox-67.0/obj-x86_64/gfx/cairo/cairo/src' 0:56.41 gmake[4]: Entering directory '/tmp/B.x9xnQx/BUILD/firefox-67.0/obj-x86_64/gfx/angle' 0:56.41 gmake[4]: Nothing to be done for 'export'. 0:56.41 gmake[4]: Leaving directory '/tmp/B.x9xnQx/BUILD/firefox-67.0/obj-x86_64/gfx/angle' 0:56.41 gmake[4]: Entering directory '/tmp/B.x9xnQx/BUILD/firefox-67.0/obj-x86_64/gfx/webrender_bindings' 0:56.41 gfx/webrender_bindings/webrender_ffi_generated.h.stub 0:56.41 /tmp/B.x9xnQx/BUILD/firefox-67.0/obj-x86_64/_virtualenvs/init/bin/python -m mozbuild.action.file_generate /tmp/B.x9xnQx/BUILD/firefox-67.0/layout/style/RunCbindgen.py generate webrender_ffi_generated.h .deps/webrender_ffi_generated.h.pp .deps/webrender_ffi_generated.h.stub /tmp/B.x9xnQx/BUILD/firefox-67.0/gfx/webrender_bindings /tmp/B.x9xnQx/BUILD/firefox-67.0/gfx/wr/webrender /tmp/B.x9xnQx/BUILD/firefox-67.0/gfx/wr/webrender_api 0:56.50 build/application.ini.h.stub 0:56.50 /tmp/B.x9xnQx/BUILD/firefox-67.0/obj-x86_64/_virtualenvs/init/bin/python -m mozbuild.action.file_generate /tmp/B.x9xnQx/BUILD/firefox-67.0/build/appini_header.py main application.ini.h .deps/application.ini.h.pp .deps/application.ini.h.stub application.ini 0:56.52 ../config/nsinstall -R -m 644 'necko-config.h' '../dist/include' 0:56.52 gmake[4]: Leaving directory '/tmp/B.x9xnQx/BUILD/firefox-67.0/obj-x86_64/netwerk' 0:56.52 media/libdav1d/16bd_cdef_tmpl.c.stub 0:56.52 /tmp/B.x9xnQx/BUILD/firefox-67.0/obj-x86_64/_virtualenvs/init/bin/python -m mozbuild.action.file_generate /tmp/B.x9xnQx/BUILD/firefox-67.0/media/libdav1d/generate_source.py add_define 16bd_cdef_tmpl.c .deps/16bd_cdef_tmpl.c.pp .deps/16bd_cdef_tmpl.c.stub /tmp/B.x9xnQx/BUILD/firefox-67.0/third_party/dav1d/src/cdef_tmpl.c BITDEPTH 16 0:56.53 /tmp/B.x9xnQx/BUILD/firefox-67.0/obj-x86_64/_virtualenvs/init/bin/python /tmp/B.x9xnQx/BUILD/firefox-67.0/config/pythonpath.py \ 0:56.53 -I/tmp/B.x9xnQx/BUILD/firefox-67.0/other-licenses/ply \ 0:56.53 /tmp/B.x9xnQx/BUILD/firefox-67.0/ipc/ipdl/ipdl.py \ 0:56.53 --sync-msg-list=/tmp/B.x9xnQx/BUILD/firefox-67.0/ipc/ipdl/sync-messages.ini \ 0:56.53 --msg-metadata=/tmp/B.x9xnQx/BUILD/firefox-67.0/ipc/ipdl/message-metadata.ini \ 0:56.53 --outheaders-dir=_ipdlheaders \ 0:56.53 --outcpp-dir=. \ 0:56.53 -I/tmp/B.x9xnQx/BUILD/firefox-67.0/obj-x86_64/ipc/ipdl -I/tmp/B.x9xnQx/BUILD/firefox-67.0/accessible/ipc/other -I/tmp/B.x9xnQx/BUILD/firefox-67.0/devtools/shared/heapsnapshot -I/tmp/B.x9xnQx/BUILD/firefox-67.0/dom/asmjscache -I/tmp/B.x9xnQx/BUILD/firefox-67.0/dom/broadcastchannel -I/tmp/B.x9xnQx/BUILD/firefox-67.0/dom/cache -I/tmp/B.x9xnQx/BUILD/firefox-67.0/dom/clients/manager -I/tmp/B.x9xnQx/BUILD/firefox-67.0/dom/fetch -I/tmp/B.x9xnQx/BUILD/firefox-67.0/dom/file/ipc -I/tmp/B.x9xnQx/BUILD/firefox-67.0/dom/filehandle -I/tmp/B.x9xnQx/BUILD/firefox-67.0/dom/filesystem -I/tmp/B.x9xnQx/BUILD/firefox-67.0/dom/gamepad/ipc -I/tmp/B.x9xnQx/BUILD/firefox-67.0/dom/indexedDB -I/tmp/B.x9xnQx/BUILD/firefox-67.0/dom/ipc -I/tmp/B.x9xnQx/BUILD/firefox-67.0/dom/localstorage -I/tmp/B.x9xnQx/BUILD/firefox-67.0/dom/media/gmp -I/tmp/B.x9xnQx/BUILD/firefox-67.0/dom/media/ipc -I/tmp/B.x9xnQx/BUILD/firefox-67.0/dom/media/systemservices -I/tmp/B.x9xnQx/BUILD/firefox-67.0/dom/media/webrtc -I/tmp/B.x9xnQx/BUILD/firefox-67.0/dom/media/webspeech/synth/ipc -I/tmp/B.x9xnQx/BUILD/firefox-67.0/dom/messagechannel -I/tmp/B.x9xnQx/BUILD/firefox-67.0/dom/midi -I/tmp/B.x9xnQx/BUILD/firefox-67.0/dom/network -I/tmp/B.x9xnQx/BUILD/firefox-67.0/dom/payments/ipc -I/tmp/B.x9xnQx/BUILD/firefox-67.0/dom/plugins/ipc -I/tmp/B.x9xnQx/BUILD/firefox-67.0/dom/presentation/ipc -I/tmp/B.x9xnQx/BUILD/firefox-67.0/dom/quota -I/tmp/B.x9xnQx/BUILD/firefox-67.0/dom/reporting -I/tmp/B.x9xnQx/BUILD/firefox-67.0/dom/serviceworkers -I/tmp/B.x9xnQx/BUILD/firefox-67.0/dom/simpledb -I/tmp/B.x9xnQx/BUILD/firefox-67.0/dom/storage -I/tmp/B.x9xnQx/BUILD/firefox-67.0/dom/webauthn -I/tmp/B.x9xnQx/BUILD/firefox-67.0/dom/webbrowserpersist -I/tmp/B.x9xnQx/BUILD/firefox-67.0/dom/workers/remoteworkers -I/tmp/B.x9xnQx/BUILD/firefox-67.0/dom/workers/sharedworkers -I/tmp/B.x9xnQx/BUILD/firefox-67.0/extensions/spellcheck/hunspell/glue -I/tmp/B.x9xnQx/BUILD/firefox-67.0/gfx/ipc -I/tmp/B.x9xnQx/BUILD/firefox-67.0/gfx/layers/ipc -I/tmp/B.x9xnQx/BUILD/firefox-67.0/gfx/vr/ipc -I/tmp/B.x9xnQx/BUILD/firefox-67.0/hal/sandbox -I/tmp/B.x9xnQx/BUILD/firefox-67.0/ipc/glue -I/tmp/B.x9xnQx/BUILD/firefox-67.0/ipc/testshell -I/tmp/B.x9xnQx/BUILD/firefox-67.0/js/ipc -I/tmp/B.x9xnQx/BUILD/firefox-67.0/js/xpconnect/loader -I/tmp/B.x9xnQx/BUILD/firefox-67.0/layout/base -I/tmp/B.x9xnQx/BUILD/firefox-67.0/layout/ipc -I/tmp/B.x9xnQx/BUILD/firefox-67.0/layout/printing/ipc -I/tmp/B.x9xnQx/BUILD/firefox-67.0/media/mtransport/ipc -I/tmp/B.x9xnQx/BUILD/firefox-67.0/netwerk/cookie -I/tmp/B.x9xnQx/BUILD/firefox-67.0/netwerk/dns -I/tmp/B.x9xnQx/BUILD/firefox-67.0/netwerk/ipc -I/tmp/B.x9xnQx/BUILD/firefox-67.0/netwerk/protocol/ftp -I/tmp/B.x9xnQx/BUILD/firefox-67.0/netwerk/protocol/http -I/tmp/B.x9xnQx/BUILD/firefox-67.0/netwerk/protocol/websocket -I/tmp/B.x9xnQx/BUILD/firefox-67.0/security/manager/ssl -I/tmp/B.x9xnQx/BUILD/firefox-67.0/toolkit/components/backgroundhangmonitor -I/tmp/B.x9xnQx/BUILD/firefox-67.0/toolkit/components/extensions/webrequest -I/tmp/B.x9xnQx/BUILD/firefox-67.0/toolkit/components/printingui/ipc -I/tmp/B.x9xnQx/BUILD/firefox-67.0/tools/profiler/gecko -I/tmp/B.x9xnQx/BUILD/firefox-67.0/uriloader/exthandler -I/tmp/B.x9xnQx/BUILD/firefox-67.0/uriloader/prefetch -I/tmp/B.x9xnQx/BUILD/firefox-67.0/widget/gtk -I/tmp/B.x9xnQx/BUILD/firefox-67.0/widget/headless \ 0:56.54 PMediaTransport.ipdl /tmp/B.x9xnQx/BUILD/firefox-67.0/accessible/ipc/other/PDocAccessible.ipdl /tmp/B.x9xnQx/BUILD/firefox-67.0/devtools/shared/heapsnapshot/PHeapSnapshotTempFileHelper.ipdl /tmp/B.x9xnQx/BUILD/firefox-67.0/dom/asmjscache/PAsmJSCacheEntry.ipdl /tmp/B.x9xnQx/BUILD/firefox-67.0/dom/broadcastchannel/PBroadcastChannel.ipdl /tmp/B.x9xnQx/BUILD/firefox-67.0/dom/cache/CacheTypes.ipdlh /tmp/B.x9xnQx/BUILD/firefox-67.0/dom/cache/PCache.ipdl /tmp/B.x9xnQx/BUILD/firefox-67.0/dom/cache/PCacheOp.ipdl /tmp/B.x9xnQx/BUILD/firefox-67.0/dom/cache/PCacheStorage.ipdl /tmp/B.x9xnQx/BUILD/firefox-67.0/dom/cache/PCacheStreamControl.ipdl /tmp/B.x9xnQx/BUILD/firefox-67.0/dom/clients/manager/ClientIPCTypes.ipdlh /tmp/B.x9xnQx/BUILD/firefox-67.0/dom/clients/manager/PClientHandle.ipdl /tmp/B.x9xnQx/BUILD/firefox-67.0/dom/clients/manager/PClientHandleOp.ipdl /tmp/B.x9xnQx/BUILD/firefox-67.0/dom/clients/manager/PClientManager.ipdl /tmp/B.x9xnQx/BUILD/firefox-67.0/dom/clients/manager/PClientManagerOp.ipdl /tmp/B.x9xnQx/BUILD/firefox-67.0/dom/clients/manager/PClientNavigateOp.ipdl /tmp/B.x9xnQx/BUILD/firefox-67.0/dom/clients/manager/PClientOpenWindowOp.ipdl /tmp/B.x9xnQx/BUILD/firefox-67.0/dom/clients/manager/PClientSource.ipdl /tmp/B.x9xnQx/BUILD/firefox-67.0/dom/clients/manager/PClientSourceOp.ipdl /tmp/B.x9xnQx/BUILD/firefox-67.0/dom/fetch/ChannelInfo.ipdlh /tmp/B.x9xnQx/BUILD/firefox-67.0/dom/fetch/FetchTypes.ipdlh /tmp/B.x9xnQx/BUILD/firefox-67.0/dom/file/ipc/BlobTypes.ipdlh /tmp/B.x9xnQx/BUILD/firefox-67.0/dom/file/ipc/IPCBlob.ipdlh /tmp/B.x9xnQx/BUILD/firefox-67.0/dom/file/ipc/PIPCBlobInputStream.ipdl /tmp/B.x9xnQx/BUILD/firefox-67.0/dom/file/ipc/PPendingIPCBlob.ipdl /tmp/B.x9xnQx/BUILD/firefox-67.0/dom/file/ipc/PTemporaryIPCBlob.ipdl /tmp/B.x9xnQx/BUILD/firefox-67.0/dom/filehandle/PBackgroundFileHandle.ipdl /tmp/B.x9xnQx/BUILD/firefox-67.0/dom/filehandle/PBackgroundFileRequest.ipdl /tmp/B.x9xnQx/BUILD/firefox-67.0/dom/filehandle/PBackgroundMutableFile.ipdl /tmp/B.x9xnQx/BUILD/firefox-67.0/dom/filesystem/PFileSystemParams.ipdlh /tmp/B.x9xnQx/BUILD/firefox-67.0/dom/filesystem/PFileSystemRequest.ipdl /tmp/B.x9xnQx/BUILD/firefox-67.0/dom/gamepad/ipc/GamepadEventTypes.ipdlh /tmp/B.x9xnQx/BUILD/firefox-67.0/dom/gamepad/ipc/PGamepadEventChannel.ipdl /tmp/B.x9xnQx/BUILD/firefox-67.0/dom/gamepad/ipc/PGamepadTestChannel.ipdl /tmp/B.x9xnQx/BUILD/firefox-67.0/dom/indexedDB/PBackgroundIDBCursor.ipdl /tmp/B.x9xnQx/BUILD/firefox-67.0/dom/indexedDB/PBackgroundIDBDatabase.ipdl /tmp/B.x9xnQx/BUILD/firefox-67.0/dom/indexedDB/PBackgroundIDBDatabaseFile.ipdl /tmp/B.x9xnQx/BUILD/firefox-67.0/dom/indexedDB/PBackgroundIDBDatabaseRequest.ipdl /tmp/B.x9xnQx/BUILD/firefox-67.0/dom/indexedDB/PBackgroundIDBFactory.ipdl /tmp/B.x9xnQx/BUILD/firefox-67.0/dom/indexedDB/PBackgroundIDBFactoryRequest.ipdl /tmp/B.x9xnQx/BUILD/firefox-67.0/dom/indexedDB/PBackgroundIDBRequest.ipdl /tmp/B.x9xnQx/BUILD/firefox-67.0/dom/indexedDB/PBackgroundIDBSharedTypes.ipdlh /tmp/B.x9xnQx/BUILD/firefox-67.0/dom/indexedDB/PBackgroundIDBTransaction.ipdl /tmp/B.x9xnQx/BUILD/firefox-67.0/dom/indexedDB/PBackgroundIDBVersionChangeTransaction.ipdl /tmp/B.x9xnQx/BUILD/firefox-67.0/dom/indexedDB/PBackgroundIndexedDBUtils.ipdl /tmp/B.x9xnQx/BUILD/firefox-67.0/dom/indexedDB/PIndexedDBPermissionRequest.ipdl /tmp/B.x9xnQx/BUILD/firefox-67.0/dom/ipc/DOMTypes.ipdlh /tmp/B.x9xnQx/BUILD/firefox-67.0/dom/ipc/MemoryReportTypes.ipdlh /tmp/B.x9xnQx/BUILD/firefox-67.0/dom/ipc/PBrowser.ipdl /tmp/B.x9xnQx/BUILD/firefox-67.0/dom/ipc/PBrowserBridge.ipdl /tmp/B.x9xnQx/BUILD/firefox-67.0/dom/ipc/PBrowserOrId.ipdlh /tmp/B.x9xnQx/BUILD/firefox-67.0/dom/ipc/PColorPicker.ipdl /tmp/B.x9xnQx/BUILD/firefox-67.0/dom/ipc/PContent.ipdl /tmp/B.x9xnQx/BUILD/firefox-67.0/dom/ipc/PContentPermission.ipdlh /tmp/B.x9xnQx/BUILD/firefox-67.0/dom/ipc/PContentPermissionRequest.ipdl /tmp/B.x9xnQx/BUILD/firefox-67.0/dom/ipc/PCycleCollectWithLogs.ipdl /tmp/B.x9xnQx/BUILD/firefox-67.0/dom/ipc/PFilePicker.ipdl /tmp/B.x9xnQx/BUILD/firefox-67.0/dom/ipc/PLoginReputation.ipdl /tmp/B.x9xnQx/BUILD/firefox-67.0/dom/ipc/PPluginWidget.ipdl /tmp/B.x9xnQx/BUILD/firefox-67.0/dom/ipc/PProcessHangMonitor.ipdl /tmp/B.x9xnQx/BUILD/firefox-67.0/dom/ipc/PTabContext.ipdlh /tmp/B.x9xnQx/BUILD/firefox-67.0/dom/ipc/PURLClassifier.ipdl /tmp/B.x9xnQx/BUILD/firefox-67.0/dom/ipc/PURLClassifierInfo.ipdlh /tmp/B.x9xnQx/BUILD/firefox-67.0/dom/ipc/PURLClassifierLocal.ipdl /tmp/B.x9xnQx/BUILD/firefox-67.0/dom/ipc/PWindowGlobal.ipdl /tmp/B.x9xnQx/BUILD/firefox-67.0/dom/ipc/PrefsTypes.ipdlh /tmp/B.x9xnQx/BUILD/firefox-67.0/dom/ipc/ServiceWorkerConfiguration.ipdlh /tmp/B.x9xnQx/BUILD/firefox-67.0/dom/localstorage/PBackgroundLSDatabase.ipdl /tmp/B.x9xnQx/BUILD/firefox-67.0/dom/localstorage/PBackgroundLSObserver.ipdl /tmp/B.x9xnQx/BUILD/firefox-67.0/dom/localstorage/PBackgroundLSRequest.ipdl /tmp/B.x9xnQx/BUILD/firefox-67.0/dom/localstorage/PBackgroundLSSharedTypes.ipdlh /tmp/B.x9xnQx/BUILD/firefox-67.0/dom/localstorage/PBackgroundLSSimpleRequest.ipdl /tmp/B.x9xnQx/BUILD/firefox-67.0/dom/localstorage/PBackgroundLSSnapshot.ipdl /tmp/B.x9xnQx/BUILD/firefox-67.0/dom/media/gmp/GMPTypes.ipdlh /tmp/B.x9xnQx/BUILD/firefox-67.0/dom/media/gmp/PChromiumCDM.ipdl /tmp/B.x9xnQx/BUILD/firefox-67.0/dom/media/gmp/PGMP.ipdl /tmp/B.x9xnQx/BUILD/firefox-67.0/dom/media/gmp/PGMPContent.ipdl /tmp/B.x9xnQx/BUILD/firefox-67.0/dom/media/gmp/PGMPService.ipdl /tmp/B.x9xnQx/BUILD/firefox-67.0/dom/media/gmp/PGMPStorage.ipdl /tmp/B.x9xnQx/BUILD/firefox-67.0/dom/media/gmp/PGMPTimer.ipdl /tmp/B.x9xnQx/BUILD/firefox-67.0/dom/media/gmp/PGMPVideoDecoder.ipdl /tmp/B.x9xnQx/BUILD/firefox-67.0/dom/media/gmp/PGMPVideoEncoder.ipdl /tmp/B.x9xnQx/BUILD/firefox-67.0/dom/media/ipc/PMediaDecoderParams.ipdlh /tmp/B.x9xnQx/BUILD/firefox-67.0/dom/media/ipc/PRDD.ipdl /tmp/B.x9xnQx/BUILD/firefox-67.0/dom/media/ipc/PRemoteDecoder.ipdl /tmp/B.x9xnQx/BUILD/firefox-67.0/dom/media/ipc/PRemoteDecoderManager.ipdl /tmp/B.x9xnQx/BUILD/firefox-67.0/dom/media/ipc/PVideoDecoder.ipdl /tmp/B.x9xnQx/BUILD/firefox-67.0/dom/media/ipc/PVideoDecoderManager.ipdl /tmp/B.x9xnQx/BUILD/firefox-67.0/dom/media/systemservices/PCameras.ipdl /tmp/B.x9xnQx/BUILD/firefox-67.0/dom/media/systemservices/PMedia.ipdl /tmp/B.x9xnQx/BUILD/firefox-67.0/dom/media/systemservices/PMediaSystemResourceManager.ipdl /tmp/B.x9xnQx/BUILD/firefox-67.0/dom/media/webrtc/PWebrtcGlobal.ipdl /tmp/B.x9xnQx/BUILD/firefox-67.0/dom/media/webspeech/synth/ipc/PSpeechSynthesis.ipdl /tmp/B.x9xnQx/BUILD/firefox-67.0/dom/media/webspeech/synth/ipc/PSpeechSynthesisRequest.ipdl /tmp/B.x9xnQx/BUILD/firefox-67.0/dom/messagechannel/PMessagePort.ipdl /tmp/B.x9xnQx/BUILD/firefox-67.0/dom/midi/MIDITypes.ipdlh /tmp/B.x9xnQx/BUILD/firefox-67.0/dom/midi/PMIDIManager.ipdl /tmp/B.x9xnQx/BUILD/firefox-67.0/dom/midi/PMIDIPort.ipdl /tmp/B.x9xnQx/BUILD/firefox-67.0/dom/network/PTCPServerSocket.ipdl /tmp/B.x9xnQx/BUILD/firefox-67.0/dom/network/PTCPSocket.ipdl /tmp/B.x9xnQx/BUILD/firefox-67.0/dom/network/PUDPSocket.ipdl /tmp/B.x9xnQx/BUILD/firefox-67.0/dom/payments/ipc/PPaymentRequest.ipdl /tmp/B.x9xnQx/BUILD/firefox-67.0/dom/plugins/ipc/PBrowserStream.ipdl /tmp/B.x9xnQx/BUILD/firefox-67.0/dom/plugins/ipc/PFunctionBroker.ipdl /tmp/B.x9xnQx/BUILD/firefox-67.0/dom/plugins/ipc/PPluginBackgroundDestroyer.ipdl /tmp/B.x9xnQx/BUILD/firefox-67.0/dom/plugins/ipc/PPluginInstance.ipdl /tmp/B.x9xnQx/BUILD/firefox-67.0/dom/plugins/ipc/PPluginModule.ipdl /tmp/B.x9xnQx/BUILD/firefox-67.0/dom/plugins/ipc/PPluginScriptableObject.ipdl /tmp/B.x9xnQx/BUILD/firefox-67.0/dom/plugins/ipc/PPluginSurface.ipdl /tmp/B.x9xnQx/BUILD/firefox-67.0/dom/plugins/ipc/PStreamNotify.ipdl /tmp/B.x9xnQx/BUILD/firefox-67.0/dom/plugins/ipc/PluginTypes.ipdlh /tmp/B.x9xnQx/BUILD/firefox-67.0/dom/presentation/ipc/PPresentation.ipdl /tmp/B.x9xnQx/BUILD/firefox-67.0/dom/presentation/ipc/PPresentationBuilder.ipdl /tmp/B.x9xnQx/BUILD/firefox-67.0/dom/presentation/ipc/PPresentationRequest.ipdl /tmp/B.x9xnQx/BUILD/firefox-67.0/dom/quota/PQuota.ipdl /tmp/B.x9xnQx/BUILD/firefox-67.0/dom/quota/PQuotaRequest.ipdl /tmp/B.x9xnQx/BUILD/firefox-67.0/dom/quota/PQuotaUsageRequest.ipdl /tmp/B.x9xnQx/BUILD/firefox-67.0/dom/reporting/PEndpointForReport.ipdl /tmp/B.x9xnQx/BUILD/firefox-67.0/dom/serviceworkers/IPCServiceWorkerDescriptor.ipdlh /tmp/B.x9xnQx/BUILD/firefox-67.0/dom/serviceworkers/IPCServiceWorkerRegistrationDescriptor.ipdlh /tmp/B.x9xnQx/BUILD/firefox-67.0/dom/serviceworkers/PServiceWorker.ipdl /tmp/B.x9xnQx/BUILD/firefox-67.0/dom/serviceworkers/PServiceWorkerContainer.ipdl /tmp/B.x9xnQx/BUILD/firefox-67.0/dom/serviceworkers/PServiceWorkerManager.ipdl /tmp/B.x9xnQx/BUILD/firefox-67.0/dom/serviceworkers/PServiceWorkerRegistration.ipdl /tmp/B.x9xnQx/BUILD/firefox-67.0/dom/serviceworkers/PServiceWorkerUpdater.ipdl /tmp/B.x9xnQx/BUILD/firefox-67.0/dom/serviceworkers/ServiceWorkerRegistrarTypes.ipdlh /tmp/B.x9xnQx/BUILD/firefox-67.0/dom/simpledb/PBackgroundSDBConnection.ipdl /tmp/B.x9xnQx/BUILD/firefox-67.0/dom/simpledb/PBackgroundSDBRequest.ipdl /tmp/B.x9xnQx/BUILD/firefox-67.0/dom/storage/PBackgroundLocalStorageCache.ipdl /tmp/B.x9xnQx/BUILD/firefox-67.0/dom/storage/PBackgroundStorage.ipdl /tmp/B.x9xnQx/BUILD/firefox-67.0/dom/storage/PSessionStorageObserver.ipdl /tmp/B.x9xnQx/BUILD/firefox-67.0/dom/webauthn/PWebAuthnTransaction.ipdl /tmp/B.x9xnQx/BUILD/firefox-67.0/dom/webbrowserpersist/PWebBrowserPersistDocument.ipdl /tmp/B.x9xnQx/BUILD/firefox-67.0/dom/webbrowserpersist/PWebBrowserPersistResources.ipdl /tmp/B.x9xnQx/BUILD/firefox-67.0/dom/webbrowserpersist/PWebBrowserPersistSerialize.ipdl /tmp/B.x9xnQx/BUILD/firefox-67.0/dom/workers/remoteworkers/PRemoteWorker.ipdl /tmp/B.x9xnQx/BUILD/firefox-67.0/dom/workers/remoteworkers/PRemoteWorkerService.ipdl /tmp/B.x9xnQx/BUILD/firefox-67.0/dom/workers/remoteworkers/RemoteWorkerTypes.ipdlh /tmp/B.x9xnQx/BUILD/firefox-67.0/dom/workers/sharedworkers/PSharedWorker.ipdl /tmp/B.x9xnQx/BUILD/firefox-67.0/extensions/spellcheck/hunspell/glue/PRemoteSpellcheckEngine.ipdl /tmp/B.x9xnQx/BUILD/firefox-67.0/gfx/ipc/GraphicsMessages.ipdlh /tmp/B.x9xnQx/BUILD/firefox-67.0/gfx/ipc/PGPU.ipdl /tmp/B.x9xnQx/BUILD/firefox-67.0/gfx/ipc/PVsyncBridge.ipdl /tmp/B.x9xnQx/BUILD/firefox-67.0/gfx/layers/ipc/LayersMessages.ipdlh /tmp/B.x9xnQx/BUILD/firefox-67.0/gfx/layers/ipc/LayersSurfaces.ipdlh /tmp/B.x9xnQx/BUILD/firefox-67.0/gfx/layers/ipc/PAPZ.ipdl /tmp/B.x9xnQx/BUILD/firefox-67.0/gfx/layers/ipc/PAPZCTreeManager.ipdl /tmp/B.x9xnQx/BUILD/firefox-67.0/gfx/layers/ipc/PAPZInputBridge.ipdl /tmp/B.x9xnQx/BUILD/firefox-67.0/gfx/layers/ipc/PCompositorBridge.ipdl /tmp/B.x9xnQx/BUILD/firefox-67.0/gfx/layers/ipc/PCompositorManager.ipdl /tmp/B.x9xnQx/BUILD/firefox-67.0/gfx/layers/ipc/PImageBridge.ipdl /tmp/B.x9xnQx/BUILD/firefox-67.0/gfx/layers/ipc/PLayerTransaction.ipdl /tmp/B.x9xnQx/BUILD/firefox-67.0/gfx/layers/ipc/PTexture.ipdl /tmp/B.x9xnQx/BUILD/firefox-67.0/gfx/layers/ipc/PUiCompositorController.ipdl /tmp/B.x9xnQx/BUILD/firefox-67.0/gfx/layers/ipc/PVideoBridge.ipdl /tmp/B.x9xnQx/BUILD/firefox-67.0/gfx/layers/ipc/PWebRenderBridge.ipdl /tmp/B.x9xnQx/BUILD/firefox-67.0/gfx/layers/ipc/WebRenderMessages.ipdlh /tmp/B.x9xnQx/BUILD/firefox-67.0/gfx/vr/ipc/PVR.ipdl /tmp/B.x9xnQx/BUILD/firefox-67.0/gfx/vr/ipc/PVRGPU.ipdl /tmp/B.x9xnQx/BUILD/firefox-67.0/gfx/vr/ipc/PVRLayer.ipdl /tmp/B.x9xnQx/BUILD/firefox-67.0/gfx/vr/ipc/PVRManager.ipdl /tmp/B.x9xnQx/BUILD/firefox-67.0/hal/sandbox/PHal.ipdl /tmp/B.x9xnQx/BUILD/firefox-67.0/ipc/glue/IPCStream.ipdlh /tmp/B.x9xnQx/BUILD/firefox-67.0/ipc/glue/InputStreamParams.ipdlh /tmp/B.x9xnQx/BUILD/firefox-67.0/ipc/glue/PBackground.ipdl /tmp/B.x9xnQx/BUILD/firefox-67.0/ipc/glue/PBackgroundSharedTypes.ipdlh /tmp/B.x9xnQx/BUILD/firefox-67.0/ipc/glue/PBackgroundTest.ipdl /tmp/B.x9xnQx/BUILD/firefox-67.0/ipc/glue/PChildToParentStream.ipdl /tmp/B.x9xnQx/BUILD/firefox-67.0/ipc/glue/PFileDescriptorSet.ipdl /tmp/B.x9xnQx/BUILD/firefox-67.0/ipc/glue/PInProcess.ipdl /tmp/B.x9xnQx/BUILD/firefox-67.0/ipc/glue/PParentToChildStream.ipdl /tmp/B.x9xnQx/BUILD/firefox-67.0/ipc/glue/ProtocolTypes.ipdlh /tmp/B.x9xnQx/BUILD/firefox-67.0/ipc/glue/URIParams.ipdlh /tmp/B.x9xnQx/BUILD/firefox-67.0/ipc/testshell/PTestShell.ipdl /tmp/B.x9xnQx/BUILD/firefox-67.0/ipc/testshell/PTestShellCommand.ipdl /tmp/B.x9xnQx/BUILD/firefox-67.0/js/ipc/JavaScriptTypes.ipdlh /tmp/B.x9xnQx/BUILD/firefox-67.0/js/ipc/PJavaScript.ipdl /tmp/B.x9xnQx/BUILD/firefox-67.0/js/xpconnect/loader/PScriptCache.ipdl /tmp/B.x9xnQx/BUILD/firefox-67.0/layout/base/PresState.ipdlh /tmp/B.x9xnQx/BUILD/firefox-67.0/layout/ipc/PVsync.ipdl /tmp/B.x9xnQx/BUILD/firefox-67.0/layout/printing/ipc/PRemotePrintJob.ipdl /tmp/B.x9xnQx/BUILD/firefox-67.0/media/mtransport/ipc/PStunAddrsRequest.ipdl /tmp/B.x9xnQx/BUILD/firefox-67.0/media/mtransport/ipc/PWebrtcProxyChannel.ipdl /tmp/B.x9xnQx/BUILD/firefox-67.0/netwerk/cookie/PCookieService.ipdl /tmp/B.x9xnQx/BUILD/firefox-67.0/netwerk/dns/PDNSRequest.ipdl /tmp/B.x9xnQx/BUILD/firefox-67.0/netwerk/dns/PDNSRequestParams.ipdlh /tmp/B.x9xnQx/BUILD/firefox-67.0/netwerk/ipc/NeckoChannelParams.ipdlh /tmp/B.x9xnQx/BUILD/firefox-67.0/netwerk/ipc/PChannelDiverter.ipdl /tmp/B.x9xnQx/BUILD/firefox-67.0/netwerk/ipc/PDataChannel.ipdl /tmp/B.x9xnQx/BUILD/firefox-67.0/netwerk/ipc/PFileChannel.ipdl /tmp/B.x9xnQx/BUILD/firefox-67.0/netwerk/ipc/PNecko.ipdl /tmp/B.x9xnQx/BUILD/firefox-67.0/netwerk/ipc/PSimpleChannel.ipdl /tmp/B.x9xnQx/BUILD/firefox-67.0/netwerk/ipc/PSocketProcess.ipdl /tmp/B.x9xnQx/BUILD/firefox-67.0/netwerk/ipc/PSocketProcessBridge.ipdl /tmp/B.x9xnQx/BUILD/firefox-67.0/netwerk/protocol/ftp/PFTPChannel.ipdl /tmp/B.x9xnQx/BUILD/firefox-67.0/netwerk/protocol/http/PAltDataOutputStream.ipdl /tmp/B.x9xnQx/BUILD/firefox-67.0/netwerk/protocol/http/PClassifierDummyChannel.ipdl /tmp/B.x9xnQx/BUILD/firefox-67.0/netwerk/protocol/http/PHttpBackgroundChannel.ipdl /tmp/B.x9xnQx/BUILD/firefox-67.0/netwerk/protocol/http/PHttpChannel.ipdl /tmp/B.x9xnQx/BUILD/firefox-67.0/netwerk/protocol/websocket/PTransportProvider.ipdl /tmp/B.x9xnQx/BUILD/firefox-67.0/netwerk/protocol/websocket/PWebSocket.ipdl /tmp/B.x9xnQx/BUILD/firefox-67.0/netwerk/protocol/websocket/PWebSocketEventListener.ipdl /tmp/B.x9xnQx/BUILD/firefox-67.0/security/manager/ssl/PPSMContentDownloader.ipdl /tmp/B.x9xnQx/BUILD/firefox-67.0/toolkit/components/backgroundhangmonitor/HangTypes.ipdlh /tmp/B.x9xnQx/BUILD/firefox-67.0/toolkit/components/extensions/webrequest/PStreamFilter.ipdl /tmp/B.x9xnQx/BUILD/firefox-67.0/toolkit/components/printingui/ipc/PPrintProgressDialog.ipdl /tmp/B.x9xnQx/BUILD/firefox-67.0/toolkit/components/printingui/ipc/PPrintSettingsDialog.ipdl /tmp/B.x9xnQx/BUILD/firefox-67.0/toolkit/components/printingui/ipc/PPrinting.ipdl /tmp/B.x9xnQx/BUILD/firefox-67.0/toolkit/components/printingui/ipc/PPrintingTypes.ipdlh /tmp/B.x9xnQx/BUILD/firefox-67.0/tools/profiler/gecko/PProfiler.ipdl /tmp/B.x9xnQx/BUILD/firefox-67.0/tools/profiler/gecko/ProfilerTypes.ipdlh /tmp/B.x9xnQx/BUILD/firefox-67.0/uriloader/exthandler/PExternalHelperApp.ipdl /tmp/B.x9xnQx/BUILD/firefox-67.0/uriloader/exthandler/PHandlerService.ipdl /tmp/B.x9xnQx/BUILD/firefox-67.0/uriloader/prefetch/POfflineCacheUpdate.ipdl /tmp/B.x9xnQx/BUILD/firefox-67.0/widget/gtk/PCompositorWidget.ipdl /tmp/B.x9xnQx/BUILD/firefox-67.0/widget/gtk/PlatformWidgetTypes.ipdlh /tmp/B.x9xnQx/BUILD/firefox-67.0/widget/headless/HeadlessWidgetTypes.ipdlh 0:56.54 gmake[4]: Entering directory '/tmp/B.x9xnQx/BUILD/firefox-67.0/obj-x86_64/layout/style' 0:56.54 layout/style/ServoCSSPropList.py.stub 0:56.54 /tmp/B.x9xnQx/BUILD/firefox-67.0/obj-x86_64/_virtualenvs/init/bin/python -m mozbuild.action.file_generate /tmp/B.x9xnQx/BUILD/firefox-67.0/layout/style/GenerateServoCSSPropList.py generate_data ServoCSSPropList.py .deps/ServoCSSPropList.py.pp .deps/ServoCSSPropList.py.stub /tmp/B.x9xnQx/BUILD/firefox-67.0/layout/style/ServoCSSPropList.mako.py 0:56.54 js/src/js-config.h.stub 0:56.54 /tmp/B.x9xnQx/BUILD/firefox-67.0/obj-x86_64/_virtualenvs/init/bin/python -m mozbuild.action.file_generate /tmp/B.x9xnQx/BUILD/firefox-67.0/python/mozbuild/mozbuild/action/process_define_files.py process_define_file js-config.h .deps/js-config.h.pp .deps/js-config.h.stub /tmp/B.x9xnQx/BUILD/firefox-67.0/js/src/js-config.h.in 0:56.54 xpcom/xpcom-private.h.stub 0:56.54 /tmp/B.x9xnQx/BUILD/firefox-67.0/obj-x86_64/_virtualenvs/init/bin/python -m mozbuild.action.file_generate /tmp/B.x9xnQx/BUILD/firefox-67.0/python/mozbuild/mozbuild/action/process_define_files.py process_define_file xpcom-private.h .deps/xpcom-private.h.pp .deps/xpcom-private.h.stub /tmp/B.x9xnQx/BUILD/firefox-67.0/xpcom/xpcom-private.h.in 0:56.54 security/apps/addons-public.inc.stub 0:56.55 /tmp/B.x9xnQx/BUILD/firefox-67.0/obj-x86_64/_virtualenvs/init/bin/python -m mozbuild.action.file_generate /tmp/B.x9xnQx/BUILD/firefox-67.0/security/apps/gen_cert_header.py addonsPublicRoot addons-public.inc .deps/addons-public.inc.pp .deps/addons-public.inc.stub /tmp/B.x9xnQx/BUILD/firefox-67.0/security/apps/addons-public.crt 0:56.65 gmake[4]: Leaving directory '/tmp/B.x9xnQx/BUILD/firefox-67.0/obj-x86_64/build' 0:56.66 gmake[4]: Entering directory '/tmp/B.x9xnQx/BUILD/firefox-67.0/obj-x86_64/dom/encoding' 0:56.66 dom/encoding/domainsfallbacks.properties.h.stub 0:56.66 /tmp/B.x9xnQx/BUILD/firefox-67.0/obj-x86_64/_virtualenvs/init/bin/python -m mozbuild.action.file_generate /tmp/B.x9xnQx/BUILD/firefox-67.0/dom/encoding/encodings2arrays.py main domainsfallbacks.properties.h .deps/domainsfallbacks.properties.h.pp .deps/domainsfallbacks.properties.h.stub /tmp/B.x9xnQx/BUILD/firefox-67.0/dom/encoding/domainsfallbacks.properties 0:56.67 media/libdav1d/16bd_film_grain_tmpl.c.stub 0:56.67 /tmp/B.x9xnQx/BUILD/firefox-67.0/obj-x86_64/_virtualenvs/init/bin/python -m mozbuild.action.file_generate /tmp/B.x9xnQx/BUILD/firefox-67.0/media/libdav1d/generate_source.py add_define 16bd_film_grain_tmpl.c .deps/16bd_film_grain_tmpl.c.pp .deps/16bd_film_grain_tmpl.c.stub /tmp/B.x9xnQx/BUILD/firefox-67.0/third_party/dav1d/src/film_grain_tmpl.c BITDEPTH 16 0:56.68 js/src/selfhosted.out.h.stub 0:56.69 /tmp/B.x9xnQx/BUILD/firefox-67.0/obj-x86_64/_virtualenvs/init/bin/python -m mozbuild.action.file_generate /tmp/B.x9xnQx/BUILD/firefox-67.0/js/src/builtin/embedjs.py generate_selfhosted selfhosted.out.h .deps/selfhosted.out.h.pp .deps/selfhosted.out.h.stub /tmp/B.x9xnQx/BUILD/firefox-67.0/js/src/js.msg /tmp/B.x9xnQx/BUILD/firefox-67.0/js/src/builtin/TypedObjectConstants.h /tmp/B.x9xnQx/BUILD/firefox-67.0/js/src/builtin/SelfHostingDefines.h /tmp/B.x9xnQx/BUILD/firefox-67.0/js/src/builtin/Utilities.js /tmp/B.x9xnQx/BUILD/firefox-67.0/js/src/builtin/Array.js /tmp/B.x9xnQx/BUILD/firefox-67.0/js/src/builtin/AsyncFunction.js /tmp/B.x9xnQx/BUILD/firefox-67.0/js/src/builtin/AsyncIteration.js /tmp/B.x9xnQx/BUILD/firefox-67.0/js/src/builtin/Classes.js /tmp/B.x9xnQx/BUILD/firefox-67.0/js/src/builtin/Date.js /tmp/B.x9xnQx/BUILD/firefox-67.0/js/src/builtin/Error.js /tmp/B.x9xnQx/BUILD/firefox-67.0/js/src/builtin/Function.js /tmp/B.x9xnQx/BUILD/firefox-67.0/js/src/builtin/Generator.js /tmp/B.x9xnQx/BUILD/firefox-67.0/js/src/builtin/intl/Collator.js /tmp/B.x9xnQx/BUILD/firefox-67.0/js/src/builtin/intl/CommonFunctions.js /tmp/B.x9xnQx/BUILD/firefox-67.0/js/src/builtin/intl/CurrencyDataGenerated.js /tmp/B.x9xnQx/BUILD/firefox-67.0/js/src/builtin/intl/DateTimeFormat.js /tmp/B.x9xnQx/BUILD/firefox-67.0/js/src/builtin/intl/IntlObject.js /tmp/B.x9xnQx/BUILD/firefox-67.0/js/src/builtin/intl/LangTagMappingsGenerated.js /tmp/B.x9xnQx/BUILD/firefox-67.0/js/src/builtin/intl/NumberFormat.js /tmp/B.x9xnQx/BUILD/firefox-67.0/js/src/builtin/intl/PluralRules.js /tmp/B.x9xnQx/BUILD/firefox-67.0/js/src/builtin/intl/RelativeTimeFormat.js /tmp/B.x9xnQx/BUILD/firefox-67.0/js/src/builtin/Iterator.js /tmp/B.x9xnQx/BUILD/firefox-67.0/js/src/builtin/Map.js /tmp/B.x9xnQx/BUILD/firefox-67.0/js/src/builtin/Module.js /tmp/B.x9xnQx/BUILD/firefox-67.0/js/src/builtin/Number.js /tmp/B.x9xnQx/BUILD/firefox-67.0/js/src/builtin/Object.js /tmp/B.x9xnQx/BUILD/firefox-67.0/js/src/builtin/Promise.js /tmp/B.x9xnQx/BUILD/firefox-67.0/js/src/builtin/Reflect.js /tmp/B.x9xnQx/BUILD/firefox-67.0/js/src/builtin/RegExp.js /tmp/B.x9xnQx/BUILD/firefox-67.0/js/src/builtin/RegExpGlobalReplaceOpt.h.js /tmp/B.x9xnQx/BUILD/firefox-67.0/js/src/builtin/RegExpLocalReplaceOpt.h.js /tmp/B.x9xnQx/BUILD/firefox-67.0/js/src/builtin/String.js /tmp/B.x9xnQx/BUILD/firefox-67.0/js/src/builtin/Set.js /tmp/B.x9xnQx/BUILD/firefox-67.0/js/src/builtin/Sorting.js /tmp/B.x9xnQx/BUILD/firefox-67.0/js/src/builtin/TypedArray.js /tmp/B.x9xnQx/BUILD/firefox-67.0/js/src/builtin/TypedObject.js /tmp/B.x9xnQx/BUILD/firefox-67.0/js/src/builtin/WeakMap.js /tmp/B.x9xnQx/BUILD/firefox-67.0/js/src/builtin/WeakSet.js 0:56.69 ../config/nsinstall -R -m 644 'xpcom-config.h' '../dist/include' 0:56.69 gmake[4]: Leaving directory '/tmp/B.x9xnQx/BUILD/firefox-67.0/obj-x86_64/xpcom' 0:56.70 gmake[4]: Entering directory '/tmp/B.x9xnQx/BUILD/firefox-67.0/obj-x86_64/toolkit/crashreporter' 0:56.70 toolkit/crashreporter/CrashAnnotations.h.stub 0:56.70 /tmp/B.x9xnQx/BUILD/firefox-67.0/obj-x86_64/_virtualenvs/init/bin/python -m mozbuild.action.file_generate /tmp/B.x9xnQx/BUILD/firefox-67.0/toolkit/crashreporter/generate_crash_reporter_sources.py emit_header CrashAnnotations.h .deps/CrashAnnotations.h.pp .deps/CrashAnnotations.h.stub /tmp/B.x9xnQx/BUILD/firefox-67.0/toolkit/crashreporter/CrashAnnotations.h.in /tmp/B.x9xnQx/BUILD/firefox-67.0/toolkit/crashreporter/CrashAnnotations.yaml 0:56.70 security/apps/addons-public-intermediate.inc.stub 0:56.70 /tmp/B.x9xnQx/BUILD/firefox-67.0/obj-x86_64/_virtualenvs/init/bin/python -m mozbuild.action.file_generate /tmp/B.x9xnQx/BUILD/firefox-67.0/security/apps/gen_cert_header.py addonsPublicIntermediate addons-public-intermediate.inc .deps/addons-public-intermediate.inc.pp .deps/addons-public-intermediate.inc.stub /tmp/B.x9xnQx/BUILD/firefox-67.0/security/apps/addons-public-intermediate.crt 0:56.81 dom/encoding/labelsencodings.properties.h.stub 0:56.81 /tmp/B.x9xnQx/BUILD/firefox-67.0/obj-x86_64/_virtualenvs/init/bin/python -m mozbuild.action.file_generate /tmp/B.x9xnQx/BUILD/firefox-67.0/dom/encoding/encodings2arrays.py main labelsencodings.properties.h .deps/labelsencodings.properties.h.pp .deps/labelsencodings.properties.h.stub /tmp/B.x9xnQx/BUILD/firefox-67.0/dom/encoding/labelsencodings.properties 0:56.82 media/libdav1d/16bd_ipred_prepare_tmpl.c.stub 0:56.82 /tmp/B.x9xnQx/BUILD/firefox-67.0/obj-x86_64/_virtualenvs/init/bin/python -m mozbuild.action.file_generate /tmp/B.x9xnQx/BUILD/firefox-67.0/media/libdav1d/generate_source.py add_define 16bd_ipred_prepare_tmpl.c .deps/16bd_ipred_prepare_tmpl.c.pp .deps/16bd_ipred_prepare_tmpl.c.stub /tmp/B.x9xnQx/BUILD/firefox-67.0/third_party/dav1d/src/ipred_prepare_tmpl.c BITDEPTH 16 0:56.86 security/apps/addons-stage.inc.stub 0:56.86 /tmp/B.x9xnQx/BUILD/firefox-67.0/obj-x86_64/_virtualenvs/init/bin/python -m mozbuild.action.file_generate /tmp/B.x9xnQx/BUILD/firefox-67.0/security/apps/gen_cert_header.py addonsStageRoot addons-stage.inc .deps/addons-stage.inc.pp .deps/addons-stage.inc.stub /tmp/B.x9xnQx/BUILD/firefox-67.0/security/apps/addons-stage.crt 0:56.88 /usr/bin/x86_64-pld-linux-g++ -E -o self-hosting-preprocessed.pp -U_FORTIFY_SOURCE -D_FORTIFY_SOURCE=2 -fstack-protector-strong -DHAVE_POSIX_FALLOCATE=1 -DHAVE_64BIT_BUILD=1 -DXP_UNIX=1 -DHAVE_THREAD_TLS_KEYWORD=1 -DMOZ_AV1=1 -DMOZ_SYSTEM_SQLITE=1 -DJS_PUNBOX64=1 -DNO_NSPR_10_SUPPORT=1 -DHAVE_LIBPNG=1 -DMOZ_SERVICES_HEALTHREPORT=1 -DHAVE_STDINT_H=1 -DHAVE_POSIX_MEMALIGN=1 -DMOZ_BLOCK_PROFILE_DOWNGRADE=1 -DHAVE___CXA_DEMANGLE=1 -DMOZ_XUL=1 -DUSE_SKIA=1 -DEXPOSE_INTL_API=1 -DHAVE_SYS_QUEUE_H=1 -DHAVE_MEMMEM=1 -DMALLOC_H=<malloc.h> -DMOZ_MACBUNDLE_ID=org.pld-linux.firefox -DSTDC_HEADERS=1 -DHAVE__UNWIND_BACKTRACE=1 -DGLIB_VERSION_MAX_ALLOWED=GLIB_VERSION_2_32 -DHAVE_MALLOC_H=1 -DSTATIC_JS_API=1 -DHAVE_FT_GLYPHSLOT_EMBOLDEN=1 -DMOZ_FFMPEG=1 -DMOZ_USER_DIR=".mozilla" -DTRIMMED=1 -DHAVE_MALLOC_USABLE_SIZE=1 -DMOZ_FFVPX=1 -DJS_CODEGEN_X64=1 -D_REENTRANT=1 -DHAVE_ALLOCA_H=1 -DU_USING_ICU_NAMESPACE=0 -DNS_PRINT_PREVIEW=1 -DMOZ_LIBAV_FFT=1 -DHAVE_SYSCALL=1 -DHAVE_FT_LOAD_SFNT_TABLE=1 -DMOZ_DLL_SUFFIX=".so" -DNS_PRINTING=1 -DMOZ_MEMORY=1 -DMOZ_ENABLE_DBUS=1 -DMOZ_ACCESSIBILITY_ATK=1 -DMOZ_WEBSPEECH=1 -DHAVE_STRNDUP=1 -DRELEASE_OR_BETA=1 -DMOZ_ALSA=1 -DCROSS_COMPILE= -DMOZ_SANDBOX=1 -DTARGET_XPCOM_ABI="x86_64-gcc3" -DMOZILLA_UAVERSION="67.0" -DMOZ_FMP4=1 -DMOZ_BUILD_WEBRENDER=1 -DHAVE_GETOPT_H=1 -DMOZ_APP_UA_NAME="" -DMOZ_SYSTEM_ICU=1 -DMOZ_SCTP=1 -DMOZ_APP_UA_VERSION="67.0" -DMOZ_TREE_CAIRO=1 -DMOZ_DAV1D_ASM=1 -DBROWSER_CHROME_URL_QUOTED="chrome://browser/content/browser.xul" -DMOZ_GLUE_IN_PROGRAM=1 -DVA_COPY=va_copy -DHAVE_MEMALIGN=1 -DHAVE_VPX_VPX_DECODER_H=1 -DMOZ_X11=1 -DHAVE_LOCALECONV=1 -DMOZ_STATIC_JS=1 -DMOZ_LOGGING=1 -DMOZILLA_VERSION_U=67.0 -DHAVE_CPUID_H=1 -DHAVE_NL_TYPES_H=1 -DMOZ_RAW=1 -DHAVE_DLADDR=1 -DMOZ_WEBSPEECH_TEST_BACKEND=1 -DMOZ_PULSEAUDIO=1 -DGL_PROVIDER_EGL=1 -DGLIB_VERSION_MIN_REQUIRED=GLIB_VERSION_2_26 -DHAVE_LSTAT64=1 -DHAVE_SYS_QUOTA_H=1 -DMOZ_WEBRTC_ASSERT_ALWAYS=1 -DMOZ_BUILD_APP=browser -DMOZ_ENABLE_SIGNMAR=1 -DATK_MINOR_VERSION=32 -DMOZ_PEERCONNECTION=1 -DMOZ_WEBM_ENCODER=1 -DMOZ_PHOENIX=1 -DMOZ_WIDGET_GTK=1 -DHAVE_CLOCK_MONOTONIC=1 -DMOZILLA_VERSION="67.0" -DMOZ_OFFICIAL_BRANDING=1 -DHAVE_VISIBILITY_ATTRIBUTE=1 -DACCESSIBILITY=1 -DHAVE_INTTYPES_H=1 -DMOZ_SRTP=1 -DMOZ_WEBRTC_SIGNALING=1 -DHAVE_PTHREAD_H=1 -DHAVE_UNISTD_H=1 -DBROWSER_CHROME_URL=chrome://browser/content/browser.xul -DMOZ_VORBIS=1 -DNDEBUG=1 -DMOZ_ENABLE_SKIA=1 -DHAVE_TRUNCATE64=1 -DHAVE_VISIBILITY_HIDDEN_ATTRIBUTE=1 -DHAVE_STAT64=1 -DMOZ_CONTENT_SANDBOX=1 -DHAVE_LINUX_IF_ADDR_H=1 -DMOZ_HAS_REMOTE=1 -DHAVE_SETPRIORITY=1 -DHAVE_LINUX_PERF_EVENT_H=1 -DHAVE_DLOPEN=1 -DMOZ_DLL_PREFIX="lib" -DENABLE_INTL_API=1 -DHAVE_GMTIME_R=1 -DJS_DEFAULT_JITREPORT_GRANULARITY=3 -DMOZ_DISTRIBUTION_ID="org.pld-linux" -DHAVE_FT_BITMAP_SIZE_Y_PPEM=1 -DFORCE_PR_LOG=1 -DATK_REV_VERSION=0 -DMOZ_SAMPLE_TYPE_FLOAT32=1 -DATK_MAJOR_VERSION=2 -DHAVE_FONTCONFIG_FCFREETYPE_H=1 -DHAVE_POSIX_FADVISE=1 -DHAVE_SYS_TYPES_H=1 -DGDK_VERSION_MAX_ALLOWED=GDK_VERSION_3_4 -DMOZ_ENABLE_STARTUP_NOTIFICATION=1 -DBUILD_CTYPES=1 -DMOZ_GMP_SANDBOX=1 -DHAVE_LINUX_RTNETLINK_H=1 -DHAVE_VALLOC=1 -DMOZ_DATA_REPORTING=1 -DHAVE_RES_NINIT=1 -DMOZ_DEDICATED_PROFILES=1 -DHAVE_MALLINFO=1 -DXP_LINUX=1 -DHAVE_DIRENT_H=1 -DHAVE_LINUX_QUOTA_H=1 -DHAVE_VA_COPY=1 -DMOZ_BUNDLED_FONTS=1 -DMOZ_INSTRUMENT_EVENT_LOOP=1 -DHAVE_NETINET_IN_H=1 -DENABLE_SYSTEM_EXTENSION_DIRS=1 -DFUNCPROTO=15 -DHAVE_STRERROR=1 -DMOZ_WAYLAND=1 -DMOZ_PROFILER_MEMORY=1 -DHAVE_BYTESWAP_H=1 -DHAVE_LCHOWN=1 -DMOZ_UPDATE_CHANNEL=default -DMOZ_PLACES=1 -DMOZ_WEBRTC=1 -DJS_64BIT=1 -DMOZ_GECKO_PROFILER=1 -DMALLOC_USABLE_SIZE_CONST_PTR= -DHAVE_LOCALTIME_R=1 -DHAVE_VA_LIST_AS_ARRAY=1 self-hosting-cpp-input.cpp 0:56.90 ../../config/nsinstall -R -m 644 'js-config.h' '../../dist/include' 0:56.90 gmake[4]: Leaving directory '/tmp/B.x9xnQx/BUILD/firefox-67.0/obj-x86_64/js/src' 0:56.90 gmake[4]: Entering directory '/tmp/B.x9xnQx/BUILD/firefox-67.0/obj-x86_64/toolkit/locales' 0:56.90 gmake[4]: Nothing to be done for 'export'. 0:56.90 gmake[4]: Leaving directory '/tmp/B.x9xnQx/BUILD/firefox-67.0/obj-x86_64/toolkit/locales' 0:56.91 gmake[4]: Entering directory '/tmp/B.x9xnQx/BUILD/firefox-67.0/obj-x86_64/devtools/client/debugger/new/src' 0:56.91 devtools/client/debugger/new/src/node.stub.stub 0:56.91 /tmp/B.x9xnQx/BUILD/firefox-67.0/obj-x86_64/_virtualenvs/init/bin/python -m mozbuild.action.file_generate /tmp/B.x9xnQx/BUILD/firefox-67.0/python/mozbuild/mozbuild/action/node.py generate node.stub .deps/node.stub.pp .deps/node.stub.stub /tmp/B.x9xnQx/BUILD/firefox-67.0/devtools/client/shared/build/build.js /tmp/B.x9xnQx/BUILD/firefox-67.0/devtools/client/debugger/new/src/main.development.js /tmp/B.x9xnQx/BUILD/firefox-67.0/devtools/client/debugger/new/src/main.js /tmp/B.x9xnQx/BUILD/firefox-67.0/devtools/client/debugger/new/src/vendors.js 0:56.95 dom/encoding/localesfallbacks.properties.h.stub 0:56.95 /tmp/B.x9xnQx/BUILD/firefox-67.0/obj-x86_64/_virtualenvs/init/bin/python -m mozbuild.action.file_generate /tmp/B.x9xnQx/BUILD/firefox-67.0/dom/encoding/encodings2arrays.py main localesfallbacks.properties.h .deps/localesfallbacks.properties.h.pp .deps/localesfallbacks.properties.h.stub /tmp/B.x9xnQx/BUILD/firefox-67.0/dom/encoding/localesfallbacks.properties 0:56.98 media/libdav1d/16bd_ipred_tmpl.c.stub 0:56.98 /tmp/B.x9xnQx/BUILD/firefox-67.0/obj-x86_64/_virtualenvs/init/bin/python -m mozbuild.action.file_generate /tmp/B.x9xnQx/BUILD/firefox-67.0/media/libdav1d/generate_source.py add_define 16bd_ipred_tmpl.c .deps/16bd_ipred_tmpl.c.pp .deps/16bd_ipred_tmpl.c.stub /tmp/B.x9xnQx/BUILD/firefox-67.0/third_party/dav1d/src/ipred_tmpl.c BITDEPTH 16 0:57.00 ../../config/nsinstall -R -m 644 'CrashAnnotations.h' '../../dist/include' 0:57.00 gmake[4]: Leaving directory '/tmp/B.x9xnQx/BUILD/firefox-67.0/obj-x86_64/toolkit/crashreporter' 0:57.01 gmake[4]: Entering directory '/tmp/B.x9xnQx/BUILD/firefox-67.0/obj-x86_64/toolkit/library' 0:57.01 gmake[4]: Nothing to be done for 'export'. 0:57.01 gmake[4]: Leaving directory '/tmp/B.x9xnQx/BUILD/firefox-67.0/obj-x86_64/toolkit/library' 0:57.01 security/apps/privileged-package-root.inc.stub 0:57.01 /tmp/B.x9xnQx/BUILD/firefox-67.0/obj-x86_64/_virtualenvs/init/bin/python -m mozbuild.action.file_generate /tmp/B.x9xnQx/BUILD/firefox-67.0/security/apps/gen_cert_header.py privilegedPackageRoot privileged-package-root.inc .deps/privileged-package-root.inc.pp .deps/privileged-package-root.inc.stub /tmp/B.x9xnQx/BUILD/firefox-67.0/security/apps/privileged-package-root.der 0:57.01 gmake[4]: Entering directory '/tmp/B.x9xnQx/BUILD/firefox-67.0/obj-x86_64/tools/quitter' 0:57.01 gmake[4]: Nothing to be done for 'export'. 0:57.01 gmake[4]: Leaving directory '/tmp/B.x9xnQx/BUILD/firefox-67.0/obj-x86_64/tools/quitter' 0:57.02 gmake[4]: Entering directory '/tmp/B.x9xnQx/BUILD/firefox-67.0/obj-x86_64/browser' 0:57.02 gmake[4]: Nothing to be done for 'export'. 0:57.02 gmake[4]: Leaving directory '/tmp/B.x9xnQx/BUILD/firefox-67.0/obj-x86_64/browser' 0:57.02 Executing "/usr/bin/nodejs /tmp/B.x9xnQx/BUILD/firefox-67.0/devtools/client/shared/build/build.js /tmp/B.x9xnQx/BUILD/firefox-67.0/devtools/client/debugger/new/src/main.development.js /tmp/B.x9xnQx/BUILD/firefox-67.0/devtools/client/debugger/new/src/main.js /tmp/B.x9xnQx/BUILD/firefox-67.0/devtools/client/debugger/new/src/vendors.js" 0:57.02 gmake[4]: Entering directory '/tmp/B.x9xnQx/BUILD/firefox-67.0/obj-x86_64/build/unix/elfhack' 0:57.02 gmake[4]: Nothing to be done for 'export'. 0:57.02 gmake[4]: Leaving directory '/tmp/B.x9xnQx/BUILD/firefox-67.0/obj-x86_64/build/unix/elfhack' 0:57.03 gmake[4]: Entering directory '/tmp/B.x9xnQx/BUILD/firefox-67.0/obj-x86_64/js/src/build' 0:57.03 gmake[4]: Nothing to be done for 'export'. 0:57.03 gmake[4]: Leaving directory '/tmp/B.x9xnQx/BUILD/firefox-67.0/obj-x86_64/js/src/build' 0:57.03 gmake[4]: Entering directory '/tmp/B.x9xnQx/BUILD/firefox-67.0/obj-x86_64/js/src/frontend' 0:57.03 js/src/frontend/ReservedWordsGenerated.h.stub 0:57.03 /tmp/B.x9xnQx/BUILD/firefox-67.0/obj-x86_64/_virtualenvs/init/bin/python -m mozbuild.action.file_generate /tmp/B.x9xnQx/BUILD/firefox-67.0/js/src/frontend/GenerateReservedWords.py main ReservedWordsGenerated.h .deps/ReservedWordsGenerated.h.pp .deps/ReservedWordsGenerated.h.stub /tmp/B.x9xnQx/BUILD/firefox-67.0/js/src/frontend/ReservedWords.h 0:57.10 dom/encoding/nonparticipatingdomains.properties.h.stub 0:57.10 /tmp/B.x9xnQx/BUILD/firefox-67.0/obj-x86_64/_virtualenvs/init/bin/python -m mozbuild.action.file_generate /tmp/B.x9xnQx/BUILD/firefox-67.0/intl/locale/props2arrays.py main nonparticipatingdomains.properties.h .deps/nonparticipatingdomains.properties.h.pp .deps/nonparticipatingdomains.properties.h.stub /tmp/B.x9xnQx/BUILD/firefox-67.0/dom/encoding/nonparticipatingdomains.properties 0:57.10 dns.js:221 0:57.10 this._handle = new ChannelWrap(); 0:57.10 ^ 0:57.10 Error: EFILE 0:57.10 at new Resolver (dns.js:221:20) 0:57.10 at dns.js:352:23 0:57.10 at NativeModule.compile (bootstrap_node.js:613:7) 0:57.10 at NativeModule.require (bootstrap_node.js:558:18) 0:57.10 at net.js:49:13 0:57.10 at NativeModule.compile (bootstrap_node.js:613:7) 0:57.10 at NativeModule.require (bootstrap_node.js:558:18) 0:57.10 at createWritableStdioStream (internal/process/stdio.js:159:17) 0:57.10 at process.getStdout [as stdout] (internal/process/stdio.js:16:14) 0:57.10 at console.js:249:38 0:57.10 Failed with Command '[u'/usr/bin/nodejs', '/tmp/B.x9xnQx/BUILD/firefox-67.0/devtools/client/shared/build/build.js', '/tmp/B.x9xnQx/BUILD/firefox-67.0/devtools/client/debugger/new/src/main.development.js', '/tmp/B.x9xnQx/BUILD/firefox-67.0/devtools/client/debugger/new/src/main.js', '/tmp/B.x9xnQx/BUILD/firefox-67.0/devtools/client/debugger/new/src/vendors.js']' returned non-zero exit status 1. Be sure to check that your mozconfig doesn't 0:57.10 have --disable-nodejs in it. If it does, try removing that line and 0:57.10 building again. 0:57.12 gmake[4]: *** [backend.mk:20: .deps/node.stub.stub] Error 1 0:57.12 gmake[4]: Leaving directory '/tmp/B.x9xnQx/BUILD/firefox-67.0/obj-x86_64/devtools/client/debugger/new/src' 0:57.12 gmake[3]: *** [/tmp/B.x9xnQx/BUILD/firefox-67.0/config/recurse.mk:101: devtools/client/debugger/new/src/export] Error 2 0:57.12 gmake[3]: *** Waiting for unfinished jobs.... 0:57.12 media/libdav1d/16bd_itx_tmpl.c.stub 0:57.12 /tmp/B.x9xnQx/BUILD/firefox-67.0/obj-x86_64/_virtualenvs/init/bin/python -m mozbuild.action.file_generate /tmp/B.x9xnQx/BUILD/firefox-67.0/media/libdav1d/generate_source.py add_define 16bd_itx_tmpl.c .deps/16bd_itx_tmpl.c.pp .deps/16bd_itx_tmpl.c.stub /tmp/B.x9xnQx/BUILD/firefox-67.0/third_party/dav1d/src/itx_tmpl.c BITDEPTH 16 0:57.17 gmake[4]: Leaving directory '/tmp/B.x9xnQx/BUILD/firefox-67.0/obj-x86_64/security/apps' 0:57.19 gmake[4]: Leaving directory '/tmp/B.x9xnQx/BUILD/firefox-67.0/obj-x86_64/js/src/frontend' 0:57.24 gmake[4]: Leaving directory '/tmp/B.x9xnQx/BUILD/firefox-67.0/obj-x86_64/dom/encoding' 0:57.26 media/libdav1d/16bd_lf_apply_tmpl.c.stub 0:57.26 /tmp/B.x9xnQx/BUILD/firefox-67.0/obj-x86_64/_virtualenvs/init/bin/python -m mozbuild.action.file_generate /tmp/B.x9xnQx/BUILD/firefox-67.0/media/libdav1d/generate_source.py add_define 16bd_lf_apply_tmpl.c .deps/16bd_lf_apply_tmpl.c.pp .deps/16bd_lf_apply_tmpl.c.stub /tmp/B.x9xnQx/BUILD/firefox-67.0/third_party/dav1d/src/lf_apply_tmpl.c BITDEPTH 16 0:57.40 media/libdav1d/16bd_loopfilter_tmpl.c.stub 0:57.40 /tmp/B.x9xnQx/BUILD/firefox-67.0/obj-x86_64/_virtualenvs/init/bin/python -m mozbuild.action.file_generate /tmp/B.x9xnQx/BUILD/firefox-67.0/media/libdav1d/generate_source.py add_define 16bd_loopfilter_tmpl.c .deps/16bd_loopfilter_tmpl.c.pp .deps/16bd_loopfilter_tmpl.c.stub /tmp/B.x9xnQx/BUILD/firefox-67.0/third_party/dav1d/src/loopfilter_tmpl.c BITDEPTH 16 0:57.52 media/libdav1d/16bd_looprestoration_tmpl.c.stub 0:57.52 /tmp/B.x9xnQx/BUILD/firefox-67.0/obj-x86_64/_virtualenvs/init/bin/python -m mozbuild.action.file_generate /tmp/B.x9xnQx/BUILD/firefox-67.0/media/libdav1d/generate_source.py add_define 16bd_looprestoration_tmpl.c .deps/16bd_looprestoration_tmpl.c.pp .deps/16bd_looprestoration_tmpl.c.stub /tmp/B.x9xnQx/BUILD/firefox-67.0/third_party/dav1d/src/looprestoration_tmpl.c BITDEPTH 16 0:57.65 media/libdav1d/16bd_lr_apply_tmpl.c.stub 0:57.65 /tmp/B.x9xnQx/BUILD/firefox-67.0/obj-x86_64/_virtualenvs/init/bin/python -m mozbuild.action.file_generate /tmp/B.x9xnQx/BUILD/firefox-67.0/media/libdav1d/generate_source.py add_define 16bd_lr_apply_tmpl.c .deps/16bd_lr_apply_tmpl.c.pp .deps/16bd_lr_apply_tmpl.c.stub /tmp/B.x9xnQx/BUILD/firefox-67.0/third_party/dav1d/src/lr_apply_tmpl.c BITDEPTH 16 0:57.78 media/libdav1d/16bd_mc_tmpl.c.stub 0:57.78 /tmp/B.x9xnQx/BUILD/firefox-67.0/obj-x86_64/_virtualenvs/init/bin/python -m mozbuild.action.file_generate /tmp/B.x9xnQx/BUILD/firefox-67.0/media/libdav1d/generate_source.py add_define 16bd_mc_tmpl.c .deps/16bd_mc_tmpl.c.pp .deps/16bd_mc_tmpl.c.stub /tmp/B.x9xnQx/BUILD/firefox-67.0/third_party/dav1d/src/mc_tmpl.c BITDEPTH 16 0:57.91 media/libdav1d/16bd_recon_tmpl.c.stub 0:57.91 /tmp/B.x9xnQx/BUILD/firefox-67.0/obj-x86_64/_virtualenvs/init/bin/python -m mozbuild.action.file_generate /tmp/B.x9xnQx/BUILD/firefox-67.0/media/libdav1d/generate_source.py add_define 16bd_recon_tmpl.c .deps/16bd_recon_tmpl.c.pp .deps/16bd_recon_tmpl.c.stub /tmp/B.x9xnQx/BUILD/firefox-67.0/third_party/dav1d/src/recon_tmpl.c BITDEPTH 16 0:58.04 media/libdav1d/8bd_cdef_apply_tmpl.c.stub 0:58.04 /tmp/B.x9xnQx/BUILD/firefox-67.0/obj-x86_64/_virtualenvs/init/bin/python -m mozbuild.action.file_generate /tmp/B.x9xnQx/BUILD/firefox-67.0/media/libdav1d/generate_source.py add_define 8bd_cdef_apply_tmpl.c .deps/8bd_cdef_apply_tmpl.c.pp .deps/8bd_cdef_apply_tmpl.c.stub /tmp/B.x9xnQx/BUILD/firefox-67.0/third_party/dav1d/src/cdef_apply_tmpl.c BITDEPTH 8 0:58.17 media/libdav1d/8bd_cdef_tmpl.c.stub 0:58.17 /tmp/B.x9xnQx/BUILD/firefox-67.0/obj-x86_64/_virtualenvs/init/bin/python -m mozbuild.action.file_generate /tmp/B.x9xnQx/BUILD/firefox-67.0/media/libdav1d/generate_source.py add_define 8bd_cdef_tmpl.c .deps/8bd_cdef_tmpl.c.pp .deps/8bd_cdef_tmpl.c.stub /tmp/B.x9xnQx/BUILD/firefox-67.0/third_party/dav1d/src/cdef_tmpl.c BITDEPTH 8 0:58.17 ../../config/nsinstall -R -m 644 'webrender_ffi_generated.h' '../../dist/include/mozilla/webrender' 0:58.17 gmake[4]: Leaving directory '/tmp/B.x9xnQx/BUILD/firefox-67.0/obj-x86_64/gfx/webrender_bindings' 0:58.31 media/libdav1d/8bd_film_grain_tmpl.c.stub 0:58.31 /tmp/B.x9xnQx/BUILD/firefox-67.0/obj-x86_64/_virtualenvs/init/bin/python -m mozbuild.action.file_generate /tmp/B.x9xnQx/BUILD/firefox-67.0/media/libdav1d/generate_source.py add_define 8bd_film_grain_tmpl.c .deps/8bd_film_grain_tmpl.c.pp .deps/8bd_film_grain_tmpl.c.stub /tmp/B.x9xnQx/BUILD/firefox-67.0/third_party/dav1d/src/film_grain_tmpl.c BITDEPTH 8 0:58.43 media/libdav1d/8bd_ipred_prepare_tmpl.c.stub 0:58.43 /tmp/B.x9xnQx/BUILD/firefox-67.0/obj-x86_64/_virtualenvs/init/bin/python -m mozbuild.action.file_generate /tmp/B.x9xnQx/BUILD/firefox-67.0/media/libdav1d/generate_source.py add_define 8bd_ipred_prepare_tmpl.c .deps/8bd_ipred_prepare_tmpl.c.pp .deps/8bd_ipred_prepare_tmpl.c.stub /tmp/B.x9xnQx/BUILD/firefox-67.0/third_party/dav1d/src/ipred_prepare_tmpl.c BITDEPTH 8 0:58.56 media/libdav1d/8bd_ipred_tmpl.c.stub 0:58.56 /tmp/B.x9xnQx/BUILD/firefox-67.0/obj-x86_64/_virtualenvs/init/bin/python -m mozbuild.action.file_generate /tmp/B.x9xnQx/BUILD/firefox-67.0/media/libdav1d/generate_source.py add_define 8bd_ipred_tmpl.c .deps/8bd_ipred_tmpl.c.pp .deps/8bd_ipred_tmpl.c.stub /tmp/B.x9xnQx/BUILD/firefox-67.0/third_party/dav1d/src/ipred_tmpl.c BITDEPTH 8 0:58.69 media/libdav1d/8bd_itx_tmpl.c.stub 0:58.69 /tmp/B.x9xnQx/BUILD/firefox-67.0/obj-x86_64/_virtualenvs/init/bin/python -m mozbuild.action.file_generate /tmp/B.x9xnQx/BUILD/firefox-67.0/media/libdav1d/generate_source.py add_define 8bd_itx_tmpl.c .deps/8bd_itx_tmpl.c.pp .deps/8bd_itx_tmpl.c.stub /tmp/B.x9xnQx/BUILD/firefox-67.0/third_party/dav1d/src/itx_tmpl.c BITDEPTH 8 0:58.83 media/libdav1d/8bd_lf_apply_tmpl.c.stub 0:58.83 /tmp/B.x9xnQx/BUILD/firefox-67.0/obj-x86_64/_virtualenvs/init/bin/python -m mozbuild.action.file_generate /tmp/B.x9xnQx/BUILD/firefox-67.0/media/libdav1d/generate_source.py add_define 8bd_lf_apply_tmpl.c .deps/8bd_lf_apply_tmpl.c.pp .deps/8bd_lf_apply_tmpl.c.stub /tmp/B.x9xnQx/BUILD/firefox-67.0/third_party/dav1d/src/lf_apply_tmpl.c BITDEPTH 8 0:58.95 media/libdav1d/8bd_loopfilter_tmpl.c.stub 0:58.95 /tmp/B.x9xnQx/BUILD/firefox-67.0/obj-x86_64/_virtualenvs/init/bin/python -m mozbuild.action.file_generate /tmp/B.x9xnQx/BUILD/firefox-67.0/media/libdav1d/generate_source.py add_define 8bd_loopfilter_tmpl.c .deps/8bd_loopfilter_tmpl.c.pp .deps/8bd_loopfilter_tmpl.c.stub /tmp/B.x9xnQx/BUILD/firefox-67.0/third_party/dav1d/src/loopfilter_tmpl.c BITDEPTH 8 0:59.09 media/libdav1d/8bd_looprestoration_tmpl.c.stub 0:59.09 /tmp/B.x9xnQx/BUILD/firefox-67.0/obj-x86_64/_virtualenvs/init/bin/python -m mozbuild.action.file_generate /tmp/B.x9xnQx/BUILD/firefox-67.0/media/libdav1d/generate_source.py add_define 8bd_looprestoration_tmpl.c .deps/8bd_looprestoration_tmpl.c.pp .deps/8bd_looprestoration_tmpl.c.stub /tmp/B.x9xnQx/BUILD/firefox-67.0/third_party/dav1d/src/looprestoration_tmpl.c BITDEPTH 8 0:59.21 media/libdav1d/8bd_lr_apply_tmpl.c.stub 0:59.21 /tmp/B.x9xnQx/BUILD/firefox-67.0/obj-x86_64/_virtualenvs/init/bin/python -m mozbuild.action.file_generate /tmp/B.x9xnQx/BUILD/firefox-67.0/media/libdav1d/generate_source.py add_define 8bd_lr_apply_tmpl.c .deps/8bd_lr_apply_tmpl.c.pp .deps/8bd_lr_apply_tmpl.c.stub /tmp/B.x9xnQx/BUILD/firefox-67.0/third_party/dav1d/src/lr_apply_tmpl.c BITDEPTH 8 0:59.35 media/libdav1d/8bd_mc_tmpl.c.stub 0:59.35 /tmp/B.x9xnQx/BUILD/firefox-67.0/obj-x86_64/_virtualenvs/init/bin/python -m mozbuild.action.file_generate /tmp/B.x9xnQx/BUILD/firefox-67.0/media/libdav1d/generate_source.py add_define 8bd_mc_tmpl.c .deps/8bd_mc_tmpl.c.pp .deps/8bd_mc_tmpl.c.stub /tmp/B.x9xnQx/BUILD/firefox-67.0/third_party/dav1d/src/mc_tmpl.c BITDEPTH 8 0:59.47 media/libdav1d/8bd_recon_tmpl.c.stub 0:59.47 /tmp/B.x9xnQx/BUILD/firefox-67.0/obj-x86_64/_virtualenvs/init/bin/python -m mozbuild.action.file_generate /tmp/B.x9xnQx/BUILD/firefox-67.0/media/libdav1d/generate_source.py add_define 8bd_recon_tmpl.c .deps/8bd_recon_tmpl.c.pp .deps/8bd_recon_tmpl.c.stub /tmp/B.x9xnQx/BUILD/firefox-67.0/third_party/dav1d/src/recon_tmpl.c BITDEPTH 8 0:59.60 gmake[4]: Leaving directory '/tmp/B.x9xnQx/BUILD/firefox-67.0/obj-x86_64/media/libdav1d' 1:02.28 layout/style/nsCSSPropertyID.h.stub 1:02.28 /tmp/B.x9xnQx/BUILD/firefox-67.0/obj-x86_64/_virtualenvs/init/bin/python -m mozbuild.action.file_generate /tmp/B.x9xnQx/BUILD/firefox-67.0/layout/style/GenerateCSSPropertyID.py generate nsCSSPropertyID.h .deps/nsCSSPropertyID.h.pp .deps/nsCSSPropertyID.h.stub /tmp/B.x9xnQx/BUILD/firefox-67.0/layout/style/nsCSSPropertyID.h.in ServoCSSPropList.py 1:02.44 layout/style/ServoCSSPropList.h.stub 1:02.44 /tmp/B.x9xnQx/BUILD/firefox-67.0/obj-x86_64/_virtualenvs/init/bin/python -m mozbuild.action.file_generate /tmp/B.x9xnQx/BUILD/firefox-67.0/layout/style/GenerateServoCSSPropList.py generate_header ServoCSSPropList.h .deps/ServoCSSPropList.h.pp .deps/ServoCSSPropList.h.stub ServoCSSPropList.py 1:02.58 layout/style/CompositorAnimatableProperties.h.stub 1:02.58 /tmp/B.x9xnQx/BUILD/firefox-67.0/obj-x86_64/_virtualenvs/init/bin/python -m mozbuild.action.file_generate /tmp/B.x9xnQx/BUILD/firefox-67.0/layout/style/GenerateCompositorAnimatableProperties.py generate CompositorAnimatableProperties.h .deps/CompositorAnimatableProperties.h.pp .deps/CompositorAnimatableProperties.h.stub ServoCSSPropList.py 1:02.74 layout/style/nsComputedDOMStyleGenerated.cpp.stub 1:02.74 /tmp/B.x9xnQx/BUILD/firefox-67.0/obj-x86_64/_virtualenvs/init/bin/python -m mozbuild.action.file_generate /tmp/B.x9xnQx/BUILD/firefox-67.0/layout/style/GenerateComputedDOMStyleGenerated.py generate nsComputedDOMStyleGenerated.cpp .deps/nsComputedDOMStyleGenerated.cpp.pp .deps/nsComputedDOMStyleGenerated.cpp.stub ServoCSSPropList.py 1:02.90 layout/style/nsCSSPropsGenerated.inc.stub 1:02.90 /tmp/B.x9xnQx/BUILD/firefox-67.0/obj-x86_64/_virtualenvs/init/bin/python -m mozbuild.action.file_generate /tmp/B.x9xnQx/BUILD/firefox-67.0/layout/style/GenerateCSSPropsGenerated.py generate nsCSSPropsGenerated.inc .deps/nsCSSPropsGenerated.inc.pp .deps/nsCSSPropsGenerated.inc.stub ServoCSSPropList.py 1:03.05 layout/style/ServoStyleConsts.h.stub 1:03.05 /tmp/B.x9xnQx/BUILD/firefox-67.0/obj-x86_64/_virtualenvs/init/bin/python -m mozbuild.action.file_generate /tmp/B.x9xnQx/BUILD/firefox-67.0/layout/style/RunCbindgen.py generate ServoStyleConsts.h .deps/ServoStyleConsts.h.pp .deps/ServoStyleConsts.h.stub /tmp/B.x9xnQx/BUILD/firefox-67.0/servo/components/style 1:04.61 ../../config/nsinstall -R -m 644 'nsCSSPropertyID.h' '../../dist/include' 1:04.61 ../../config/nsinstall -R -m 644 'ServoCSSPropList.h' '../../dist/include/mozilla' 1:04.61 ../../config/nsinstall -R -m 644 'CompositorAnimatableProperties.h' '../../dist/include/mozilla' 1:04.61 ../../config/nsinstall -R -m 644 'ServoStyleConsts.h' '../../dist/include/mozilla' 1:04.61 gmake[4]: Leaving directory '/tmp/B.x9xnQx/BUILD/firefox-67.0/obj-x86_64/layout/style' 1:30.59 touch ipdl.track 1:30.59 gmake[4]: Leaving directory '/tmp/B.x9xnQx/BUILD/firefox-67.0/obj-x86_64/ipc/ipdl' 1:30.59 gmake[3]: Leaving directory '/tmp/B.x9xnQx/BUILD/firefox-67.0/obj-x86_64' 1:30.59 gmake[2]: *** [/tmp/B.x9xnQx/BUILD/firefox-67.0/config/recurse.mk:34: export] Error 2 1:30.59 gmake[2]: Leaving directory '/tmp/B.x9xnQx/BUILD/firefox-67.0/obj-x86_64' 1:30.59 gmake[1]: *** [/tmp/B.x9xnQx/BUILD/firefox-67.0/config/rules.mk:400: default] Error 2 1:30.59 gmake[1]: Leaving directory '/tmp/B.x9xnQx/BUILD/firefox-67.0/obj-x86_64' 1:30.60 gmake: *** [client.mk:125: build] Error 2 1:30.62 0 compiler warnings present. error: Bad exit status from /tmp/B.x9xnQx/BUILD/tmp/rpm-tmp.74927 (%build) RPM build errors: Bad exit status from /tmp/B.x9xnQx/BUILD/tmp/rpm-tmp.74927 (%build) ended at: Wed May 29 00:38:17 2019, done in 0:02:04.004538 error: No files produced. + chmod -R u+rwX /tmp/B.x9xnQx/BUILD + rm -rf /tmp/B.x9xnQx/tmp /tmp/B.x9xnQx/BUILD + rm -rf /tmp/B.x9xnQx Begin-PLD-Builder-Info Build-Time: user:114.77s sys:42.31s real:266.19s (faults io:99 non-io:2805369) End-PLD-Builder-Info
[Back to list of logs] [View rpm -qa of builder]