FailedOk

th/SRPMS[OK]
th/x32[OK]
th/i686[OK]
th/x86_64[OK]

ac/SRPMS[OK]
ac/i386[OK]
ac/i586[OK]
ac/i686[OK]
ac/alpha[OK]
ac/amd64[OK]
ac/athlon[OK]
ac/ppc[OK]
ac/sparc[OK]
ac/sparc64[OK]

Advanced Search
main()
Powered by PLD Linux
(c) 2002-2017 PLD Team
$Revision: 1.37 $
Powered by NASA.
Your IP: 54.80.70.8

firefox 83c8d4a9-2494-44f1-a8e7-c365ad2c5c19

Status:Failed
Source URL:ftp://buildlogs.pld-linux.org/th/x86_64/FAIL/firefox,83c8d4a9-2494-44f1-a8e7-c365ad2c5c19.bz2
text/plain URL:View!
full text:View!
rpm -qa of builder:View!
Date:2017/08/11 14:42:14
Runtime:0:03:08.288938

Toc:

  • error 1
  • mozbuild.frontend.reader.SandboxValidationError:
  • error 2
  • error: Bad exit status from /tmp/B.c5cbg7/BUILD/tmp/rpm-tmp.80554 (%build)
  • error 3
  • RPM build errors:
  • error 4
  • error: No files produced.

Content:

js/src> checking for as... (cached) /usr/bin/as
js/src> checking for ar... (cached) ar
js/src> checking for strip... (cached) strip
js/src> checking for windres... no
js/src> checking for sb-conf... no
js/src> checking for ve... no
js/src> checking for X... (cached) libraries /usr/lib64, headers
js/src> checking for dnet_ntoa in -ldnet... (cached) no
js/src> checking for dnet_ntoa in -ldnet_stub... (cached) no
js/src> checking for gethostbyname... (cached) yes
js/src> checking for connect... (cached) yes
js/src> checking for remove... (cached) yes
js/src> checking for shmat... (cached) yes
js/src> checking for IceConnectionNumber in -lICE... (cached) yes
js/src> checking for --noexecstack option to as... yes
js/src> checking for -z noexecstack option to ld... yes
js/src> checking for -z text option to ld... yes
js/src> checking for --build-id option to ld... yes
js/src> checking for working const... (cached) yes
js/src> checking for mode_t... (cached) yes
js/src> checking for off_t... (cached) yes
js/src> checking for pid_t... (cached) yes
js/src> checking for size_t... (cached) yes
js/src> checking for ssize_t... yes
js/src> checking whether 64-bits std::atomic requires -latomic... (cached) no
js/src> checking for dirent.h that defines DIR... (cached) yes
js/src> checking for opendir... yes
js/src> checking for gethostbyname_r in -lc_r... (cached) no
js/src> checking for library containing dlopen... (cached) -ldl
js/src> checking for dlfcn.h... (cached) yes
js/src> checking for socket in -lsocket... (cached) no
js/src> checking for pthread_create in -lpthreads... (cached) no
js/src> checking for pthread_create in -lpthread... (cached) yes
js/src> checking whether /usr/bin/gcc -std=gnu99 accepts -pthread... yes
js/src> checking whether /usr/bin/gcc -std=gnu99 needs -traditional... (cached) no
js/src> checking for 8-bit clean memcmp... (cached) yes
js/src> checking for getc_unlocked... yes
js/src> checking for _getc_nolock... no
js/src> checking for gmtime_r... (cached) yes
js/src> checking for localtime_r... (cached) yes
js/src> checking for pthread_getname_np... yes
js/src> checking for clock_gettime(CLOCK_MONOTONIC)... (cached)
js/src> checking for sin in -lm... yes
js/src> checking for sincos in -lm... yes
js/src> checking for __sincos in -lm... no
js/src> checking for wcrtomb... (cached) yes
js/src> checking for mbrtowc... (cached) yes
js/src> checking for res_ninit()... (cached) yes
js/src> checking for nl_langinfo and CODESET... (cached) yes
js/src> checking for an implementation of va_copy()... (cached) yes
js/src> checking whether va_list can be copied by value... (cached) no
js/src> checking for C++ dynamic_cast to void*... (cached) yes
js/src> checking for __thread keyword for TLS variables... (cached) yes
js/src> checking for LC_MESSAGES... (cached) yes
js/src> checking for localeconv... (cached) yes
js/src> checking NSPR selection... command-line
js/src> checking for valid optimization flags... yes
js/src> checking for __cxa_demangle... (cached) yes
js/src> checking for -pipe support... yes
js/src> checking whether C compiler supports -fprofile-generate... yes
js/src> checking for tm_zone tm_gmtoff in struct tm... yes
js/src> checking what kind of list files are supported by the linker... linkerscript
js/src> checking what kind of ordering can be done with the linker... section-ordering-file
js/src> checking for readline in -lreadline... yes
js/src> checking for icu-i18n >= 58.1... yes
js/src> checking MOZ_ICU_CFLAGS...
js/src> checking MOZ_ICU_LIBS... -licui18n -licuuc -licudata
js/src> checking for posix_fadvise... (cached) yes
js/src> checking for posix_fallocate... (cached) yes
js/src> checking for malloc.h... (cached) yes
js/src> checking for strndup... (cached) yes
js/src> checking for posix_memalign... (cached) yes
js/src> checking for memalign... (cached) yes
js/src> checking for malloc_usable_size... (cached) yes
js/src> checking whether malloc_usable_size definition can use const argument... no
js/src> checking for valloc in malloc.h... yes
js/src> checking for valloc in unistd.h... no
js/src> checking for setlocale... yes
js/src> checking for localeconv... (cached) yes
js/src> updating cache /tmp/B.c5cbg7/BUILD/firefox-55.0.1/obj-x86_64/config.cache
js/src> creating ./config.data
js/src> Creating config.status
Creating config.status
Reticulating splines...
Traceback (most recent call last):
  File "/tmp/B.c5cbg7/BUILD/firefox-55.0.1/configure.py", line 124, in <module>
    sys.exit(main(sys.argv))
  File "/tmp/B.c5cbg7/BUILD/firefox-55.0.1/configure.py", line 34, in main
    return config_status(config)
  File "/tmp/B.c5cbg7/BUILD/firefox-55.0.1/configure.py", line 119, in config_status
    return config_status(args=[], **encode(sanitized_config, encoding))
  File "/tmp/B.c5cbg7/BUILD/firefox-55.0.1/python/mozbuild/mozbuild/config_status.py", line 147, in config_status
    definitions = list(definitions)
  File "/tmp/B.c5cbg7/BUILD/firefox-55.0.1/python/mozbuild/mozbuild/frontend/emitter.py", line 194, in emit
    objs = list(self._emit_libs_derived(contexts))
  File "/tmp/B.c5cbg7/BUILD/firefox-55.0.1/python/mozbuild/mozbuild/frontend/emitter.py", line 228, in _emit_libs_derived
    self._link_libraries(context, obj, variable)
  File "/tmp/B.c5cbg7/BUILD/firefox-55.0.1/python/mozbuild/mozbuild/frontend/emitter.py", line 341, in _link_libraries
    context)
mozbuild.frontend.reader.SandboxValidationError: 
==============================
ERROR PROCESSING MOZBUILD FILE
==============================

The error occurred while processing the following file or one of the files it includes:

    /tmp/B.c5cbg7/BUILD/firefox-55.0.1/media/webrtc/trunk/gtest/moz.build

The error occurred when validating the result of the execution. The reported error is:

    USE_LIBS contains "media_libjpeg", which does not match any LIBRARY_NAME in the tree.


*** Fix above errors and then restart with\
               "/usr/bin/make -f client.mk build"
make[2]: *** [/tmp/B.c5cbg7/BUILD/firefox-55.0.1/client.mk:383: configure] Error 1
make[2]: Leaving directory '/tmp/B.c5cbg7/BUILD/firefox-55.0.1'
make[1]: *** [/tmp/B.c5cbg7/BUILD/firefox-55.0.1/client.mk:396: /tmp/B.c5cbg7/BUILD/firefox-55.0.1/obj-x86_64/Makefile] Error 2
make[1]: Leaving directory '/tmp/B.c5cbg7/BUILD/firefox-55.0.1'
make: *** [client.mk:232: profiledbuild] Error 2
error: Bad exit status from /tmp/B.c5cbg7/BUILD/tmp/rpm-tmp.80554 (%build)


RPM build errors:
    Bad exit status from /tmp/B.c5cbg7/BUILD/tmp/rpm-tmp.80554 (%build)
ended at: Fri Aug 11 14:37:19 2017, done in 0:03:08.288938
error: No files produced.
mesg: ttyname failed: Inappropriate ioctl for device
+ chmod -R u+rwX /tmp/B.c5cbg7/BUILD
+ rm -rf /tmp/B.c5cbg7/tmp /tmp/B.c5cbg7/BUILD
mesg: ttyname failed: Inappropriate ioctl for device
+ rm -rf /tmp/B.c5cbg7
Begin-PLD-Builder-Info
Build-Time: user:40.91s sys:21.81s real:497.90s (faults io:591 non-io:1812798)

End-PLD-Builder-Info
[Back to list of logs] [View rpm -qa of builder]