FailedOk

th/SRPMS[OK]
th/x32[OK]
th/i686[OK]
th/x86_64[OK]

ac/SRPMS[OK]
ac/i386[OK]
ac/i586[OK]
ac/i686[OK]
ac/alpha[OK]
ac/amd64[OK]
ac/athlon[OK]
ac/ppc[OK]
ac/sparc[OK]
ac/sparc64[OK]

Advanced Search
main()
Powered by PLD Linux
(c) 2002-2018 PLD Team
$Revision: 1.37 $
Powered by PDP-7.
Your IP: 54.198.205.153

firefox52-esr 184fc61e-98c9-4bc3-aad0-1e26bf7d693c

Status:Failed
Source URL:ftp://buildlogs.pld-linux.org/th/x86_64/FAIL/firefox52-esr,184fc61e-98c9-4bc3-aad0-1e26bf7d693c.bz2
text/plain URL:View!
full text:View!
rpm -qa of builder:View!
Date:2018/01/11 18:47:23
Runtime:0:02:45.759815

Toc:

  • error 1
  • configure: error: These compiler flags for C are invalid: -O2 -fwrapv -pipe -Wformat -Werror=format-security -gdwarf-4 -fno-debug-types-section -fvar-tracking-assignments -g2 -Wp,-D_FORTIFY_SOURCE=2 -fstack-protector-strong --param=ssp-buffer-size=4 -fPIC -march=x86-64 -gdwarf-4 -fno-debug-types-section -fvar-tracking-assignments -g2
  • error 2
  • DEBUG: clang-3.9: error: unknown argument: '-fvar-tracking-assignments'
  • error 3
  • DEBUG: clang-3.9: error: unknown argument: '-fvar-tracking-assignments'
  • error 4
  • DEBUG: configure: error: These compiler flags for C are invalid: -O2 -fwrapv -pipe -Wformat -Werror=format-security -gdwarf-4 -fno-debug-types-section -fvar-tracking-assignments -g2 -Wp,-D_FORTIFY_SOURCE=2 -fstack-protector-strong --param=ssp-buffer-size=4 -fPIC -march=x86-64 -gdwarf-4 -fno-debug-types-section -fvar-tracking-assignments -g2
  • error 5
  • ERROR: old-configure failed
  • error 6
  • make[2]: *** [/tmp/B.RNayd0/BUILD/firefox-52.5.3esr/client.mk:379: configure] Error 1
  • error 7
  • make[1]: *** [/tmp/B.RNayd0/BUILD/firefox-52.5.3esr/client.mk:392: /tmp/B.RNayd0/BUILD/firefox-52.5.3esr/obj-x86_64/Makefile] Error 2
  • error 8
  • error: Bad exit status from /tmp/B.RNayd0/BUILD/tmp/rpm-tmp.21668 (%build)
  • error 9
  • RPM build errors:
  • error 10
  • error: No files produced.

Content:

checking for 8-bit clean memcmp... yes
checking for stat64... yes
checking for lstat64... yes
checking for truncate64... yes
checking for statvfs64... yes
checking for statvfs... yes
checking for statfs64... yes
checking for statfs... yes
checking for getpagesize... yes
checking for gmtime_r... yes
checking for localtime_r... yes
checking for arc4random... no
checking for arc4random_buf... no
checking for mallinfo... yes
checking for gettid... no
checking for lchown... yes
checking for setpriority... yes
checking for strerror... yes
checking for syscall... yes
checking for clock_gettime(CLOCK_MONOTONIC)... 
checking for pthread_cond_timedwait_monotonic_np... 
checking for wcrtomb... yes
checking for mbrtowc... yes
checking for res_ninit()... yes
checking for iconv in -lc... yes
checking for iconv()... yes
checking for iconv() with const input... no
checking for nl_langinfo and CODESET... yes
checking for an implementation of va_copy()... yes
checking whether va_list can be copied by value... no
checking whether the C++ "using" keyword resolves ambiguity... yes
checking for C++ dynamic_cast to void*... yes
checking for __thread keyword for TLS variables... yes
checking for __attribute__((always_inline))... yes
checking for LC_MESSAGES... yes
checking for localeconv... yes
checking for malloc.h... yes
checking for strndup... yes
checking for posix_memalign... yes
checking for memalign... yes
checking for malloc_usable_size... yes
checking whether malloc_usable_size definition can use const argument... no
checking for valloc in malloc.h... yes
checking for valloc in unistd.h... no
checking NSPR selection... system
checking for nspr-config... /usr/bin/nspr-config
checking for NSPR - version >= 4.13.1... yes
checking for libevent... yes
checking MOZ_LIBEVENT_CFLAGS... 
checking MOZ_LIBEVENT_LIBS... -levent
checking for nss-config... /usr/bin/nss-config
checking for NSS - version >= 3.28.6... yes
checking for jpeg_destroy_compress in -ljpeg... yes
checking for gzread in -lz... yes
checking for BZ2_bzread in -lbz2... yes
checking for png_get_valid in -lpng... yes
checking for png_get_acTL in -lpng... yes
checking if app-specific confvars.sh exists... /tmp/B.RNayd0/BUILD/firefox-52.5.3esr/browser/confvars.sh
checking for gtk+-3.0 >= 3.4.0 gtk+-unix-print-3.0 glib-2.0 gobject-2.0 ... yes
checking MOZ_GTK3_CFLAGS... -pthread -I/usr/include/gtk-3.0/unix-print -I/usr/include/gtk-3.0 -I/usr/include/at-spi2-atk/2.0 -I/usr/include/at-spi-2.0 -I/usr/include/dbus-1.0 -I/usr/lib64/dbus-1.0/include -I/usr/include/gtk-3.0 -I/usr/include/gio-unix-2.0/ -I/usr/include/cairo -I/usr/include/pango-1.0 -I/usr/include/atk-1.0 -I/usr/include/cairo -I/usr/include/pixman-1 -I/usr/include/freetype2 -I/usr/include/libpng16 -I/usr/include/harfbuzz -I/usr/include/glib-2.0 -I/usr/lib64/glib-2.0/include -I/usr/include/freetype2 -I/usr/include/harfbuzz -I/usr/include/libpng16 -I/usr/include/gdk-pixbuf-2.0 -I/usr/include/glib-2.0 -I/usr/lib64/glib-2.0/include
checking MOZ_GTK3_LIBS... -lgtk-3 -lgdk-3 -lpangocairo-1.0 -lpango-1.0 -latk-1.0 -lcairo-gobject -lcairo -lgdk_pixbuf-2.0 -lgio-2.0 -lgobject-2.0 -lglib-2.0
checking for gtk+-2.0 >= 2.18.0 gtk+-unix-print-2.0 glib-2.0 >= 2.22 gobject-2.0 gdk-x11-2.0... yes
checking MOZ_GTK2_CFLAGS... -pthread -I/usr/include/gtk-2.0 -I/usr/include/gtk-unix-print-2.0 -I/usr/include/gtk-2.0 -I/usr/include/atk-1.0 -I/usr/include/gtk-2.0 -I/usr/lib64/gtk-2.0/include -I/usr/include/pango-1.0 -I/usr/include/gio-unix-2.0/ -I/usr/include/gdk-pixbuf-2.0 -I/usr/include/cairo -I/usr/include/pixman-1 -I/usr/include/freetype2 -I/usr/include/libpng16 -I/usr/include/harfbuzz -I/usr/include/glib-2.0 -I/usr/lib64/glib-2.0/include -I/usr/include/freetype2 -I/usr/include/harfbuzz -I/usr/include/glib-2.0 -I/usr/lib64/glib-2.0/include -I/usr/include/libpng16
checking MOZ_GTK2_LIBS... -lgtk-x11-2.0 -latk-1.0 -lpangoft2-1.0 -lgdk-x11-2.0 -lpangocairo-1.0 -lpango-1.0 -lgio-2.0 -lfontconfig -lfreetype -lXrender -lXinerama -lXi -lXrandr -lXcursor -lXcomposite -lXdamage -lXfixes -lgdk_pixbuf-2.0 -lgobject-2.0 -lglib-2.0 -lcairo -lX11 -lXext
checking for libstartup-notification-1.0 >= 0.8... yes
checking MOZ_STARTUP_NOTIFICATION_CFLAGS... -I/usr/include/startup-notification-1.0
checking MOZ_STARTUP_NOTIFICATION_LIBS... -lstartup-notification-1
checking for gio-2.0 >= 2.22... yes
checking MOZ_GIO_CFLAGS... -pthread -I/usr/include/glib-2.0 -I/usr/lib64/glib-2.0/include
checking MOZ_GIO_LIBS... -lgio-2.0 -lgobject-2.0 -lglib-2.0
checking for dbus-1 >= 0.60... yes
checking MOZ_DBUS_CFLAGS... -I/usr/include/dbus-1.0 -I/usr/lib64/dbus-1.0/include
checking MOZ_DBUS_LIBS... -ldbus-1
checking for dbus-glib-1 >= 0.60... yes
checking MOZ_DBUS_GLIB_CFLAGS... -I/usr/include/dbus-1.0 -I/usr/lib64/dbus-1.0/include -I/usr/include/glib-2.0 -I/usr/lib64/glib-2.0/include
checking MOZ_DBUS_GLIB_LIBS... -ldbus-glib-1 -ldbus-1 -lgobject-2.0 -lglib-2.0
checking for vpx >= 1.5.0... yes
checking MOZ_LIBVPX_CFLAGS... 
checking MOZ_LIBVPX_LIBS... -lvpx -lm
checking for vpx/vpx_decoder.h... yes
checking for vpx_codec_dec_init_ver in -lvpx... yes
checking for vpx_mem/vpx_mem.h... no
checking for alsa... yes
checking MOZ_ALSA_CFLAGS... -I/usr/include/alsa
checking MOZ_ALSA_LIBS... -lasound
checking for libpulse... yes
checking MOZ_PULSEAUDIO_CFLAGS... -D_REENTRANT
checking MOZ_PULSEAUDIO_LIBS... -lpulse
checking for linux/joystick.h... yes
checking for wget... wget
checking for sqlite3 >= 3.17.0... yes
checking SQLITE_CFLAGS... 
checking SQLITE_LIBS... -lsqlite3
checking for SQLITE_SECURE_DELETE support in system SQLite... yes
checking for SQLITE_THREADSAFE support in system SQLite... yes
checking for SQLITE_ENABLE_FTS3 support in system SQLite... yes
checking for SQLITE_ENABLE_UNLOCK_NOTIFY support in system SQLite... yes
checking for SQLITE_ENABLE_DBSTAT_VTAB support in system SQLite... yes
checking for valid C compiler optimization flags... no
configure: error: These compiler flags for C are invalid: -O2 -fwrapv -pipe -Wformat -Werror=format-security -gdwarf-4 -fno-debug-types-section -fvar-tracking-assignments -g2 -Wp,-D_FORTIFY_SOURCE=2 -fstack-protector-strong --param=ssp-buffer-size=4 -fPIC -march=x86-64 -gdwarf-4 -fno-debug-types-section -fvar-tracking-assignments -g2
DEBUG: <truncated - see config.log for full output>
DEBUG: configure:16018: checking for SQLITE_THREADSAFE support in system SQLite
DEBUG: configure:16041: /usr/bin/clang -std=gnu99 -o conftest  -fno-strict-aliasing -fno-math-errno -pthread  -Qunused-arguments  -lpthread  -Wl,-z,noexecstack -Wl,-z,text -Wl,--build-id -B /tmp/B.RNayd0/BUILD/firefox-52.5.3esr/obj-x86_64/build/unix/gold conftest.c -ldl  -lsqlite3 1>&5
DEBUG: configure:16064: checking for SQLITE_ENABLE_FTS3 support in system SQLite
DEBUG: configure:16087: /usr/bin/clang -std=gnu99 -o conftest  -fno-strict-aliasing -fno-math-errno -pthread  -Qunused-arguments  -lpthread  -Wl,-z,noexecstack -Wl,-z,text -Wl,--build-id -B /tmp/B.RNayd0/BUILD/firefox-52.5.3esr/obj-x86_64/build/unix/gold conftest.c -ldl  -lsqlite3 1>&5
DEBUG: configure:16110: checking for SQLITE_ENABLE_UNLOCK_NOTIFY support in system SQLite
DEBUG: configure:16133: /usr/bin/clang -std=gnu99 -o conftest  -fno-strict-aliasing -fno-math-errno -pthread  -Qunused-arguments  -lpthread  -Wl,-z,noexecstack -Wl,-z,text -Wl,--build-id -B /tmp/B.RNayd0/BUILD/firefox-52.5.3esr/obj-x86_64/build/unix/gold conftest.c -ldl  -lsqlite3 1>&5
DEBUG: configure:16156: checking for SQLITE_ENABLE_DBSTAT_VTAB support in system SQLite
DEBUG: configure:16179: /usr/bin/clang -std=gnu99 -o conftest  -fno-strict-aliasing -fno-math-errno -pthread  -Qunused-arguments  -lpthread  -Wl,-z,noexecstack -Wl,-z,text -Wl,--build-id -B /tmp/B.RNayd0/BUILD/firefox-52.5.3esr/obj-x86_64/build/unix/gold conftest.c -ldl  -lsqlite3 1>&5
DEBUG: configure:16363: checking for valid C compiler optimization flags
DEBUG: configure:16374: /usr/bin/clang -std=gnu99 -c  -fno-strict-aliasing -fno-math-errno -pthread -O2 -fwrapv -pipe -Wformat -Werror=format-security -gdwarf-4 -fno-debug-types-section -fvar-tracking-assignments -g2 -Wp,-D_FORTIFY_SOURCE=2 -fstack-protector-strong --param=ssp-buffer-size=4 -fPIC -march=x86-64 -gdwarf-4 -fno-debug-types-section -fvar-tracking-assignments -g2 -Qunused-arguments  conftest.c 1>&5
DEBUG: clang-3.9: error: unknown argument: '-fvar-tracking-assignments'
DEBUG: clang-3.9: error: unknown argument: '-fvar-tracking-assignments'
DEBUG: configure: failed program was:
DEBUG: #line 16367 "configure"
DEBUG: #include "confdefs.h"
DEBUG: #include <stdio.h>
DEBUG: int main() {
DEBUG: printf("Hello World\n");
DEBUG: ; return 0; }
DEBUG: configure: error: These compiler flags for C are invalid: -O2 -fwrapv -pipe -Wformat -Werror=format-security -gdwarf-4 -fno-debug-types-section -fvar-tracking-assignments -g2 -Wp,-D_FORTIFY_SOURCE=2 -fstack-protector-strong --param=ssp-buffer-size=4 -fPIC -march=x86-64 -gdwarf-4 -fno-debug-types-section -fvar-tracking-assignments -g2
ERROR: old-configure failed
*** Fix above errors and then restart with\
               "/usr/bin/make -f client.mk build"
make[2]: *** [/tmp/B.RNayd0/BUILD/firefox-52.5.3esr/client.mk:379: configure] Error 1
make[2]: Leaving directory '/tmp/B.RNayd0/BUILD/firefox-52.5.3esr'
make[1]: *** [/tmp/B.RNayd0/BUILD/firefox-52.5.3esr/client.mk:392: /tmp/B.RNayd0/BUILD/firefox-52.5.3esr/obj-x86_64/Makefile] Error 2
make[1]: Leaving directory '/tmp/B.RNayd0/BUILD/firefox-52.5.3esr'
make: *** [client.mk:170: build] Error 2
error: Bad exit status from /tmp/B.RNayd0/BUILD/tmp/rpm-tmp.21668 (%build)


RPM build errors:
    Bad exit status from /tmp/B.RNayd0/BUILD/tmp/rpm-tmp.21668 (%build)
ended at: Thu Jan 11 18:42:49 2018, done in 0:02:45.759815
error: No files produced.
mesg: ttyname failed: Inappropriate ioctl for device
+ chmod -R u+rwX /tmp/B.RNayd0/BUILD
+ rm -rf /tmp/B.RNayd0/tmp /tmp/B.RNayd0/BUILD
mesg: ttyname failed: Inappropriate ioctl for device
+ rm -rf /tmp/B.RNayd0
Begin-PLD-Builder-Info
Build-Time: user:27.38s sys:17.97s real:487.16s (faults io:595 non-io:1376945)

End-PLD-Builder-Info
[Back to list of logs] [View rpm -qa of builder]