FailedOk

th/SRPMS[OK]
th/x32[OK]
th/i686[OK]
th/x86_64[OK]

ac/SRPMS[OK]
ac/i386[OK]
ac/i586[OK]
ac/i686[OK]
ac/alpha[OK]
ac/amd64[OK]
ac/athlon[OK]
ac/ppc[OK]
ac/sparc[OK]
ac/sparc64[OK]

Advanced Search
main()
Powered by PLD Linux
(c) 2002-2018 PLD Team
$Revision: 1.37 $
Powered by NASA.
Your IP: 54.166.141.69

fonttools bf7a9bc4-dc84-4b04-ba1e-2a15447d6204

Status:Failed
Source URL:ftp://buildlogs.pld-linux.org/th/x86_64/FAIL/fonttools,bf7a9bc4-dc84-4b04-ba1e-2a15447d6204.bz2
text/plain URL:View!
full text:View!
rpm -qa of builder:View!
Date:2018/07/03 19:59:09
Runtime:0:02:02.485465

Toc:

  • error 1
  • /tmp/B.OpIyBV/BUILD/fonttools-3.24.1/build-2/lib/fontTools/cffLib/__init__.py:docstring of fontTools.cffLib.DictCompiler.arg_delta_blend:4: ERROR: Unexpected indentation.
  • error 2
  • /tmp/B.OpIyBV/BUILD/fonttools-3.24.1/build-2/lib/fontTools/cffLib/__init__.py:docstring of fontTools.cffLib.DictCompiler.arg_delta_blend:14: ERROR: Unexpected indentation.
  • error 3
  • /tmp/B.OpIyBV/BUILD/fonttools-3.24.1/build-2/lib/fontTools/designspaceLib/__init__.py:docstring of fontTools.designspaceLib.DesignSpaceDocument.check:3: ERROR: Unexpected indentation.
  • error 4
  • /tmp/B.OpIyBV/BUILD/fonttools-3.24.1/build-2/lib/fontTools/designspaceLib/__init__.py:docstring of fontTools.designspaceLib.RuleDescriptor:3: ERROR: Unexpected indentation.
  • error 5
  • /tmp/B.OpIyBV/BUILD/fonttools-3.24.1/build-2/lib/fontTools/feaLib/builder.py:docstring of fontTools.feaLib.builder.Builder.add_to_cv_num_named_params:1: ERROR: Unknown target name: "self.cv_num_named_params".
  • error 6
  • /tmp/B.OpIyBV/BUILD/fonttools-3.24.1/build-2/lib/fontTools/misc/loggingTools.py:docstring of fontTools.misc.loggingTools.configLogger:28: ERROR: Unexpected indentation.
  • error 7
  • /tmp/B.OpIyBV/BUILD/fonttools-3.24.1/build-2/lib/fontTools/pens/basePen.py:docstring of fontTools.pens.basePen:26: ERROR: Unknown target name: "t".
  • error 8
  • /tmp/B.OpIyBV/BUILD/fonttools-3.24.1/build-2/lib/fontTools/pens/boundsPen.py:docstring of fontTools.pens.boundsPen.BoundsPen:8: ERROR: Unexpected indentation.
  • error 9
  • /tmp/B.OpIyBV/BUILD/fonttools-3.24.1/build-2/lib/fontTools/pens/boundsPen.py:docstring of fontTools.pens.boundsPen.ControlBoundsPen:8: ERROR: Unexpected indentation.
  • error 10
  • docstring of fontTools.subset:29: ERROR: Unexpected indentation.
  • error 11
  • docstring of fontTools.subset:79: ERROR: Unexpected indentation.
  • error 12
  • docstring of fontTools.subset:104: ERROR: Unexpected indentation.
  • error 13
  • docstring of fontTools.subset:136: ERROR: Unexpected indentation.
  • error 14
  • docstring of fontTools.subset:181: ERROR: Unexpected indentation.
  • error 15
  • docstring of fontTools.subset:199: ERROR: Unexpected indentation.
  • error 16
  • docstring of fontTools.subset:210: ERROR: Unexpected indentation.
  • error 17
  • docstring of fontTools.subset:223: ERROR: Unexpected indentation.
  • error 18
  • docstring of fontTools.subset:227: ERROR: Unexpected indentation.
  • error 19
  • /tmp/B.OpIyBV/BUILD/fonttools-3.24.1/build-2/lib/fontTools/ttLib/tables/_c_m_a_p.py:docstring of fontTools.ttLib.tables._c_m_a_p.table__c_m_a_p.getBestCmap:6: ERROR: Unexpected indentation.
  • error 20
  • /tmp/B.OpIyBV/BUILD/fonttools-3.24.1/build-2/lib/fontTools/ttLib/tables/otBase.py:docstring of fontTools.ttLib.tables.otBase.BaseTTXConverter.compile:3: ERROR: Unexpected indentation.
  • error 21
  • /tmp/B.OpIyBV/BUILD/fonttools-3.24.1/build-2/lib/fontTools/ttLib/tables/otTables.py:docstring of fontTools.ttLib.tables.otTables.fixLookupOverFlows:5: ERROR: Unexpected indentation.
  • error 22
  • /tmp/B.OpIyBV/BUILD/fonttools-3.24.1/build-2/lib/fontTools/ttLib/tables/otTables.py:docstring of fontTools.ttLib.tables.otTables.fixLookupOverFlows:8: ERROR: Unexpected indentation.
  • error 23
  • /tmp/B.OpIyBV/BUILD/fonttools-3.24.1/build-2/lib/fontTools/ttLib/tables/otTables.py:docstring of fontTools.ttLib.tables.otTables.fixLookupOverFlows:15: ERROR: Unexpected indentation.
  • error 24
  • /tmp/B.OpIyBV/BUILD/fonttools-3.24.1/build-2/lib/fontTools/ttLib/tables/S_V_G_.py:docstring of fontTools.ttLib.tables.S_V_G_:11: ERROR: Unexpected indentation.
  • error 25
  • /tmp/B.OpIyBV/BUILD/fonttools-3.24.1/build-2/lib/fontTools/ttLib/tables/S_V_G_.py:docstring of fontTools.ttLib.tables.S_V_G_:24: ERROR: Unexpected indentation.
  • error 26
  • /tmp/B.OpIyBV/BUILD/fonttools-3.24.1/build-2/lib/fontTools/ttLib/tables/S_V_G_.py:docstring of fontTools.ttLib.tables.S_V_G_:30: ERROR: Unexpected indentation.
  • error 27
  • docstring of fontTools.ttx:17: ERROR: Unexpected indentation.
  • error 28
  • docstring of fontTools.ttx:22: ERROR: Unexpected indentation.
  • error 29
  • docstring of fontTools.ttx:29: ERROR: Unexpected indentation.
  • error 30
  • docstring of fontTools.ttx:52: ERROR: Unexpected indentation.
  • error 31
  • docstring of fontTools.ttx:73: ERROR: Unexpected indentation.
  • error 32
  • /tmp/B.OpIyBV/BUILD/fonttools-3.24.1/build-2/lib/fontTools/varLib/models.py:docstring of fontTools.varLib.models.VariationModel:8: ERROR: Unexpected indentation.
  • error 33
  • E AssertionError: False is not true
  • error 34
  • error: Bad exit status from /tmp/B.OpIyBV/BUILD/tmp/rpm-tmp.98604 (%build)
  • error 35
  • RPM build errors:
  • error 36
  • error: No files produced.

Content:

Lib/fontTools/misc/eexec.py ..
Lib/fontTools/misc/filenames.py ...
Lib/fontTools/misc/loggingTools.py ....
Lib/fontTools/misc/textTools.py .
Lib/fontTools/misc/timeTools.py .
Lib/fontTools/misc/transform.py ....................
Lib/fontTools/pens/filterPen.py .
Lib/fontTools/pens/recordingPen.py .
Lib/fontTools/pens/svgPathPen.py .......
Lib/fontTools/ttLib/sfnt.py .
Lib/fontTools/ttLib/woff2.py .....
Lib/fontTools/ttLib/tables/O_S_2f_2.py .
Lib/fontTools/ttLib/tables/__init__.py .
Lib/fontTools/ttLib/tables/_f_p_g_m.py .
Lib/fontTools/ttLib/tables/_g_l_y_f.py ............
Lib/fontTools/ttLib/tables/ttProgram.py ..
Lib/fontTools/unicodedata/__init__.py ...
Lib/fontTools/varLib/models.py ....
=========================== short test summary info ============================
SKIP [1] Tests/varLib/interpolatable_test.py:74: scipy or munkres not installed
SKIP [21] /tmp/B.OpIyBV/BUILD/fonttools-3.24.1/Tests/pens/reverseContourPen_test.py:300: ufoLib not installed
SKIP [1] /usr/share/python2.7/site-packages/_pytest/doctest.py:210: unable to import module local('/tmp/B.OpIyBV/BUILD/fonttools-3.24.1/Lib/fontTools/pens/reportLabPen.py')
SKIP [1] Tests/misc/py23_test.py:397: requires 'narrow' Python 2.7 build
SKIP [1] Tests/misc/macRes_test.py:67: Not supported on "linux2"
SKIP [1] Tests/varLib/interpolatable_test.py:87: scipy or munkres not installed
SKIP [1] Tests/ttLib/tables/_g_l_y_f_test.py:52: __round___ requires Python 3
SKIP [1] Tests/misc/py23_test.py:410: requires 'narrow' Python 2.7 build
SKIP [1] /usr/share/python2.7/site-packages/_pytest/doctest.py:210: unable to import module local('/tmp/B.OpIyBV/BUILD/fonttools-3.24.1/Lib/fontTools/misc/symfont.py')
XFAIL Tests/designspaceLib/designspace_test.py::test_check
  The check method requires MutatorMath

============= 2440 passed, 29 skipped, 1 xfailed in 20.26 seconds ==============
+ pwd
+ PYTHONPATH=/tmp/B.OpIyBV/BUILD/fonttools-3.24.1/build-2/lib /usr/bin/make -Otarget -j9 -C Doc html 'SPHINXBUILD=sphinx-build-2'
make: Entering directory '/tmp/B.OpIyBV/BUILD/fonttools-3.24.1/Doc'
Running Sphinx v1.5.5
making output directory...
loading pickled environment... not yet created
building [mo]: targets for 0 po files that are out of date
building [html]: targets for 55 source files that are out of date
updating environment: 55 added, 0 changed, 0 removed
reading sources... [  1%] afmLib
reading sources... [  3%] agl
reading sources... [  5%] cffLib
reading sources... [  7%] designspaceLib/index
reading sources... [  9%] designspaceLib/readme
reading sources... [ 10%] designspaceLib/scripting
reading sources... [ 12%] encodings
reading sources... [ 14%] feaLib
reading sources... [ 16%] index
reading sources... [ 18%] inspect
Unable to init server: Could not connect: Connection refused
Unable to init server: Could not connect: Connection refused
reading sources... [ 20%] merge
reading sources... [ 21%] misc/arrayTools
reading sources... [ 23%] misc/bezierTools
reading sources... [ 25%] misc/classifyTools
reading sources... [ 27%] misc/eexec
reading sources... [ 29%] misc/encodingTools
reading sources... [ 30%] misc/fixedTools
reading sources... [ 32%] misc/index
reading sources... [ 34%] misc/loggingTools
reading sources... [ 36%] misc/psCharStrings
reading sources... [ 38%] misc/sstruct
reading sources... [ 40%] misc/testTools
reading sources... [ 41%] misc/textTools
reading sources... [ 43%] misc/timeTools
reading sources... [ 45%] misc/transform
reading sources... [ 47%] misc/xmlReader
reading sources... [ 49%] misc/xmlWriter
reading sources... [ 50%] pens/areaPen
reading sources... [ 52%] pens/basePen
reading sources... [ 54%] pens/boundsPen
reading sources... [ 56%] pens/filterPen
reading sources... [ 58%] pens/index
reading sources... [ 60%] pens/perimeterPen
reading sources... [ 61%] pens/pointInsidePen
reading sources... [ 63%] pens/recordingPen
reading sources... [ 65%] pens/statisticsPen
reading sources... [ 67%] pens/t2CharStringPen
reading sources... [ 69%] pens/teePen
reading sources... [ 70%] pens/transformPen
reading sources... [ 72%] subset
reading sources... [ 74%] t1Lib
reading sources... [ 76%] ttLib/index
reading sources... [ 78%] ttLib/macUtils
reading sources... [ 80%] ttLib/sfnt
reading sources... [ 81%] ttLib/tables
reading sources... [ 83%] ttLib/woff2
reading sources... [ 85%] ttx
reading sources... [ 87%] varLib/designspace
reading sources... [ 89%] varLib/index
reading sources... [ 90%] varLib/interpolatable
reading sources... [ 92%] varLib/interpolate_layout
reading sources... [ 94%] varLib/merger
reading sources... [ 96%] varLib/models
reading sources... [ 98%] varLib/mutator
reading sources... [100%] voltLib

/tmp/B.OpIyBV/BUILD/fonttools-3.24.1/build-2/lib/fontTools/cffLib/__init__.py:docstring of fontTools.cffLib.DictCompiler.arg_delta_blend:4: ERROR: Unexpected indentation.
/tmp/B.OpIyBV/BUILD/fonttools-3.24.1/build-2/lib/fontTools/cffLib/__init__.py:docstring of fontTools.cffLib.DictCompiler.arg_delta_blend:8: WARNING: Block quote ends without a blank line; unexpected unindent.
/tmp/B.OpIyBV/BUILD/fonttools-3.24.1/build-2/lib/fontTools/cffLib/__init__.py:docstring of fontTools.cffLib.DictCompiler.arg_delta_blend:14: ERROR: Unexpected indentation.
/tmp/B.OpIyBV/BUILD/fonttools-3.24.1/build-2/lib/fontTools/cffLib/__init__.py:docstring of fontTools.cffLib.DictCompiler.arg_delta_blend:20: WARNING: Block quote ends without a blank line; unexpected unindent.
/tmp/B.OpIyBV/BUILD/fonttools-3.24.1/build-2/lib/fontTools/designspaceLib/__init__.py:docstring of fontTools.designspaceLib.DesignSpaceDocument.check:3: ERROR: Unexpected indentation.
/tmp/B.OpIyBV/BUILD/fonttools-3.24.1/build-2/lib/fontTools/designspaceLib/__init__.py:docstring of fontTools.designspaceLib.RuleDescriptor:3: ERROR: Unexpected indentation.
/tmp/B.OpIyBV/BUILD/fonttools-3.24.1/build-2/lib/fontTools/designspaceLib/__init__.py:docstring of fontTools.designspaceLib.RuleDescriptor:9: WARNING: Definition list ends without a blank line; unexpected unindent.
/tmp/B.OpIyBV/BUILD/fonttools-3.24.1/build-2/lib/fontTools/designspaceLib/__init__.py:docstring of fontTools.designspaceLib.RuleDescriptor:10: WARNING: Block quote ends without a blank line; unexpected unindent.
/tmp/B.OpIyBV/BUILD/fonttools-3.24.1/Doc/source/feaLib.rst:3: SEVERE: Duplicate ID: "module-fontTools.feaLib.parser".
/tmp/B.OpIyBV/BUILD/fonttools-3.24.1/build-2/lib/fontTools/feaLib/builder.py:docstring of fontTools.feaLib.builder.Builder.add_to_cv_num_named_params:1: ERROR: Unknown target name: "self.cv_num_named_params".
/tmp/B.OpIyBV/BUILD/fonttools-3.24.1/build-2/lib/fontTools/misc/bezierTools.py:docstring of fontTools.misc.bezierTools.solveQuadratic:3: WARNING: Definition list ends without a blank line; unexpected unindent.
/tmp/B.OpIyBV/BUILD/fonttools-3.24.1/build-2/lib/fontTools/misc/bezierTools.py:docstring of fontTools.misc.bezierTools.solveCubic:3: WARNING: Definition list ends without a blank line; unexpected unindent.
/tmp/B.OpIyBV/BUILD/fonttools-3.24.1/build-2/lib/fontTools/misc/loggingTools.py:docstring of fontTools.misc.loggingTools.configLogger:25: WARNING: Definition list ends without a blank line; unexpected unindent.
/tmp/B.OpIyBV/BUILD/fonttools-3.24.1/build-2/lib/fontTools/misc/loggingTools.py:docstring of fontTools.misc.loggingTools.configLogger:28: ERROR: Unexpected indentation.
/tmp/B.OpIyBV/BUILD/fonttools-3.24.1/build-2/lib/fontTools/misc/loggingTools.py:docstring of fontTools.misc.loggingTools.configLogger:30: WARNING: Block quote ends without a blank line; unexpected unindent.
/tmp/B.OpIyBV/BUILD/fonttools-3.24.1/build-2/lib/fontTools/pens/basePen.py:docstring of fontTools.pens.basePen:26: ERROR: Unknown target name: "t".
/tmp/B.OpIyBV/BUILD/fonttools-3.24.1/build-2/lib/fontTools/pens/boundsPen.py:docstring of fontTools.pens.boundsPen.BoundsPen:8: ERROR: Unexpected indentation.
/tmp/B.OpIyBV/BUILD/fonttools-3.24.1/build-2/lib/fontTools/pens/boundsPen.py:docstring of fontTools.pens.boundsPen.ControlBoundsPen:8: ERROR: Unexpected indentation.
/tmp/B.OpIyBV/BUILD/fonttools-3.24.1/build-2/lib/fontTools/pens/recordingPen.py:docstring of fontTools.pens.recordingPen.RecordingPen:7: SEVERE: Unexpected section title.

Usage example:
==============
docstring of fontTools.subset:29: ERROR: Unexpected indentation.
docstring of fontTools.subset:32: WARNING: Block quote ends without a blank line; unexpected unindent.
docstring of fontTools.subset:35: WARNING: Option list ends without a blank line; unexpected unindent.
docstring of fontTools.subset:40: WARNING: Definition list ends without a blank line; unexpected unindent.
docstring of fontTools.subset:48: WARNING: Option list ends without a blank line; unexpected unindent.
docstring of fontTools.subset:55: WARNING: Definition list ends without a blank line; unexpected unindent.
docstring of fontTools.subset:64: WARNING: Option list ends without a blank line; unexpected unindent.
docstring of fontTools.subset:68: WARNING: Definition list ends without a blank line; unexpected unindent.
docstring of fontTools.subset:79: ERROR: Unexpected indentation.
docstring of fontTools.subset:104: ERROR: Unexpected indentation.
docstring of fontTools.subset:105: WARNING: Block quote ends without a blank line; unexpected unindent.
docstring of fontTools.subset:125: WARNING: Option list ends without a blank line; unexpected unindent.
docstring of fontTools.subset:136: ERROR: Unexpected indentation.
docstring of fontTools.subset:168: WARNING: Option list ends without a blank line; unexpected unindent.
docstring of fontTools.subset:181: ERROR: Unexpected indentation.
docstring of fontTools.subset:185: WARNING: Definition list ends without a blank line; unexpected unindent.
docstring of fontTools.subset:187: WARNING: Option list ends without a blank line; unexpected unindent.
docstring of fontTools.subset:199: ERROR: Unexpected indentation.
docstring of fontTools.subset:201: WARNING: Definition list ends without a blank line; unexpected unindent.
docstring of fontTools.subset:206: WARNING: Option list ends without a blank line; unexpected unindent.
docstring of fontTools.subset:210: ERROR: Unexpected indentation.
docstring of fontTools.subset:214: WARNING: Definition list ends without a blank line; unexpected unindent.
docstring of fontTools.subset:223: ERROR: Unexpected indentation.
docstring of fontTools.subset:227: ERROR: Unexpected indentation.
docstring of fontTools.subset:233: WARNING: Block quote ends without a blank line; unexpected unindent.
docstring of fontTools.subset:239: WARNING: Option list ends without a blank line; unexpected unindent.
docstring of fontTools.subset:243: WARNING: Definition list ends without a blank line; unexpected unindent.
/tmp/B.OpIyBV/BUILD/fonttools-3.24.1/build-2/lib/fontTools/ttLib/tables/_c_m_a_p.py:docstring of fontTools.ttLib.tables._c_m_a_p.table__c_m_a_p.getBestCmap:6: ERROR: Unexpected indentation.
/tmp/B.OpIyBV/BUILD/fonttools-3.24.1/build-2/lib/fontTools/ttLib/tables/_c_m_a_p.py:docstring of fontTools.ttLib.tables._c_m_a_p.table__c_m_a_p.getBestCmap:7: WARNING: Block quote ends without a blank line; unexpected unindent.
/tmp/B.OpIyBV/BUILD/fonttools-3.24.1/build-2/lib/fontTools/ttLib/tables/otBase.py:docstring of fontTools.ttLib.tables.otBase.BaseTTXConverter.compile:3: ERROR: Unexpected indentation.
/tmp/B.OpIyBV/BUILD/fonttools-3.24.1/build-2/lib/fontTools/ttLib/tables/otBase.py:docstring of fontTools.ttLib.tables.otBase.BaseTTXConverter.compile:6: WARNING: Bullet list ends without a blank line; unexpected unindent.
/tmp/B.OpIyBV/BUILD/fonttools-3.24.1/build-2/lib/fontTools/ttLib/tables/otBase.py:docstring of fontTools.ttLib.tables.otBase.BaseTTXConverter.compile:12: WARNING: Block quote ends without a blank line; unexpected unindent.
/tmp/B.OpIyBV/BUILD/fonttools-3.24.1/build-2/lib/fontTools/ttLib/tables/otTables.py:docstring of fontTools.ttLib.tables.otTables.fixLookupOverFlows:5: ERROR: Unexpected indentation.
/tmp/B.OpIyBV/BUILD/fonttools-3.24.1/build-2/lib/fontTools/ttLib/tables/otTables.py:docstring of fontTools.ttLib.tables.otTables.fixLookupOverFlows:8: ERROR: Unexpected indentation.
/tmp/B.OpIyBV/BUILD/fonttools-3.24.1/build-2/lib/fontTools/ttLib/tables/otTables.py:docstring of fontTools.ttLib.tables.otTables.fixLookupOverFlows:13: WARNING: Definition list ends without a blank line; unexpected unindent.
/tmp/B.OpIyBV/BUILD/fonttools-3.24.1/build-2/lib/fontTools/ttLib/tables/otTables.py:docstring of fontTools.ttLib.tables.otTables.fixLookupOverFlows:15: ERROR: Unexpected indentation.
/tmp/B.OpIyBV/BUILD/fonttools-3.24.1/build-2/lib/fontTools/ttLib/tables/otTables.py:docstring of fontTools.ttLib.tables.otTables.fixLookupOverFlows:19: WARNING: Block quote ends without a blank line; unexpected unindent.
/tmp/B.OpIyBV/BUILD/fonttools-3.24.1/build-2/lib/fontTools/ttLib/tables/S_V_G_.py:docstring of fontTools.ttLib.tables.S_V_G_:11: ERROR: Unexpected indentation.
/tmp/B.OpIyBV/BUILD/fonttools-3.24.1/build-2/lib/fontTools/ttLib/tables/S_V_G_.py:docstring of fontTools.ttLib.tables.S_V_G_:13: WARNING: Definition list ends without a blank line; unexpected unindent.
/tmp/B.OpIyBV/BUILD/fonttools-3.24.1/build-2/lib/fontTools/ttLib/tables/S_V_G_.py:docstring of fontTools.ttLib.tables.S_V_G_:14: WARNING: Block quote ends without a blank line; unexpected unindent.
/tmp/B.OpIyBV/BUILD/fonttools-3.24.1/build-2/lib/fontTools/ttLib/tables/S_V_G_.py:docstring of fontTools.ttLib.tables.S_V_G_:17: WARNING: Definition list ends without a blank line; unexpected unindent.
/tmp/B.OpIyBV/BUILD/fonttools-3.24.1/build-2/lib/fontTools/ttLib/tables/S_V_G_.py:docstring of fontTools.ttLib.tables.S_V_G_:24: ERROR: Unexpected indentation.
/tmp/B.OpIyBV/BUILD/fonttools-3.24.1/build-2/lib/fontTools/ttLib/tables/S_V_G_.py:docstring of fontTools.ttLib.tables.S_V_G_:27: WARNING: Block quote ends without a blank line; unexpected unindent.
/tmp/B.OpIyBV/BUILD/fonttools-3.24.1/build-2/lib/fontTools/ttLib/tables/S_V_G_.py:docstring of fontTools.ttLib.tables.S_V_G_:30: ERROR: Unexpected indentation.
/tmp/B.OpIyBV/BUILD/fonttools-3.24.1/build-2/lib/fontTools/ttLib/tables/S_V_G_.py:docstring of fontTools.ttLib.tables.S_V_G_:33: WARNING: Block quote ends without a blank line; unexpected unindent.
/tmp/B.OpIyBV/BUILD/fonttools-3.24.1/build-2/lib/fontTools/ttLib/tables/S_V_G_.py:docstring of fontTools.ttLib.tables.S_V_G_:34: WARNING: Definition list ends without a blank line; unexpected unindent.
/tmp/B.OpIyBV/BUILD/fonttools-3.24.1/build-2/lib/fontTools/ttLib/tables/S_V_G_.py:docstring of fontTools.ttLib.tables.S_V_G_:35: WARNING: Definition list ends without a blank line; unexpected unindent.
docstring of fontTools.ttx:17: ERROR: Unexpected indentation.
docstring of fontTools.ttx:18: WARNING: Block quote ends without a blank line; unexpected unindent.
docstring of fontTools.ttx:20: WARNING: Definition list ends without a blank line; unexpected unindent.
docstring of fontTools.ttx:22: ERROR: Unexpected indentation.
docstring of fontTools.ttx:23: WARNING: Block quote ends without a blank line; unexpected unindent.
docstring of fontTools.ttx:25: WARNING: Definition list ends without a blank line; unexpected unindent.
docstring of fontTools.ttx:29: ERROR: Unexpected indentation.
docstring of fontTools.ttx:30: WARNING: Block quote ends without a blank line; unexpected unindent.
docstring of fontTools.ttx:52: ERROR: Unexpected indentation.
docstring of fontTools.ttx:60: WARNING: Block quote ends without a blank line; unexpected unindent.
docstring of fontTools.ttx:73: ERROR: Unexpected indentation.
docstring of fontTools.ttx:75: WARNING: Block quote ends without a blank line; unexpected unindent.
/tmp/B.OpIyBV/BUILD/fonttools-3.24.1/build-2/lib/fontTools/varLib/models.py:docstring of fontTools.varLib.models.VariationModel:8: ERROR: Unexpected indentation.
/tmp/B.OpIyBV/BUILD/fonttools-3.24.1/build-2/lib/fontTools/varLib/models.py:docstring of fontTools.varLib.models.VariationModel:16: WARNING: Block quote ends without a blank line; unexpected unindent.
/tmp/B.OpIyBV/BUILD/fonttools-3.24.1/Doc/source/voltLib.rst:3: SEVERE: Duplicate ID: "module-fontTools.voltLib.parser".
looking for now-outdated files... none found
pickling environment... done
checking consistency... done
preparing documents... done
writing output... [  1%] afmLib
writing output... [  3%] agl
writing output... [  5%] cffLib
writing output... [  7%] designspaceLib/index
writing output... [  9%] designspaceLib/readme
writing output... [ 10%] designspaceLib/scripting
writing output... [ 12%] encodings
writing output... [ 14%] feaLib
writing output... [ 16%] index
writing output... [ 18%] inspect
writing output... [ 20%] merge
writing output... [ 21%] misc/arrayTools
writing output... [ 23%] misc/bezierTools
writing output... [ 25%] misc/classifyTools
writing output... [ 27%] misc/eexec
writing output... [ 29%] misc/encodingTools
writing output... [ 30%] misc/fixedTools
writing output... [ 32%] misc/index
writing output... [ 34%] misc/loggingTools
writing output... [ 36%] misc/psCharStrings
writing output... [ 38%] misc/sstruct
writing output... [ 40%] misc/testTools
writing output... [ 41%] misc/textTools
writing output... [ 43%] misc/timeTools
writing output... [ 45%] misc/transform
writing output... [ 47%] misc/xmlReader
writing output... [ 49%] misc/xmlWriter
writing output... [ 50%] pens/areaPen
writing output... [ 52%] pens/basePen
writing output... [ 54%] pens/boundsPen
writing output... [ 56%] pens/filterPen
writing output... [ 58%] pens/index
writing output... [ 60%] pens/perimeterPen
writing output... [ 61%] pens/pointInsidePen
writing output... [ 63%] pens/recordingPen
writing output... [ 65%] pens/statisticsPen
writing output... [ 67%] pens/t2CharStringPen
writing output... [ 69%] pens/teePen
writing output... [ 70%] pens/transformPen
writing output... [ 72%] subset
writing output... [ 74%] t1Lib
writing output... [ 76%] ttLib/index
writing output... [ 78%] ttLib/macUtils
writing output... [ 80%] ttLib/sfnt
writing output... [ 81%] ttLib/tables
writing output... [ 83%] ttLib/woff2
writing output... [ 85%] ttx
writing output... [ 87%] varLib/designspace
writing output... [ 89%] varLib/index
writing output... [ 90%] varLib/interpolatable
writing output... [ 92%] varLib/interpolate_layout
writing output... [ 94%] varLib/merger
writing output... [ 96%] varLib/models
writing output... [ 98%] varLib/mutator
writing output... [100%] voltLib

/tmp/B.OpIyBV/BUILD/fonttools-3.24.1/Doc/source/designspaceLib/scripting.rst:35: WARNING: undefined label: source-descriptor-object (if the link has no caption the label must precede a section header)
generating indices... genindex py-modindex
highlighting module code... [  0%] fontTools.misc.arrayTools
highlighting module code... [  1%] fontTools.ttLib.macUtils
highlighting module code... [  2%] fontTools.ttLib.tables.V_O_R_G_
highlighting module code... [  3%] fontTools.agl
highlighting module code... [  4%] fontTools.ttLib
highlighting module code... [  4%] fontTools.misc.loggingTools
highlighting module code... [  5%] fontTools.ttLib.tables.C_B_D_T_
highlighting module code... [  6%] fontTools.ttLib.tables._t_r_a_k
highlighting module code... [  7%] fontTools.designspaceLib
highlighting module code... [  8%] fontTools.ttLib.tables._g_a_s_p
highlighting module code... [  8%] fontTools.feaLib.parser
highlighting module code... [  9%] fontTools.ttLib.tables.ttProgram
highlighting module code... [ 10%] fontTools.voltLib.parser
highlighting module code... [ 11%] fontTools.ttLib.tables.C_O_L_R_
highlighting module code... [ 12%] fontTools.ttLib.tables.J_S_T_F_
highlighting module code... [ 12%] fontTools.ttLib.tables.G_S_U_B_
highlighting module code... [ 13%] fontTools.ttLib.tables.C_P_A_L_
highlighting module code... [ 14%] fontTools.ttLib.tables._h_h_e_a
highlighting module code... [ 15%] fontTools.pens.basePen
highlighting module code... [ 16%] fontTools.misc.bezierTools
highlighting module code... [ 16%] fontTools.ttLib.tables._m_e_t_a
highlighting module code... [ 17%] fontTools.subset
highlighting module code... [ 18%] fontTools.ttLib.tables._p_o_s_t
highlighting module code... [ 19%] fontTools.misc.fixedTools
highlighting module code... [ 20%] fontTools.feaLib.builder
highlighting module code... [ 20%] fontTools.varLib.merger
highlighting module code... [ 21%] fontTools.ttLib.tables.sbixStrike
highlighting module code... [ 22%] fontTools.t1Lib
highlighting module code... [ 23%] fontTools.merge
highlighting module code... [ 24%] fontTools.ttLib.tables._v_m_t_x
highlighting module code... [ 24%] fontTools.ttLib.tables._g_v_a_r
highlighting module code... [ 25%] fontTools.misc.eexec
highlighting module code... [ 26%] fontTools.ttLib.tables.S_I_N_G_
highlighting module code... [ 27%] fontTools.ttLib.tables.M_E_T_A_
highlighting module code... [ 28%] fontTools.pens.boundsPen
highlighting module code... [ 28%] fontTools.ttLib.tables._c_v_a_r
highlighting module code... [ 29%] fontTools.ttLib.tables._c_m_a_p
highlighting module code... [ 30%] fontTools.ttLib.tables._f_p_g_m
highlighting module code... [ 31%] fontTools.pens.recordingPen
highlighting module code... [ 32%] fontTools.misc.xmlWriter
highlighting module code... [ 32%] fontTools.ttLib.tables.V_V_A_R_
highlighting module code... [ 33%] fontTools.ttLib.woff2
highlighting module code... [ 34%] fontTools.misc.psCharStrings
highlighting module code... [ 35%] fontTools.ttLib.tables._p_r_e_p
highlighting module code... [ 36%] fontTools.ttLib.tables.TupleVariation
highlighting module code... [ 36%] fontTools.ttLib.tables.M_A_T_H_
highlighting module code... [ 37%] fontTools.misc.timeTools
highlighting module code... [ 38%] fontTools.ttLib.tables._h_m_t_x
highlighting module code... [ 39%] fontTools.ttLib.tables._n_a_m_e
highlighting module code... [ 40%] fontTools.varLib.models
highlighting module code... [ 40%] fontTools.ttLib.tables.M_V_A_R_
highlighting module code... [ 41%] fontTools.varLib.interpolate_layout
highlighting module code... [ 42%] fontTools.ttLib.tables._a_v_a_r
highlighting module code... [ 43%] fontTools.ttLib.tables.F_F_T_M_
highlighting module code... [ 44%] fontTools.ttLib.tables.C_F_F__2
highlighting module code... [ 44%] fontTools.cffLib
highlighting module code... [ 45%] fontTools.feaLib.lexer
highlighting module code... [ 46%] fontTools.misc.transform
highlighting module code... [ 47%] fontTools.ttLib.sfnt
highlighting module code... [ 48%] fontTools.ttLib.tables.otConverters
highlighting module code... [ 48%] fontTools.ttLib.tables._l_o_c_a
highlighting module code... [ 49%] fontTools.feaLib.ast
highlighting module code... [ 50%] fontTools.ttLib.tables._h_d_m_x
highlighting module code... [ 51%] fontTools.varLib.interpolatable
highlighting module code... [ 52%] fontTools.pens.statisticsPen
highlighting module code... [ 52%] fontTools.misc.classifyTools
highlighting module code... [ 53%] fontTools.ttLib.tables.D_S_I_G_
highlighting module code... [ 54%] fontTools.pens.t2CharStringPen
highlighting module code... [ 55%] fontTools.ttLib.tables.C_F_F_
highlighting module code... [ 56%] fontTools.pens.filterPen
highlighting module code... [ 56%] fontTools.ttLib.tables.G_P_O_S_
highlighting module code... [ 57%] fontTools.ttLib.tables.C_B_L_C_
highlighting module code... [ 58%] fontTools.misc.textTools
highlighting module code... [ 59%] fontTools.misc.sstruct
highlighting module code... [ 60%] fontTools.misc.testTools
highlighting module code... [ 60%] fontTools.varLib
highlighting module code... [ 61%] fontTools.ttLib.tables.G_P_K_G_
highlighting module code... [ 62%] fontTools.varLib.mutator
highlighting module code... [ 63%] fontTools.inspect
highlighting module code... [ 64%] fontTools.ttLib.tables.O_S_2f_2
highlighting module code... [ 64%] fontTools.ttLib.tables.otBase
highlighting module code... [ 65%] fontTools.pens.pointInsidePen
highlighting module code... [ 66%] fontTools.voltLib.lexer
highlighting module code... [ 67%] fontTools.varLib.designspace
highlighting module code... [ 68%] fontTools.ttLib.tables._m_a_x_p
highlighting module code... [ 68%] fontTools.ttLib.tables.S_T_A_T_
highlighting module code... [ 69%] fontTools.pens.perimeterPen
highlighting module code... [ 70%] fontTools.voltLib.ast
highlighting module code... [ 71%] fontTools.ttLib.tables.sbixGlyph
highlighting module code... [ 72%] fontTools.varLib.varStore
highlighting module code... [ 72%] fontTools.pens.transformPen
highlighting module code... [ 73%] fontTools.ttLib.tables.asciiTable
highlighting module code... [ 74%] fontTools.ttLib.tables.S_V_G_
highlighting module code... [ 75%] fontTools.ttLib.tables._s_b_i_x
highlighting module code... [ 76%] fontTools.afmLib
highlighting module code... [ 76%] fontTools.ttLib.tables._k_e_r_n
highlighting module code... [ 77%] fontTools.ttLib.tables.E_B_L_C_
highlighting module code... [ 78%] fontTools.ttLib.tables.G_M_A_P_
highlighting module code... [ 79%] fontTools.ttLib.tables.BitmapGlyphMetrics
highlighting module code... [ 80%] fontTools.ttLib.tables.otTables
highlighting module code... [ 80%] fontTools.misc.encodingTools
highlighting module code... [ 81%] fontTools.ttLib.tables.L_T_S_H_
highlighting module code... [ 82%] fontTools.ttLib.tables._g_l_y_f
highlighting module code... [ 83%] fontTools.ttLib.tables.T_S_I__5
highlighting module code... [ 84%] fontTools.ttLib.tables._l_t_a_g
highlighting module code... [ 84%] fontTools.ttLib.tables._c_v_t
highlighting module code... [ 85%] fontTools.ttx
highlighting module code... [ 86%] fontTools.ttLib.tables.B_A_S_E_
highlighting module code... [ 87%] fontTools.misc.xmlReader
highlighting module code... [ 88%] fontTools.ttLib.tables.DefaultTable
highlighting module code... [ 88%] fontTools.ttLib.tables._h_e_a_d
highlighting module code... [ 89%] fontTools.pens.areaPen
highlighting module code... [ 90%] fontTools.ttLib.tables._f_e_a_t
highlighting module code... [ 91%] fontTools.pens.teePen
highlighting module code... [ 92%] fontTools.ttLib.tables._v_h_e_a
highlighting module code... [ 92%] fontTools.ttLib.tables.V_D_M_X_
highlighting module code... [ 93%] fontTools.ttLib.tables._f_v_a_r
highlighting module code... [ 94%] fontTools.encodings.codecs
highlighting module code... [ 95%] fontTools.ttLib.tables.H_V_A_R_
highlighting module code... [ 96%] fontTools.ttLib.tables.G_D_E_F_
highlighting module code... [ 96%] fontTools.ttLib.tables.T_S_I__1
highlighting module code... [ 97%] fontTools.ttLib.tables.T_S_I__0
highlighting module code... [ 98%] fontTools.ttLib.tables.T_S_I__3
highlighting module code... [ 99%] fontTools.ttLib.tables.T_S_I__2
highlighting module code... [100%] fontTools.ttLib.tables.E_B_D_T_

writing additional pages... search
copying static files... WARNING: html_static_path entry u'/tmp/B.OpIyBV/BUILD/fonttools-3.24.1/Doc/source/_static' does not exist
done
copying extra files... done
dumping search index in English (code: en) ... done
dumping object inventory... done
build succeeded, 83 warnings.

Build finished. The HTML pages are in build/html.
make: Leaving directory '/tmp/B.OpIyBV/BUILD/fonttools-3.24.1/Doc'
+ LDFLAGS='-Wl,--as-needed -Wl,--no-copy-dt-needed-entries -Wl,-z,relro -Wl,-z,combreloc ' 
+ export LDFLAGS
+ CFLAGS=' -O2 -fwrapv -pipe -Wformat -Werror=format-security -gdwarf-4 -fno-debug-types-section -fvar-tracking-assignments -g2 -Wp,-D_FORTIFY_SOURCE=2 -fstack-protector-strong --param=ssp-buffer-size=4 -fPIC -march=x86-64 -gdwarf-4 -fno-debug-types-section -fvar-tracking-assignments -g2 ' 
+ export CFLAGS
+ CXXFLAGS=' -O2 -fwrapv -pipe -Wformat -Werror=format-security -gdwarf-4 -fno-debug-types-section -fvar-tracking-assignments -g2 -Wp,-D_FORTIFY_SOURCE=2 -fstack-protector-strong --param=ssp-buffer-size=4 -fPIC -march=x86-64 -gdwarf-4 -fno-debug-types-section -fvar-tracking-assignments -g2 ' 
+ export CXXFLAGS
+ CC=x86_64-pld-linux-gcc 
+ export CC
+ CXX=x86_64-pld-linux-g++ 
+ export CXX
+ /usr/bin/python3 setup.py build '--build-base=build-3' test
running build
running build_py
creating build-3
creating build-3/lib
creating build-3/lib/fontTools
copying Lib/fontTools/__init__.py -> build-3/lib/fontTools
copying Lib/fontTools/__main__.py -> build-3/lib/fontTools
copying Lib/fontTools/afmLib.py -> build-3/lib/fontTools
copying Lib/fontTools/agl.py -> build-3/lib/fontTools
copying Lib/fontTools/inspect.py -> build-3/lib/fontTools
copying Lib/fontTools/merge.py -> build-3/lib/fontTools
copying Lib/fontTools/ttx.py -> build-3/lib/fontTools
copying Lib/fontTools/unicode.py -> build-3/lib/fontTools
creating build-3/lib/fontTools/cffLib
copying Lib/fontTools/cffLib/__init__.py -> build-3/lib/fontTools/cffLib
copying Lib/fontTools/cffLib/specializer.py -> build-3/lib/fontTools/cffLib
copying Lib/fontTools/cffLib/width.py -> build-3/lib/fontTools/cffLib
creating build-3/lib/fontTools/designspaceLib
copying Lib/fontTools/designspaceLib/__init__.py -> build-3/lib/fontTools/designspaceLib
creating build-3/lib/fontTools/encodings
copying Lib/fontTools/encodings/MacRoman.py -> build-3/lib/fontTools/encodings
copying Lib/fontTools/encodings/StandardEncoding.py -> build-3/lib/fontTools/encodings
copying Lib/fontTools/encodings/__init__.py -> build-3/lib/fontTools/encodings
copying Lib/fontTools/encodings/codecs.py -> build-3/lib/fontTools/encodings
creating build-3/lib/fontTools/feaLib
copying Lib/fontTools/feaLib/__init__.py -> build-3/lib/fontTools/feaLib
copying Lib/fontTools/feaLib/__main__.py -> build-3/lib/fontTools/feaLib
copying Lib/fontTools/feaLib/ast.py -> build-3/lib/fontTools/feaLib
copying Lib/fontTools/feaLib/builder.py -> build-3/lib/fontTools/feaLib
copying Lib/fontTools/feaLib/error.py -> build-3/lib/fontTools/feaLib
copying Lib/fontTools/feaLib/lexer.py -> build-3/lib/fontTools/feaLib
copying Lib/fontTools/feaLib/parser.py -> build-3/lib/fontTools/feaLib
creating build-3/lib/fontTools/misc
copying Lib/fontTools/misc/__init__.py -> build-3/lib/fontTools/misc
copying Lib/fontTools/misc/arrayTools.py -> build-3/lib/fontTools/misc
copying Lib/fontTools/misc/bezierTools.py -> build-3/lib/fontTools/misc
copying Lib/fontTools/misc/classifyTools.py -> build-3/lib/fontTools/misc
copying Lib/fontTools/misc/cliTools.py -> build-3/lib/fontTools/misc
copying Lib/fontTools/misc/eexec.py -> build-3/lib/fontTools/misc
copying Lib/fontTools/misc/encodingTools.py -> build-3/lib/fontTools/misc
copying Lib/fontTools/misc/filenames.py -> build-3/lib/fontTools/misc
copying Lib/fontTools/misc/fixedTools.py -> build-3/lib/fontTools/misc
copying Lib/fontTools/misc/loggingTools.py -> build-3/lib/fontTools/misc
copying Lib/fontTools/misc/macCreatorType.py -> build-3/lib/fontTools/misc
copying Lib/fontTools/misc/macRes.py -> build-3/lib/fontTools/misc
copying Lib/fontTools/misc/psCharStrings.py -> build-3/lib/fontTools/misc
copying Lib/fontTools/misc/psLib.py -> build-3/lib/fontTools/misc
copying Lib/fontTools/misc/psOperators.py -> build-3/lib/fontTools/misc
copying Lib/fontTools/misc/py23.py -> build-3/lib/fontTools/misc
copying Lib/fontTools/misc/sstruct.py -> build-3/lib/fontTools/misc
copying Lib/fontTools/misc/symfont.py -> build-3/lib/fontTools/misc
copying Lib/fontTools/misc/testTools.py -> build-3/lib/fontTools/misc
copying Lib/fontTools/misc/textTools.py -> build-3/lib/fontTools/misc
copying Lib/fontTools/misc/timeTools.py -> build-3/lib/fontTools/misc
copying Lib/fontTools/misc/transform.py -> build-3/lib/fontTools/misc
copying Lib/fontTools/misc/xmlReader.py -> build-3/lib/fontTools/misc
copying Lib/fontTools/misc/xmlWriter.py -> build-3/lib/fontTools/misc
creating build-3/lib/fontTools/mtiLib
copying Lib/fontTools/mtiLib/__init__.py -> build-3/lib/fontTools/mtiLib
copying Lib/fontTools/mtiLib/__main__.py -> build-3/lib/fontTools/mtiLib
creating build-3/lib/fontTools/otlLib
copying Lib/fontTools/otlLib/__init__.py -> build-3/lib/fontTools/otlLib
copying Lib/fontTools/otlLib/builder.py -> build-3/lib/fontTools/otlLib
creating build-3/lib/fontTools/pens
copying Lib/fontTools/pens/__init__.py -> build-3/lib/fontTools/pens
copying Lib/fontTools/pens/areaPen.py -> build-3/lib/fontTools/pens
copying Lib/fontTools/pens/basePen.py -> build-3/lib/fontTools/pens
copying Lib/fontTools/pens/boundsPen.py -> build-3/lib/fontTools/pens
copying Lib/fontTools/pens/cocoaPen.py -> build-3/lib/fontTools/pens
copying Lib/fontTools/pens/filterPen.py -> build-3/lib/fontTools/pens
copying Lib/fontTools/pens/momentsPen.py -> build-3/lib/fontTools/pens
copying Lib/fontTools/pens/perimeterPen.py -> build-3/lib/fontTools/pens
copying Lib/fontTools/pens/pointInsidePen.py -> build-3/lib/fontTools/pens
copying Lib/fontTools/pens/qtPen.py -> build-3/lib/fontTools/pens
copying Lib/fontTools/pens/recordingPen.py -> build-3/lib/fontTools/pens
copying Lib/fontTools/pens/reportLabPen.py -> build-3/lib/fontTools/pens
copying Lib/fontTools/pens/reverseContourPen.py -> build-3/lib/fontTools/pens
copying Lib/fontTools/pens/statisticsPen.py -> build-3/lib/fontTools/pens
copying Lib/fontTools/pens/svgPathPen.py -> build-3/lib/fontTools/pens
copying Lib/fontTools/pens/t2CharStringPen.py -> build-3/lib/fontTools/pens
copying Lib/fontTools/pens/teePen.py -> build-3/lib/fontTools/pens
copying Lib/fontTools/pens/transformPen.py -> build-3/lib/fontTools/pens
copying Lib/fontTools/pens/ttGlyphPen.py -> build-3/lib/fontTools/pens
copying Lib/fontTools/pens/wxPen.py -> build-3/lib/fontTools/pens
creating build-3/lib/fontTools/subset
copying Lib/fontTools/subset/__init__.py -> build-3/lib/fontTools/subset
copying Lib/fontTools/subset/__main__.py -> build-3/lib/fontTools/subset
creating build-3/lib/fontTools/svgLib
copying Lib/fontTools/svgLib/__init__.py -> build-3/lib/fontTools/svgLib
creating build-3/lib/fontTools/t1Lib
copying Lib/fontTools/t1Lib/__init__.py -> build-3/lib/fontTools/t1Lib
creating build-3/lib/fontTools/ttLib
copying Lib/fontTools/ttLib/__init__.py -> build-3/lib/fontTools/ttLib
copying Lib/fontTools/ttLib/macUtils.py -> build-3/lib/fontTools/ttLib
copying Lib/fontTools/ttLib/sfnt.py -> build-3/lib/fontTools/ttLib
copying Lib/fontTools/ttLib/standardGlyphOrder.py -> build-3/lib/fontTools/ttLib
copying Lib/fontTools/ttLib/ttCollection.py -> build-3/lib/fontTools/ttLib
copying Lib/fontTools/ttLib/ttFont.py -> build-3/lib/fontTools/ttLib
copying Lib/fontTools/ttLib/woff2.py -> build-3/lib/fontTools/ttLib
creating build-3/lib/fontTools/unicodedata
copying Lib/fontTools/unicodedata/Blocks.py -> build-3/lib/fontTools/unicodedata
copying Lib/fontTools/unicodedata/OTTags.py -> build-3/lib/fontTools/unicodedata
copying Lib/fontTools/unicodedata/ScriptExtensions.py -> build-3/lib/fontTools/unicodedata
copying Lib/fontTools/unicodedata/Scripts.py -> build-3/lib/fontTools/unicodedata
copying Lib/fontTools/unicodedata/__init__.py -> build-3/lib/fontTools/unicodedata
creating build-3/lib/fontTools/varLib
copying Lib/fontTools/varLib/__init__.py -> build-3/lib/fontTools/varLib
copying Lib/fontTools/varLib/__main__.py -> build-3/lib/fontTools/varLib
copying Lib/fontTools/varLib/builder.py -> build-3/lib/fontTools/varLib
copying Lib/fontTools/varLib/designspace.py -> build-3/lib/fontTools/varLib
copying Lib/fontTools/varLib/interpolatable.py -> build-3/lib/fontTools/varLib
copying Lib/fontTools/varLib/interpolate_layout.py -> build-3/lib/fontTools/varLib
copying Lib/fontTools/varLib/iup.py -> build-3/lib/fontTools/varLib
copying Lib/fontTools/varLib/merger.py -> build-3/lib/fontTools/varLib
copying Lib/fontTools/varLib/models.py -> build-3/lib/fontTools/varLib
copying Lib/fontTools/varLib/mutator.py -> build-3/lib/fontTools/varLib
copying Lib/fontTools/varLib/mvar.py -> build-3/lib/fontTools/varLib
copying Lib/fontTools/varLib/varStore.py -> build-3/lib/fontTools/varLib
creating build-3/lib/fontTools/voltLib
copying Lib/fontTools/voltLib/__init__.py -> build-3/lib/fontTools/voltLib
copying Lib/fontTools/voltLib/ast.py -> build-3/lib/fontTools/voltLib
copying Lib/fontTools/voltLib/error.py -> build-3/lib/fontTools/voltLib
copying Lib/fontTools/voltLib/lexer.py -> build-3/lib/fontTools/voltLib
copying Lib/fontTools/voltLib/parser.py -> build-3/lib/fontTools/voltLib
creating build-3/lib/fontTools/svgLib/path
copying Lib/fontTools/svgLib/path/__init__.py -> build-3/lib/fontTools/svgLib/path
copying Lib/fontTools/svgLib/path/parser.py -> build-3/lib/fontTools/svgLib/path
creating build-3/lib/fontTools/ttLib/tables
copying Lib/fontTools/ttLib/tables/B_A_S_E_.py -> build-3/lib/fontTools/ttLib/tables
copying Lib/fontTools/ttLib/tables/BitmapGlyphMetrics.py -> build-3/lib/fontTools/ttLib/tables
copying Lib/fontTools/ttLib/tables/C_B_D_T_.py -> build-3/lib/fontTools/ttLib/tables
copying Lib/fontTools/ttLib/tables/C_B_L_C_.py -> build-3/lib/fontTools/ttLib/tables
copying Lib/fontTools/ttLib/tables/C_F_F_.py -> build-3/lib/fontTools/ttLib/tables
copying Lib/fontTools/ttLib/tables/C_F_F__2.py -> build-3/lib/fontTools/ttLib/tables
copying Lib/fontTools/ttLib/tables/C_O_L_R_.py -> build-3/lib/fontTools/ttLib/tables
copying Lib/fontTools/ttLib/tables/C_P_A_L_.py -> build-3/lib/fontTools/ttLib/tables
copying Lib/fontTools/ttLib/tables/D_S_I_G_.py -> build-3/lib/fontTools/ttLib/tables
copying Lib/fontTools/ttLib/tables/DefaultTable.py -> build-3/lib/fontTools/ttLib/tables
copying Lib/fontTools/ttLib/tables/E_B_D_T_.py -> build-3/lib/fontTools/ttLib/tables
copying Lib/fontTools/ttLib/tables/E_B_L_C_.py -> build-3/lib/fontTools/ttLib/tables
copying Lib/fontTools/ttLib/tables/F_F_T_M_.py -> build-3/lib/fontTools/ttLib/tables
copying Lib/fontTools/ttLib/tables/F__e_a_t.py -> build-3/lib/fontTools/ttLib/tables
copying Lib/fontTools/ttLib/tables/G_D_E_F_.py -> build-3/lib/fontTools/ttLib/tables
copying Lib/fontTools/ttLib/tables/G_M_A_P_.py -> build-3/lib/fontTools/ttLib/tables
copying Lib/fontTools/ttLib/tables/G_P_K_G_.py -> build-3/lib/fontTools/ttLib/tables
copying Lib/fontTools/ttLib/tables/G_P_O_S_.py -> build-3/lib/fontTools/ttLib/tables
copying Lib/fontTools/ttLib/tables/G_S_U_B_.py -> build-3/lib/fontTools/ttLib/tables
copying Lib/fontTools/ttLib/tables/G__l_a_t.py -> build-3/lib/fontTools/ttLib/tables
copying Lib/fontTools/ttLib/tables/G__l_o_c.py -> build-3/lib/fontTools/ttLib/tables
copying Lib/fontTools/ttLib/tables/H_V_A_R_.py -> build-3/lib/fontTools/ttLib/tables
copying Lib/fontTools/ttLib/tables/J_S_T_F_.py -> build-3/lib/fontTools/ttLib/tables
copying Lib/fontTools/ttLib/tables/L_T_S_H_.py -> build-3/lib/fontTools/ttLib/tables
copying Lib/fontTools/ttLib/tables/M_A_T_H_.py -> build-3/lib/fontTools/ttLib/tables
copying Lib/fontTools/ttLib/tables/M_E_T_A_.py -> build-3/lib/fontTools/ttLib/tables
copying Lib/fontTools/ttLib/tables/M_V_A_R_.py -> build-3/lib/fontTools/ttLib/tables
copying Lib/fontTools/ttLib/tables/O_S_2f_2.py -> build-3/lib/fontTools/ttLib/tables
copying Lib/fontTools/ttLib/tables/S_I_N_G_.py -> build-3/lib/fontTools/ttLib/tables
copying Lib/fontTools/ttLib/tables/S_T_A_T_.py -> build-3/lib/fontTools/ttLib/tables
copying Lib/fontTools/ttLib/tables/S_V_G_.py -> build-3/lib/fontTools/ttLib/tables
copying Lib/fontTools/ttLib/tables/S__i_l_f.py -> build-3/lib/fontTools/ttLib/tables
copying Lib/fontTools/ttLib/tables/S__i_l_l.py -> build-3/lib/fontTools/ttLib/tables
copying Lib/fontTools/ttLib/tables/T_S_I_B_.py -> build-3/lib/fontTools/ttLib/tables
copying Lib/fontTools/ttLib/tables/T_S_I_D_.py -> build-3/lib/fontTools/ttLib/tables
copying Lib/fontTools/ttLib/tables/T_S_I_J_.py -> build-3/lib/fontTools/ttLib/tables
copying Lib/fontTools/ttLib/tables/T_S_I_P_.py -> build-3/lib/fontTools/ttLib/tables
copying Lib/fontTools/ttLib/tables/T_S_I_S_.py -> build-3/lib/fontTools/ttLib/tables
copying Lib/fontTools/ttLib/tables/T_S_I_V_.py -> build-3/lib/fontTools/ttLib/tables
copying Lib/fontTools/ttLib/tables/T_S_I__0.py -> build-3/lib/fontTools/ttLib/tables
copying Lib/fontTools/ttLib/tables/T_S_I__1.py -> build-3/lib/fontTools/ttLib/tables
copying Lib/fontTools/ttLib/tables/T_S_I__2.py -> build-3/lib/fontTools/ttLib/tables
copying Lib/fontTools/ttLib/tables/T_S_I__3.py -> build-3/lib/fontTools/ttLib/tables
copying Lib/fontTools/ttLib/tables/T_S_I__5.py -> build-3/lib/fontTools/ttLib/tables
copying Lib/fontTools/ttLib/tables/T_T_F_A_.py -> build-3/lib/fontTools/ttLib/tables
copying Lib/fontTools/ttLib/tables/TupleVariation.py -> build-3/lib/fontTools/ttLib/tables
copying Lib/fontTools/ttLib/tables/V_D_M_X_.py -> build-3/lib/fontTools/ttLib/tables
copying Lib/fontTools/ttLib/tables/V_O_R_G_.py -> build-3/lib/fontTools/ttLib/tables
copying Lib/fontTools/ttLib/tables/V_V_A_R_.py -> build-3/lib/fontTools/ttLib/tables
copying Lib/fontTools/ttLib/tables/__init__.py -> build-3/lib/fontTools/ttLib/tables
copying Lib/fontTools/ttLib/tables/_a_n_k_r.py -> build-3/lib/fontTools/ttLib/tables
copying Lib/fontTools/ttLib/tables/_a_v_a_r.py -> build-3/lib/fontTools/ttLib/tables
copying Lib/fontTools/ttLib/tables/_b_s_l_n.py -> build-3/lib/fontTools/ttLib/tables
copying Lib/fontTools/ttLib/tables/_c_i_d_g.py -> build-3/lib/fontTools/ttLib/tables
copying Lib/fontTools/ttLib/tables/_c_m_a_p.py -> build-3/lib/fontTools/ttLib/tables
copying Lib/fontTools/ttLib/tables/_c_v_a_r.py -> build-3/lib/fontTools/ttLib/tables
copying Lib/fontTools/ttLib/tables/_c_v_t.py -> build-3/lib/fontTools/ttLib/tables
copying Lib/fontTools/ttLib/tables/_f_e_a_t.py -> build-3/lib/fontTools/ttLib/tables
copying Lib/fontTools/ttLib/tables/_f_p_g_m.py -> build-3/lib/fontTools/ttLib/tables
copying Lib/fontTools/ttLib/tables/_f_v_a_r.py -> build-3/lib/fontTools/ttLib/tables
copying Lib/fontTools/ttLib/tables/_g_a_s_p.py -> build-3/lib/fontTools/ttLib/tables
copying Lib/fontTools/ttLib/tables/_g_c_i_d.py -> build-3/lib/fontTools/ttLib/tables
copying Lib/fontTools/ttLib/tables/_g_l_y_f.py -> build-3/lib/fontTools/ttLib/tables
copying Lib/fontTools/ttLib/tables/_g_v_a_r.py -> build-3/lib/fontTools/ttLib/tables
copying Lib/fontTools/ttLib/tables/_h_d_m_x.py -> build-3/lib/fontTools/ttLib/tables
copying Lib/fontTools/ttLib/tables/_h_e_a_d.py -> build-3/lib/fontTools/ttLib/tables
copying Lib/fontTools/ttLib/tables/_h_h_e_a.py -> build-3/lib/fontTools/ttLib/tables
copying Lib/fontTools/ttLib/tables/_h_m_t_x.py -> build-3/lib/fontTools/ttLib/tables
copying Lib/fontTools/ttLib/tables/_k_e_r_n.py -> build-3/lib/fontTools/ttLib/tables
copying Lib/fontTools/ttLib/tables/_l_c_a_r.py -> build-3/lib/fontTools/ttLib/tables
copying Lib/fontTools/ttLib/tables/_l_o_c_a.py -> build-3/lib/fontTools/ttLib/tables
copying Lib/fontTools/ttLib/tables/_l_t_a_g.py -> build-3/lib/fontTools/ttLib/tables
copying Lib/fontTools/ttLib/tables/_m_a_x_p.py -> build-3/lib/fontTools/ttLib/tables
copying Lib/fontTools/ttLib/tables/_m_e_t_a.py -> build-3/lib/fontTools/ttLib/tables
copying Lib/fontTools/ttLib/tables/_m_o_r_t.py -> build-3/lib/fontTools/ttLib/tables
copying Lib/fontTools/ttLib/tables/_m_o_r_x.py -> build-3/lib/fontTools/ttLib/tables
copying Lib/fontTools/ttLib/tables/_n_a_m_e.py -> build-3/lib/fontTools/ttLib/tables
copying Lib/fontTools/ttLib/tables/_o_p_b_d.py -> build-3/lib/fontTools/ttLib/tables
copying Lib/fontTools/ttLib/tables/_p_o_s_t.py -> build-3/lib/fontTools/ttLib/tables
copying Lib/fontTools/ttLib/tables/_p_r_e_p.py -> build-3/lib/fontTools/ttLib/tables
copying Lib/fontTools/ttLib/tables/_p_r_o_p.py -> build-3/lib/fontTools/ttLib/tables
copying Lib/fontTools/ttLib/tables/_s_b_i_x.py -> build-3/lib/fontTools/ttLib/tables
copying Lib/fontTools/ttLib/tables/_t_r_a_k.py -> build-3/lib/fontTools/ttLib/tables
copying Lib/fontTools/ttLib/tables/_v_h_e_a.py -> build-3/lib/fontTools/ttLib/tables
copying Lib/fontTools/ttLib/tables/_v_m_t_x.py -> build-3/lib/fontTools/ttLib/tables
copying Lib/fontTools/ttLib/tables/asciiTable.py -> build-3/lib/fontTools/ttLib/tables
copying Lib/fontTools/ttLib/tables/grUtils.py -> build-3/lib/fontTools/ttLib/tables
copying Lib/fontTools/ttLib/tables/otBase.py -> build-3/lib/fontTools/ttLib/tables
copying Lib/fontTools/ttLib/tables/otConverters.py -> build-3/lib/fontTools/ttLib/tables
copying Lib/fontTools/ttLib/tables/otData.py -> build-3/lib/fontTools/ttLib/tables
copying Lib/fontTools/ttLib/tables/otTables.py -> build-3/lib/fontTools/ttLib/tables
copying Lib/fontTools/ttLib/tables/sbixGlyph.py -> build-3/lib/fontTools/ttLib/tables
copying Lib/fontTools/ttLib/tables/sbixStrike.py -> build-3/lib/fontTools/ttLib/tables
copying Lib/fontTools/ttLib/tables/ttProgram.py -> build-3/lib/fontTools/ttLib/tables
running egg_info
writing Lib/fonttools.egg-info/PKG-INFO
writing dependency_links to Lib/fonttools.egg-info/dependency_links.txt
writing entry points to Lib/fonttools.egg-info/entry_points.txt
writing top-level names to Lib/fonttools.egg-info/top_level.txt
reading manifest file 'Lib/fonttools.egg-info/SOURCES.txt'
reading manifest template 'MANIFEST.in'
writing manifest file 'Lib/fonttools.egg-info/SOURCES.txt'
copying Lib/fontTools/ttLib/tables/table_API_readme.txt -> build-3/lib/fontTools/ttLib/tables
running pytest
running build_ext
============================= test session starts ==============================
platform linux -- Python 3.7.0, pytest-3.0.7, py-1.4.32, pluggy-0.4.0
rootdir: /tmp/B.OpIyBV/BUILD/fonttools-3.24.1, inifile: setup.cfg
plugins: xdist-1.15.0, timeout-1.2.0, expect-1.1.0, cov-2.4.0, pyfakefs-3.4.3
collected 2468 items / 2 skipped

Tests/agl_test.py ......
Tests/merge_test.py ....
Tests/unicodedata_test.py ........
Tests/afmLib/afmLib_test.py ..
Tests/cffLib/cffLib_test.py ...
Tests/cffLib/specializer_test.py .........................................................................................................................................................................
Tests/designspaceLib/designspace_test.py ........x
Tests/encodings/codecs_test.py ....
Tests/feaLib/builder_test.py .................................................................................................................................................................................................
Tests/feaLib/error_test.py ..
Tests/feaLib/lexer_test.py ......................
Tests/feaLib/parser_test.py ......................................................................................................................................................................
Tests/misc/arrayTools_test.py ...............
Tests/misc/bezierTools_test.py ........
Tests/misc/classifyTools_test.py .
Tests/misc/eexec_test.py ..
Tests/misc/encodingTools_test.py ....
Tests/misc/filenames_test.py ......
Tests/misc/fixedTools_test.py .....
Tests/misc/loggingTools_test.py .........
Tests/misc/macRes_test.py ..s
Tests/misc/psCharStrings_test.py ...
Tests/misc/py23_test.py .................ss..........
Tests/misc/testTools_test.py .....
Tests/misc/textTools_test.py .
Tests/misc/timeTools_test.py ..
Tests/misc/transform_test.py ..................
Tests/misc/xmlReader_test.py ......
Tests/misc/xmlWriter_test.py ................
Tests/mtiLib/mti_test.py ..............................
Tests/otlLib/builder_test.py ..........................................................
Tests/pens/areaPen_test.py .........
Tests/pens/basePen_test.py ................
Tests/pens/boundsPen_test.py ..........
Tests/pens/perimeterPen_test.py ........
Tests/pens/pointInsidePen_test.py ............
Tests/pens/recordingPen_test.py ...
Tests/pens/reverseContourPen_test.py .....................sssssssssssssssssssss
Tests/pens/t2CharStringPen_test.py ..........
Tests/pens/ttGlyphPen_test.py ..............
Tests/subset/subset_test.py .....................................F
Tests/svgLib/path/parser_test.py ..........................
Tests/svgLib/path/path_test.py ...
Tests/t1Lib/t1Lib_test.py ........
Tests/ttLib/sfnt_test.py .
Tests/ttLib/woff2_test.py ssssssssssssssssssssssssssssssssssssssssssssssssssssssssssssssssssssssssssssssssssssssss
Tests/ttLib/tables/C_F_F__2_test.py ..
Tests/ttLib/tables/C_F_F_test.py ..
Tests/ttLib/tables/C_P_A_L_test.py ............
Tests/ttLib/tables/M_V_A_R_test.py ..
Tests/ttLib/tables/O_S_2f_2_test.py ....
Tests/ttLib/tables/S_T_A_T_test.py ........
Tests/ttLib/tables/T_S_I__0_test.py ......
Tests/ttLib/tables/T_S_I__1_test.py ........
Tests/ttLib/tables/TupleVariation_test.py ................................................
Tests/ttLib/tables/_a_n_k_r_test.py ...
Tests/ttLib/tables/_a_v_a_r_test.py .....
Tests/ttLib/tables/_b_s_l_n_test.py ....
Tests/ttLib/tables/_c_i_d_g_test.py ..
Tests/ttLib/tables/_c_m_a_p_test.py ..........
Tests/ttLib/tables/_c_v_a_r_test.py ......
Tests/ttLib/tables/_f_p_g_m_test.py .
Tests/ttLib/tables/_f_v_a_r_test.py ................
Tests/ttLib/tables/_g_c_i_d_test.py ..
Tests/ttLib/tables/_g_l_y_f_test.py ..................
Tests/ttLib/tables/_g_v_a_r_test.py ...........
Tests/ttLib/tables/_h_h_e_a_test.py ..........
Tests/ttLib/tables/_h_m_t_x_test.py ...............
Tests/ttLib/tables/_k_e_r_n_test.py ..................
Tests/ttLib/tables/_l_c_a_r_test.py ....
Tests/ttLib/tables/_l_t_a_g_test.py ....
Tests/ttLib/tables/_m_e_t_a_test.py ........
Tests/ttLib/tables/_m_o_r_t_test.py ..
Tests/ttLib/tables/_m_o_r_x_test.py ...........
Tests/ttLib/tables/_n_a_m_e_test.py ........................
Tests/ttLib/tables/_o_p_b_d_test.py .....
Tests/ttLib/tables/_p_r_o_p_test.py ....
Tests/ttLib/tables/_t_r_a_k_test.py ................
Tests/ttLib/tables/_v_h_e_a_test.py ...................
Tests/ttLib/tables/_v_m_t_x_test.py ...............
Tests/ttLib/tables/otBase_test.py ................
Tests/ttLib/tables/otConverters_test.py ..........................................
Tests/ttLib/tables/otTables_test.py ................................
Tests/ttLib/tables/tables_test.py ..............................................................................................................................................................................................................................................................................................................................................................................................................................................................................................................................................................................................................................................................................................................................................................
Tests/ttLib/tables/ttProgram_test.py ...
Tests/ttx/ttx_test.py ......................
Tests/varLib/builder_test.py ...........
Tests/varLib/designspace_test.py ..
Tests/varLib/interpolatable_test.py ss
Tests/varLib/interpolate_layout_test.py ........................
Tests/varLib/models_test.py ...
Tests/varLib/mutator_test.py ..
Tests/varLib/varLib_test.py ......
Tests/voltLib/lexer_test.py ....
Tests/voltLib/parser_test.py ..........................................................
Lib/fontTools/cffLib/specializer.py .
Lib/fontTools/misc/arrayTools.py ..
Lib/fontTools/misc/bezierTools.py ...........
Lib/fontTools/misc/classifyTools.py .
Lib/fontTools/misc/eexec.py ..
Lib/fontTools/misc/filenames.py ...
Lib/fontTools/misc/loggingTools.py ....
Lib/fontTools/misc/textTools.py .
Lib/fontTools/misc/timeTools.py .
Lib/fontTools/misc/transform.py ....................
Lib/fontTools/pens/filterPen.py .
Lib/fontTools/pens/recordingPen.py .
Lib/fontTools/pens/svgPathPen.py .......
Lib/fontTools/ttLib/sfnt.py .
Lib/fontTools/ttLib/woff2.py .....
Lib/fontTools/ttLib/tables/O_S_2f_2.py .
Lib/fontTools/ttLib/tables/__init__.py .
Lib/fontTools/ttLib/tables/_f_p_g_m.py .
Lib/fontTools/ttLib/tables/_g_l_y_f.py ............
Lib/fontTools/ttLib/tables/ttProgram.py ..
Lib/fontTools/unicodedata/__init__.py ...
Lib/fontTools/varLib/models.py ....
=========================== short test summary info ============================
FAIL Tests/subset/subset_test.py::SubsetTest::test_timing_publishes_parts
SKIP [1] /usr/share/python3.7/site-packages/_pytest/doctest.py:210: unable to import module local('/tmp/B.OpIyBV/BUILD/fonttools-3.24.1/Lib/fontTools/misc/symfont.py')
SKIP [1] /usr/share/python3.7/site-packages/_pytest/doctest.py:210: unable to import module local('/tmp/B.OpIyBV/BUILD/fonttools-3.24.1/Lib/fontTools/pens/reportLabPen.py')
SKIP [1] Tests/misc/macRes_test.py:67: Not supported on "linux"
SKIP [1] Tests/misc/py23_test.py:410: requires 'narrow' Python 2.7 build
SKIP [1] Tests/misc/py23_test.py:397: requires 'narrow' Python 2.7 build
SKIP [21] /tmp/B.OpIyBV/BUILD/fonttools-3.24.1/Tests/pens/reverseContourPen_test.py:300: ufoLib not installed
SKIP [88] /usr/share/python3.7/site-packages/_pytest/nose.py:23: No module named brotli
SKIP [1] Tests/varLib/interpolatable_test.py:87: scipy or munkres not installed
SKIP [1] Tests/varLib/interpolatable_test.py:74: scipy or munkres not installed
XFAIL Tests/designspaceLib/designspace_test.py::test_check
  The check method requires MutatorMath

=================================== FAILURES ===================================
____________________ SubsetTest.test_timing_publishes_parts ____________________

self = <subset_test.SubsetTest testMethod=test_timing_publishes_parts>

    def test_timing_publishes_parts(self):
        _, fontpath = self.compile_font(self.getpath("TestTTF-Regular.ttx"), ".ttf")
    
        options = subset.Options()
        options.timing = True
        subsetter = subset.Subsetter(options)
        subsetter.populate(text='ABC')
        font = TTFont(fontpath)
        with CapturingLogHandler('fontTools.subset.timer', logging.DEBUG) as captor:
            captor.logger.propagate = False
            subsetter.subset(font)
            logs = captor.records
        captor.logger.propagate = True
    
>       self.assertTrue(len(logs) > 5)
E       AssertionError: False is not true

Tests/subset/subset_test.py:341: AssertionError
======== 1 failed, 2352 passed, 116 skipped, 1 xfailed in 24.38 seconds ========
error: Bad exit status from /tmp/B.OpIyBV/BUILD/tmp/rpm-tmp.98604 (%build)


RPM build errors:
    Bad exit status from /tmp/B.OpIyBV/BUILD/tmp/rpm-tmp.98604 (%build)
ended at: Tue Jul  3 19:59:08 2018, done in 0:02:02.485465
error: No files produced.
mesg: ttyname failed: Inappropriate ioctl for device
+ chmod -R u+rwX /tmp/B.OpIyBV/BUILD
+ rm -rf /tmp/B.OpIyBV/tmp /tmp/B.OpIyBV/BUILD
mesg: ttyname failed: Inappropriate ioctl for device
+ rm -rf /tmp/B.OpIyBV
Begin-PLD-Builder-Info
Build-Time: user:120.23s sys:3.68s real:127.71s (faults io:36 non-io:423910)

End-PLD-Builder-Info
[Back to list of logs] [View rpm -qa of builder]