FailedOk

th/SRPMS[OK]
th/x32[OK]
th/i686[OK]
th/x86_64[OK]

ac/SRPMS[OK]
ac/i386[OK]
ac/i586[OK]
ac/i686[OK]
ac/alpha[OK]
ac/amd64[OK]
ac/athlon[OK]
ac/ppc[OK]
ac/sparc[OK]
ac/sparc64[OK]

Advanced Search
main()
Powered by PLD Linux
(c) 2002-2020 PLD Team
$Revision: 1.37 $
Powered by Multics.
Your IP: 35.169.107.85

framewave 180c8379-8da4-4cca-929b-aba69e6f3d12

Status:Failed
Source URL:https://buildlogs.pld-linux.org/pld/th/x86_64/FAIL/framewave,180c8379-8da4-4cca-929b-aba69e6f3d12.bz2
text/plain URL:View!
full text:View!
rpm -qa of builder:View!
Date:2020/07/28 20:17:22
Runtime:0:02:41.677612

Toc:

  • error 1
  • collect2: error: ld returned 1 exit status
  • error 2
  • error: Bad exit status from /tmp/B.M4xSmS/BUILD/tmp/rpm-tmp.8546 (%build)
  • error 3
  • RPM build errors:
  • error 4
  • error: No files produced.

Content:

In file included from sdk/SSEPlus/include/SSEPlus_SSE2.h:363,
                 from domain/common/include/system.h:164,
                 from domain/common/include/fwdev.h:19,
                 from domain/fwJPEG/src/JPEGSample.cpp:24:
sdk/SSEPlus/include/emulation/SSEPlus_emulation_SSE2.h: In function '__m128 ssp_round_ps_SSE2(__m128, int)':
sdk/SSEPlus/include/emulation/SSEPlus_emulation_SSE2.h:1020:113: note: '#pragma message: sdk/SSEPlus/include/emulation/SSEPlus_emulation_SSE2.h(1020) : NOTE SSEPlus SSE2 rounding functions overflow if input outside 32 bit integer range'
 1020 |     #pragma message( "" WARN() "SSEPlus SSE2 rounding functions overflow if input outside 32 bit integer range" )
      |                                                                                                                 ^
sdk/SSEPlus/include/emulation/SSEPlus_emulation_SSE2.h: In function '__m128d ssp_round_pd_SSE2(__m128d, int)':
sdk/SSEPlus/include/emulation/SSEPlus_emulation_SSE2.h:1055:113: note: '#pragma message: sdk/SSEPlus/include/emulation/SSEPlus_emulation_SSE2.h(1055) : NOTE SSEPlus SSE2 rounding functions overflow if input outside 32 bit integer range'
 1055 |     #pragma message( "" WARN() "SSEPlus SSE2 rounding functions overflow if input outside 32 bit integer range" )
      |                                                                                                                 ^
g++ -o domain/fwJPEG/obj/_sse2_JPEGColorConv.obj -c -Werror -O2 -DOPT_SSE2 -DOPT_PREFIX=_sse2_ -DDISPATCH=DT_SSE2 -DOPT_LEVEL=SSE2 -DNDEBUG -DLIN64 -O2 -fwrapv -pipe -Wformat -Werror=format-security -gdwarf-4 -fno-debug-types-section -fvar-tracking-assignments -g2 -Wp,-D_FORTIFY_SOURCE=2 -fstack-protector-strong --param=ssp-buffer-size=4 -Werror=trampolines -fPIC -march=x86-64 -gdwarf-4 -fno-debug-types-section -fvar-tracking-assignments -g2 -msse3 -msse2 -fPIC -Idomain -Isdk -Idomain/fwBase/include -Idomain/common/include -Idomain/common/include/Arithmetic/Impl -Idomain/common/include/Arithmetic/Def -Isdk -Isdk/SSEPlus/include/number -Isdk/SSEPlus/include/native -Isdk/SSEPlus/include/arithmetic -Isdk/SSEPlus/include/emulation -Isdk/SSEPlus/include/convert -Isdk/SSEPlus/include/logical -Isdk/SSEPlus/include/map -Isdk/SSEPlus/include/memory -Isdk/SSEPlus/include -Isdk/cbl -Isdk/external -Idomain/fwJPEG -Idomain/fwJPEG/include domain/fwJPEG/src/JPEGColorConv.cpp
g++ -o domain/fwJPEG/obj/fwJPEG_opt.obj -c -Werror -DBLD_REF_ONLY -DNDEBUG -DLIN64 -O2 -fwrapv -pipe -Wformat -Werror=format-security -gdwarf-4 -fno-debug-types-section -fvar-tracking-assignments -g2 -Wp,-D_FORTIFY_SOURCE=2 -fstack-protector-strong --param=ssp-buffer-size=4 -Werror=trampolines -fPIC -march=x86-64 -gdwarf-4 -fno-debug-types-section -fvar-tracking-assignments -g2 -fPIC -Idomain -Isdk -Idomain/fwBase/include -Idomain/common/include -Idomain/common/include/Arithmetic/Impl -Idomain/common/include/Arithmetic/Def -Isdk -Isdk/SSEPlus/include/number -Isdk/SSEPlus/include/native -Isdk/SSEPlus/include/arithmetic -Isdk/SSEPlus/include/emulation -Isdk/SSEPlus/include/convert -Isdk/SSEPlus/include/logical -Isdk/SSEPlus/include/map -Isdk/SSEPlus/include/memory -Isdk/SSEPlus/include -Isdk/cbl -Isdk/external -Idomain/fwJPEG -Idomain/fwJPEG/include domain/fwJPEG/src/fwJPEG_opt.cpp
g++ -o domain/fwJPEG/common/obj/Constants.obj -c -Werror -DBLD_REF_ONLY -DNDEBUG -DLIN64 -O2 -fwrapv -pipe -Wformat -Werror=format-security -gdwarf-4 -fno-debug-types-section -fvar-tracking-assignments -g2 -Wp,-D_FORTIFY_SOURCE=2 -fstack-protector-strong --param=ssp-buffer-size=4 -Werror=trampolines -fPIC -march=x86-64 -gdwarf-4 -fno-debug-types-section -fvar-tracking-assignments -g2 -fPIC -Idomain -Isdk -Idomain/fwBase/include -Idomain/common/include -Idomain/common/include/Arithmetic/Impl -Idomain/common/include/Arithmetic/Def -Isdk -Isdk/SSEPlus/include/number -Isdk/SSEPlus/include/native -Isdk/SSEPlus/include/arithmetic -Isdk/SSEPlus/include/emulation -Isdk/SSEPlus/include/convert -Isdk/SSEPlus/include/logical -Isdk/SSEPlus/include/map -Isdk/SSEPlus/include/memory -Isdk/SSEPlus/include -Isdk/cbl -Isdk/external -Idomain/fwJPEG -Idomain/fwJPEG/include domain/common/src/Constants.cpp
g++ -o domain/fwSignal/obj/_refr_Sqr.obj -c -Werror -DBLD_REF_ONLY -DOPT_PREFIX=_refr_ -DOPT_LEVEL=REFR -DNDEBUG -DLIN64 -DDISPATCH=DT_REFR -DOPT_REFR -O1 -fthread-jumps -fpeephole2 -fcrossjumping -foptimize-sibling-calls -fdelete-null-pointer-checks -fcse-follow-jumps -fcse-skip-blocks -fgcse -fgcse-lm -fexpensive-optimizations -frerun-cse-after-loop -fcaller-saves -fsched-interblock -fsched-spec -fregmove -freorder-blocks -freorder-functions -falign-functions -falign-jumps -falign-loops -falign-labels -ftree-vrp -ftree-pre -O2 -fwrapv -pipe -Wformat -Werror=format-security -gdwarf-4 -fno-debug-types-section -fvar-tracking-assignments -g2 -Wp,-D_FORTIFY_SOURCE=2 -fstack-protector-strong --param=ssp-buffer-size=4 -Werror=trampolines -fPIC -march=x86-64 -gdwarf-4 -fno-debug-types-section -fvar-tracking-assignments -g2 -fPIC -Idomain -Isdk -Idomain/fwBase/include -Idomain/common/include -Idomain/common/include/Arithmetic/Impl -Idomain/common/include/Arithmetic/Def -Isdk -Isdk/SSEPlus/include/number -Isdk/SSEPlus/include/native -Isdk/SSEPlus/include/arithmetic -Isdk/SSEPlus/include/emulation -Isdk/SSEPlus/include/convert -Isdk/SSEPlus/include/logical -Isdk/SSEPlus/include/map -Isdk/SSEPlus/include/memory -Isdk/SSEPlus/include -Isdk/cbl -Isdk/external -Idomain/fwSignal -Idomain/fwSignal/include domain/fwSignal/src/Sqr.cpp
g++ -o domain/fwSignal/obj/_sse2_Sqr.obj -c -Werror -O2 -DOPT_SSE2 -DOPT_PREFIX=_sse2_ -DDISPATCH=DT_SSE2 -DOPT_LEVEL=SSE2 -DNDEBUG -DLIN64 -O2 -fwrapv -pipe -Wformat -Werror=format-security -gdwarf-4 -fno-debug-types-section -fvar-tracking-assignments -g2 -Wp,-D_FORTIFY_SOURCE=2 -fstack-protector-strong --param=ssp-buffer-size=4 -Werror=trampolines -fPIC -march=x86-64 -gdwarf-4 -fno-debug-types-section -fvar-tracking-assignments -g2 -msse3 -msse2 -fPIC -Idomain -Isdk -Idomain/fwBase/include -Idomain/common/include -Idomain/common/include/Arithmetic/Impl -Idomain/common/include/Arithmetic/Def -Isdk -Isdk/SSEPlus/include/number -Isdk/SSEPlus/include/native -Isdk/SSEPlus/include/arithmetic -Isdk/SSEPlus/include/emulation -Isdk/SSEPlus/include/convert -Isdk/SSEPlus/include/logical -Isdk/SSEPlus/include/map -Isdk/SSEPlus/include/memory -Isdk/SSEPlus/include -Isdk/cbl -Isdk/external -Idomain/fwSignal -Idomain/fwSignal/include domain/fwSignal/src/Sqr.cpp
In file included from sdk/SSEPlus/include/SSEPlus_SSE2.h:363,
                 from domain/common/include/system.h:164,
                 from domain/common/include/fwdev.h:19,
                 from domain/fwJPEG/src/JPEGColorConv.cpp:31:
sdk/SSEPlus/include/emulation/SSEPlus_emulation_SSE2.h: In function '__m128 ssp_round_ps_SSE2(__m128, int)':
sdk/SSEPlus/include/emulation/SSEPlus_emulation_SSE2.h:1020:113: note: '#pragma message: sdk/SSEPlus/include/emulation/SSEPlus_emulation_SSE2.h(1020) : NOTE SSEPlus SSE2 rounding functions overflow if input outside 32 bit integer range'
 1020 |     #pragma message( "" WARN() "SSEPlus SSE2 rounding functions overflow if input outside 32 bit integer range" )
      |                                                                                                                 ^
sdk/SSEPlus/include/emulation/SSEPlus_emulation_SSE2.h: In function '__m128d ssp_round_pd_SSE2(__m128d, int)':
sdk/SSEPlus/include/emulation/SSEPlus_emulation_SSE2.h:1055:113: note: '#pragma message: sdk/SSEPlus/include/emulation/SSEPlus_emulation_SSE2.h(1055) : NOTE SSEPlus SSE2 rounding functions overflow if input outside 32 bit integer range'
 1055 |     #pragma message( "" WARN() "SSEPlus SSE2 rounding functions overflow if input outside 32 bit integer range" )
      |                                                                                                                 ^
In file included from sdk/SSEPlus/include/SSEPlus_SSE2.h:363,
                 from domain/common/include/system.h:164,
                 from domain/common/include/fwdev.h:19,
                 from domain/common/include/InitImpl.h:9,
                 from domain/common/include/Arithmetic/Impl/SqrXImpl.h:9,
                 from domain/common/include/Arithmetic/Def/SqrXDef.h:9,
                 from domain/fwSignal/src/Sqr.cpp:6:
sdk/SSEPlus/include/emulation/SSEPlus_emulation_SSE2.h: In function '__m128 ssp_round_ps_SSE2(__m128, int)':
sdk/SSEPlus/include/emulation/SSEPlus_emulation_SSE2.h:1020:113: note: '#pragma message: sdk/SSEPlus/include/emulation/SSEPlus_emulation_SSE2.h(1020) : NOTE SSEPlus SSE2 rounding functions overflow if input outside 32 bit integer range'
 1020 |     #pragma message( "" WARN() "SSEPlus SSE2 rounding functions overflow if input outside 32 bit integer range" )
      |                                                                                                                 ^
sdk/SSEPlus/include/emulation/SSEPlus_emulation_SSE2.h: In function '__m128d ssp_round_pd_SSE2(__m128d, int)':
sdk/SSEPlus/include/emulation/SSEPlus_emulation_SSE2.h:1055:113: note: '#pragma message: sdk/SSEPlus/include/emulation/SSEPlus_emulation_SSE2.h(1055) : NOTE SSEPlus SSE2 rounding functions overflow if input outside 32 bit integer range'
 1055 |     #pragma message( "" WARN() "SSEPlus SSE2 rounding functions overflow if input outside 32 bit integer range" )
      |                                                                                                                 ^
g++ -o domain/fwSignal/obj/_f10h_Sqr.obj -c -Werror -DDISPATCH=DT_F10H -DOPT_LEVEL=F10H -O2 -DNDEBUG -DLIN64 -DOPT_F10H -DOPT_PREFIX=_f10h_ -O2 -fwrapv -pipe -Wformat -Werror=format-security -gdwarf-4 -fno-debug-types-section -fvar-tracking-assignments -g2 -Wp,-D_FORTIFY_SOURCE=2 -fstack-protector-strong --param=ssp-buffer-size=4 -Werror=trampolines -fPIC -march=x86-64 -gdwarf-4 -fno-debug-types-section -fvar-tracking-assignments -g2 -msse3 -fPIC -Idomain -Isdk -Idomain/fwBase/include -Idomain/common/include -Idomain/common/include/Arithmetic/Impl -Idomain/common/include/Arithmetic/Def -Isdk -Isdk/SSEPlus/include/number -Isdk/SSEPlus/include/native -Isdk/SSEPlus/include/arithmetic -Isdk/SSEPlus/include/emulation -Isdk/SSEPlus/include/convert -Isdk/SSEPlus/include/logical -Isdk/SSEPlus/include/map -Isdk/SSEPlus/include/memory -Isdk/SSEPlus/include -Isdk/cbl -Isdk/external -Idomain/fwSignal -Idomain/fwSignal/include domain/fwSignal/src/Sqr.cpp
g++ -o domain/fwSignal/obj/_refr_Find.obj -c -Werror -DBLD_REF_ONLY -DOPT_PREFIX=_refr_ -DOPT_LEVEL=REFR -DNDEBUG -DLIN64 -DDISPATCH=DT_REFR -DOPT_REFR -O1 -fthread-jumps -fpeephole2 -fcrossjumping -foptimize-sibling-calls -fdelete-null-pointer-checks -fcse-follow-jumps -fcse-skip-blocks -fgcse -fgcse-lm -fexpensive-optimizations -frerun-cse-after-loop -fcaller-saves -fsched-interblock -fsched-spec -fregmove -freorder-blocks -freorder-functions -falign-functions -falign-jumps -falign-loops -falign-labels -ftree-vrp -ftree-pre -O2 -fwrapv -pipe -Wformat -Werror=format-security -gdwarf-4 -fno-debug-types-section -fvar-tracking-assignments -g2 -Wp,-D_FORTIFY_SOURCE=2 -fstack-protector-strong --param=ssp-buffer-size=4 -Werror=trampolines -fPIC -march=x86-64 -gdwarf-4 -fno-debug-types-section -fvar-tracking-assignments -g2 -fPIC -Idomain -Isdk -Idomain/fwBase/include -Idomain/common/include -Idomain/common/include/Arithmetic/Impl -Idomain/common/include/Arithmetic/Def -Isdk -Isdk/SSEPlus/include/number -Isdk/SSEPlus/include/native -Isdk/SSEPlus/include/arithmetic -Isdk/SSEPlus/include/emulation -Isdk/SSEPlus/include/convert -Isdk/SSEPlus/include/logical -Isdk/SSEPlus/include/map -Isdk/SSEPlus/include/memory -Isdk/SSEPlus/include -Isdk/cbl -Isdk/external -Idomain/fwSignal -Idomain/fwSignal/include domain/fwSignal/src/Find.cpp
In file included from sdk/SSEPlus/include/SSEPlus_SSE2.h:363,
                 from sdk/SSEPlus/include/SSEPlus.h:12,
                 from domain/common/include/system.h:184,
                 from domain/common/include/fwdev.h:19,
                 from domain/common/include/InitImpl.h:9,
                 from domain/common/include/Arithmetic/Impl/SqrXImpl.h:9,
                 from domain/common/include/Arithmetic/Def/SqrXDef.h:9,
                 from domain/fwSignal/src/Sqr.cpp:6:
sdk/SSEPlus/include/emulation/SSEPlus_emulation_SSE2.h: In function '__m128 ssp_round_ps_SSE2(__m128, int)':
sdk/SSEPlus/include/emulation/SSEPlus_emulation_SSE2.h:1020:113: note: '#pragma message: sdk/SSEPlus/include/emulation/SSEPlus_emulation_SSE2.h(1020) : NOTE SSEPlus SSE2 rounding functions overflow if input outside 32 bit integer range'
 1020 |     #pragma message( "" WARN() "SSEPlus SSE2 rounding functions overflow if input outside 32 bit integer range" )
      |                                                                                                                 ^
sdk/SSEPlus/include/emulation/SSEPlus_emulation_SSE2.h: In function '__m128d ssp_round_pd_SSE2(__m128d, int)':
sdk/SSEPlus/include/emulation/SSEPlus_emulation_SSE2.h:1055:113: note: '#pragma message: sdk/SSEPlus/include/emulation/SSEPlus_emulation_SSE2.h(1055) : NOTE SSEPlus SSE2 rounding functions overflow if input outside 32 bit integer range'
 1055 |     #pragma message( "" WARN() "SSEPlus SSE2 rounding functions overflow if input outside 32 bit integer range" )
      |                                                                                                                 ^
g++ -o domain/fwSignal/obj/_refr_Sqrt.obj -c -Werror -DBLD_REF_ONLY -DOPT_PREFIX=_refr_ -DOPT_LEVEL=REFR -DNDEBUG -DLIN64 -DDISPATCH=DT_REFR -DOPT_REFR -O1 -fthread-jumps -fpeephole2 -fcrossjumping -foptimize-sibling-calls -fdelete-null-pointer-checks -fcse-follow-jumps -fcse-skip-blocks -fgcse -fgcse-lm -fexpensive-optimizations -frerun-cse-after-loop -fcaller-saves -fsched-interblock -fsched-spec -fregmove -freorder-blocks -freorder-functions -falign-functions -falign-jumps -falign-loops -falign-labels -ftree-vrp -ftree-pre -O2 -fwrapv -pipe -Wformat -Werror=format-security -gdwarf-4 -fno-debug-types-section -fvar-tracking-assignments -g2 -Wp,-D_FORTIFY_SOURCE=2 -fstack-protector-strong --param=ssp-buffer-size=4 -Werror=trampolines -fPIC -march=x86-64 -gdwarf-4 -fno-debug-types-section -fvar-tracking-assignments -g2 -fPIC -Idomain -Isdk -Idomain/fwBase/include -Idomain/common/include -Idomain/common/include/Arithmetic/Impl -Idomain/common/include/Arithmetic/Def -Isdk -Isdk/SSEPlus/include/number -Isdk/SSEPlus/include/native -Isdk/SSEPlus/include/arithmetic -Isdk/SSEPlus/include/emulation -Isdk/SSEPlus/include/convert -Isdk/SSEPlus/include/logical -Isdk/SSEPlus/include/map -Isdk/SSEPlus/include/memory -Isdk/SSEPlus/include -Isdk/cbl -Isdk/external -Idomain/fwSignal -Idomain/fwSignal/include domain/fwSignal/src/Sqrt.cpp
g++ -o domain/fwSignal/obj/_sse2_Sqrt.obj -c -Werror -O2 -DOPT_SSE2 -DOPT_PREFIX=_sse2_ -DDISPATCH=DT_SSE2 -DOPT_LEVEL=SSE2 -DNDEBUG -DLIN64 -O2 -fwrapv -pipe -Wformat -Werror=format-security -gdwarf-4 -fno-debug-types-section -fvar-tracking-assignments -g2 -Wp,-D_FORTIFY_SOURCE=2 -fstack-protector-strong --param=ssp-buffer-size=4 -Werror=trampolines -fPIC -march=x86-64 -gdwarf-4 -fno-debug-types-section -fvar-tracking-assignments -g2 -msse3 -msse2 -fPIC -Idomain -Isdk -Idomain/fwBase/include -Idomain/common/include -Idomain/common/include/Arithmetic/Impl -Idomain/common/include/Arithmetic/Def -Isdk -Isdk/SSEPlus/include/number -Isdk/SSEPlus/include/native -Isdk/SSEPlus/include/arithmetic -Isdk/SSEPlus/include/emulation -Isdk/SSEPlus/include/convert -Isdk/SSEPlus/include/logical -Isdk/SSEPlus/include/map -Isdk/SSEPlus/include/memory -Isdk/SSEPlus/include -Isdk/cbl -Isdk/external -Idomain/fwSignal -Idomain/fwSignal/include domain/fwSignal/src/Sqrt.cpp
In file included from sdk/SSEPlus/include/SSEPlus_SSE2.h:363,
                 from domain/common/include/system.h:164,
                 from domain/common/include/fwdev.h:19,
                 from domain/common/include/InitImpl.h:9,
                 from domain/common/include/Arithmetic/Impl/SqrXImpl.h:9,
                 from domain/common/include/Arithmetic/Def/SqrXDef.h:9,
                 from domain/fwSignal/src/Sqrt.cpp:6:
sdk/SSEPlus/include/emulation/SSEPlus_emulation_SSE2.h: In function '__m128 ssp_round_ps_SSE2(__m128, int)':
sdk/SSEPlus/include/emulation/SSEPlus_emulation_SSE2.h:1020:113: note: '#pragma message: sdk/SSEPlus/include/emulation/SSEPlus_emulation_SSE2.h(1020) : NOTE SSEPlus SSE2 rounding functions overflow if input outside 32 bit integer range'
 1020 |     #pragma message( "" WARN() "SSEPlus SSE2 rounding functions overflow if input outside 32 bit integer range" )
      |                                                                                                                 ^
sdk/SSEPlus/include/emulation/SSEPlus_emulation_SSE2.h: In function '__m128d ssp_round_pd_SSE2(__m128d, int)':
sdk/SSEPlus/include/emulation/SSEPlus_emulation_SSE2.h:1055:113: note: '#pragma message: sdk/SSEPlus/include/emulation/SSEPlus_emulation_SSE2.h(1055) : NOTE SSEPlus SSE2 rounding functions overflow if input outside 32 bit integer range'
 1055 |     #pragma message( "" WARN() "SSEPlus SSE2 rounding functions overflow if input outside 32 bit integer range" )
      |                                                                                                                 ^
g++ -o domain/fwSignal/obj/_f10h_Sqrt.obj -c -Werror -DDISPATCH=DT_F10H -DOPT_LEVEL=F10H -O2 -DNDEBUG -DLIN64 -DOPT_F10H -DOPT_PREFIX=_f10h_ -O2 -fwrapv -pipe -Wformat -Werror=format-security -gdwarf-4 -fno-debug-types-section -fvar-tracking-assignments -g2 -Wp,-D_FORTIFY_SOURCE=2 -fstack-protector-strong --param=ssp-buffer-size=4 -Werror=trampolines -fPIC -march=x86-64 -gdwarf-4 -fno-debug-types-section -fvar-tracking-assignments -g2 -msse3 -fPIC -Idomain -Isdk -Idomain/fwBase/include -Idomain/common/include -Idomain/common/include/Arithmetic/Impl -Idomain/common/include/Arithmetic/Def -Isdk -Isdk/SSEPlus/include/number -Isdk/SSEPlus/include/native -Isdk/SSEPlus/include/arithmetic -Isdk/SSEPlus/include/emulation -Isdk/SSEPlus/include/convert -Isdk/SSEPlus/include/logical -Isdk/SSEPlus/include/map -Isdk/SSEPlus/include/memory -Isdk/SSEPlus/include -Isdk/cbl -Isdk/external -Idomain/fwSignal -Idomain/fwSignal/include domain/fwSignal/src/Sqrt.cpp
In file included from sdk/SSEPlus/include/SSEPlus_SSE2.h:363,
                 from sdk/SSEPlus/include/SSEPlus.h:12,
                 from domain/common/include/system.h:184,
                 from domain/common/include/fwdev.h:19,
                 from domain/common/include/InitImpl.h:9,
                 from domain/common/include/Arithmetic/Impl/SqrXImpl.h:9,
                 from domain/common/include/Arithmetic/Def/SqrXDef.h:9,
                 from domain/fwSignal/src/Sqrt.cpp:6:
sdk/SSEPlus/include/emulation/SSEPlus_emulation_SSE2.h: In function '__m128 ssp_round_ps_SSE2(__m128, int)':
sdk/SSEPlus/include/emulation/SSEPlus_emulation_SSE2.h:1020:113: note: '#pragma message: sdk/SSEPlus/include/emulation/SSEPlus_emulation_SSE2.h(1020) : NOTE SSEPlus SSE2 rounding functions overflow if input outside 32 bit integer range'
 1020 |     #pragma message( "" WARN() "SSEPlus SSE2 rounding functions overflow if input outside 32 bit integer range" )
      |                                                                                                                 ^
sdk/SSEPlus/include/emulation/SSEPlus_emulation_SSE2.h: In function '__m128d ssp_round_pd_SSE2(__m128d, int)':
sdk/SSEPlus/include/emulation/SSEPlus_emulation_SSE2.h:1055:113: note: '#pragma message: sdk/SSEPlus/include/emulation/SSEPlus_emulation_SSE2.h(1055) : NOTE SSEPlus SSE2 rounding functions overflow if input outside 32 bit integer range'
 1055 |     #pragma message( "" WARN() "SSEPlus SSE2 rounding functions overflow if input outside 32 bit integer range" )
      |                                                                                                                 ^
g++ -o domain/fwSignal/obj/_refr_ConversionS.obj -c -Werror -DBLD_REF_ONLY -DOPT_PREFIX=_refr_ -DOPT_LEVEL=REFR -DNDEBUG -DLIN64 -DDISPATCH=DT_REFR -DOPT_REFR -O1 -fthread-jumps -fpeephole2 -fcrossjumping -foptimize-sibling-calls -fdelete-null-pointer-checks -fcse-follow-jumps -fcse-skip-blocks -fgcse -fgcse-lm -fexpensive-optimizations -frerun-cse-after-loop -fcaller-saves -fsched-interblock -fsched-spec -fregmove -freorder-blocks -freorder-functions -falign-functions -falign-jumps -falign-loops -falign-labels -ftree-vrp -ftree-pre -O2 -fwrapv -pipe -Wformat -Werror=format-security -gdwarf-4 -fno-debug-types-section -fvar-tracking-assignments -g2 -Wp,-D_FORTIFY_SOURCE=2 -fstack-protector-strong --param=ssp-buffer-size=4 -Werror=trampolines -fPIC -march=x86-64 -gdwarf-4 -fno-debug-types-section -fvar-tracking-assignments -g2 -fPIC -Idomain -Isdk -Idomain/fwBase/include -Idomain/common/include -Idomain/common/include/Arithmetic/Impl -Idomain/common/include/Arithmetic/Def -Isdk -Isdk/SSEPlus/include/number -Isdk/SSEPlus/include/native -Isdk/SSEPlus/include/arithmetic -Isdk/SSEPlus/include/emulation -Isdk/SSEPlus/include/convert -Isdk/SSEPlus/include/logical -Isdk/SSEPlus/include/map -Isdk/SSEPlus/include/memory -Isdk/SSEPlus/include -Isdk/cbl -Isdk/external -Idomain/fwSignal -Idomain/fwSignal/include domain/fwSignal/src/ConversionS.cpp
g++ -o domain/fwJPEG/libfwJPEG.so -lpthread -Wl,-soname,libfwJPEG.so.1 -shared domain/fwJPEG/obj/_refr_JPEGHuffCodec.obj domain/fwJPEG/obj/_refr_JPEGPlanarPixel.obj domain/fwJPEG/obj/fwJPEG.obj domain/fwJPEG/obj/_refr_JPEGQuant.obj domain/fwJPEG/obj/_sse2_JPEGQuant.obj domain/fwJPEG/obj/_refr_JPEGColor.obj domain/fwJPEG/obj/_sse2_JPEGColor.obj domain/fwJPEG/obj/_refr_JPEGLevelShift.obj domain/fwJPEG/obj/_sse2_JPEGLevelShift.obj domain/fwJPEG/obj/_refr_JPEGDCT.obj domain/fwJPEG/obj/_sse2_JPEGDCT.obj domain/fwJPEG/obj/_refr_JPEGSample.obj domain/fwJPEG/obj/_sse2_JPEGSample.obj domain/fwJPEG/obj/_refr_JPEGColorConv.obj domain/fwJPEG/obj/_sse2_JPEGColorConv.obj domain/fwJPEG/obj/fwJPEG_opt.obj domain/fwJPEG/common/obj/Constants.obj -Lbuild/tmp/fwBase_release_shared_64 -lfwBase
/usr/bin/ld: cannot find -lfwBase
collect2: error: ld returned 1 exit status
scons: *** [domain/fwJPEG/libfwJPEG.so] Error 1
g++ -o domain/fwSignal/obj/_sse2_ConversionS.obj -c -Werror -O2 -DOPT_SSE2 -DOPT_PREFIX=_sse2_ -DDISPATCH=DT_SSE2 -DOPT_LEVEL=SSE2 -DNDEBUG -DLIN64 -O2 -fwrapv -pipe -Wformat -Werror=format-security -gdwarf-4 -fno-debug-types-section -fvar-tracking-assignments -g2 -Wp,-D_FORTIFY_SOURCE=2 -fstack-protector-strong --param=ssp-buffer-size=4 -Werror=trampolines -fPIC -march=x86-64 -gdwarf-4 -fno-debug-types-section -fvar-tracking-assignments -g2 -msse3 -msse2 -fPIC -Idomain -Isdk -Idomain/fwBase/include -Idomain/common/include -Idomain/common/include/Arithmetic/Impl -Idomain/common/include/Arithmetic/Def -Isdk -Isdk/SSEPlus/include/number -Isdk/SSEPlus/include/native -Isdk/SSEPlus/include/arithmetic -Isdk/SSEPlus/include/emulation -Isdk/SSEPlus/include/convert -Isdk/SSEPlus/include/logical -Isdk/SSEPlus/include/map -Isdk/SSEPlus/include/memory -Isdk/SSEPlus/include -Isdk/cbl -Isdk/external -Idomain/fwSignal -Idomain/fwSignal/include domain/fwSignal/src/ConversionS.cpp
In file included from sdk/SSEPlus/include/SSEPlus_SSE2.h:363,
                 from domain/common/include/system.h:164,
                 from domain/common/include/fwdev.h:19,
                 from domain/common/include/FwSharedCode_SSE2.h:9,
                 from domain/common/include/fe.h:8,
                 from domain/fwSignal/include/ConversionDef.h:10,
                 from domain/fwSignal/src/ConversionS.cpp:6:
sdk/SSEPlus/include/emulation/SSEPlus_emulation_SSE2.h: In function '__m128 ssp_round_ps_SSE2(__m128, int)':
sdk/SSEPlus/include/emulation/SSEPlus_emulation_SSE2.h:1020:113: note: '#pragma message: sdk/SSEPlus/include/emulation/SSEPlus_emulation_SSE2.h(1020) : NOTE SSEPlus SSE2 rounding functions overflow if input outside 32 bit integer range'
 1020 |     #pragma message( "" WARN() "SSEPlus SSE2 rounding functions overflow if input outside 32 bit integer range" )
      |                                                                                                                 ^
sdk/SSEPlus/include/emulation/SSEPlus_emulation_SSE2.h: In function '__m128d ssp_round_pd_SSE2(__m128d, int)':
sdk/SSEPlus/include/emulation/SSEPlus_emulation_SSE2.h:1055:113: note: '#pragma message: sdk/SSEPlus/include/emulation/SSEPlus_emulation_SSE2.h(1055) : NOTE SSEPlus SSE2 rounding functions overflow if input outside 32 bit integer range'
 1055 |     #pragma message( "" WARN() "SSEPlus SSE2 rounding functions overflow if input outside 32 bit integer range" )
      |                                                                                                                 ^
scons: building terminated because of errors.
error: Bad exit status from /tmp/B.M4xSmS/BUILD/tmp/rpm-tmp.8546 (%build)


RPM build errors:
    Bad exit status from /tmp/B.M4xSmS/BUILD/tmp/rpm-tmp.8546 (%build)
ended at: Tue Jul 28 20:17:22 2020, done in 0:02:41.677612
error: No files produced.
+ chmod -R u+rwX /tmp/B.M4xSmS/BUILD
+ rm -rf /tmp/B.M4xSmS/tmp /tmp/B.M4xSmS/BUILD
+ rm -rf /tmp/B.M4xSmS
Begin-PLD-Builder-Info
Build-Time: user:1164.44s sys:47.39s real:165.01s (faults io:3 non-io:11570068)

End-PLD-Builder-Info
[Back to list of logs] [View rpm -qa of builder]