FailedOk

th/SRPMS[OK]
th/x32[OK]
th/i686[OK]
th/x86_64[OK]

ac/SRPMS[OK]
ac/i386[OK]
ac/i586[OK]
ac/i686[OK]
ac/alpha[OK]
ac/amd64[OK]
ac/athlon[OK]
ac/ppc[OK]
ac/sparc[OK]
ac/sparc64[OK]

Advanced Search
main()
Powered by PLD Linux
(c) 2002-2017 PLD Team
$Revision: 1.37 $
Powered by DWARF.
Your IP: 54.81.71.31

framewave f2f635bd-d21b-4be4-a6b3-63ac516a89c9

Status:Failed
Source URL:ftp://buildlogs.pld-linux.org/th/x86_64/FAIL/framewave,f2f635bd-d21b-4be4-a6b3-63ac516a89c9.bz2
text/plain URL:View!
rpm -qa of builder:View!
Date:2017/04/15 08:09:47
Runtime:0:00:06.832185

Toc:

  • prep
  • Executing(%prep): /bin/sh -e /tmp/B.3RZ7Ot/BUILD/tmp/rpm-tmp.74117
  • build
  • Executing(%build): /bin/sh -e /tmp/B.3RZ7Ot/BUILD/tmp/rpm-tmp.74117
  • error 1
  • sdk/cbl/cbl_common_primitives.h:288:43: error: narrowing conversion of '9223512776490647552ull' from 'U64 {aka long long unsigned int}' to 'long long int' inside { } [-Wnarrowing]
  • error 2
  • sdk/cbl/cbl_common_primitives.h:288:43: error: narrowing conversion of '9223512776490647552ull' from 'U64 {aka long long unsigned int}' to 'long long int' inside { } [-Wnarrowing]
  • error 3
  • sdk/cbl/cbl_common_primitives.h:306:43: error: narrowing conversion of '9223372039002259456ull' from 'U64 {aka long long unsigned int}' to 'long long int' inside { } [-Wnarrowing]
  • error 4
  • sdk/cbl/cbl_common_primitives.h:306:43: error: narrowing conversion of '9223372039002259456ull' from 'U64 {aka long long unsigned int}' to 'long long int' inside { } [-Wnarrowing]
  • error 5
  • sdk/cbl/cbl_common_primitives.h:320:16: error: narrowing conversion of '9223372036854775808ull' from 'long long unsigned int' to 'long long int' inside { } [-Wnarrowing]
  • error 6
  • sdk/cbl/cbl_common_primitives.h:320:16: error: narrowing conversion of '9223372036854775808ull' from 'long long unsigned int' to 'long long int' inside { } [-Wnarrowing]
  • error 7
  • sdk/cbl/cbl_common_primitives.h:288:43: error: narrowing conversion of '9223512776490647552ull' from 'U64 {aka long long unsigned int}' to 'long long int' inside { } [-Wnarrowing]
  • error 8
  • sdk/cbl/cbl_common_primitives.h:288:43: error: narrowing conversion of '9223512776490647552ull' from 'U64 {aka long long unsigned int}' to 'long long int' inside { } [-Wnarrowing]
  • error 9
  • sdk/cbl/cbl_common_primitives.h:306:43: error: narrowing conversion of '9223372039002259456ull' from 'U64 {aka long long unsigned int}' to 'long long int' inside { } [-Wnarrowing]
  • error 10
  • sdk/cbl/cbl_common_primitives.h:306:43: error: narrowing conversion of '9223372039002259456ull' from 'U64 {aka long long unsigned int}' to 'long long int' inside { } [-Wnarrowing]
  • error 11
  • sdk/cbl/cbl_common_primitives.h:320:16: error: narrowing conversion of '9223372036854775808ull' from 'long long unsigned int' to 'long long int' inside { } [-Wnarrowing]
  • error 12
  • sdk/cbl/cbl_common_primitives.h:320:16: error: narrowing conversion of '9223372036854775808ull' from 'long long unsigned int' to 'long long int' inside { } [-Wnarrowing]
  • error 13
  • sdk/SSEPlus/include/SSEPlus_base.h:89:25: error: invalid suffix on literal; C++11 requires a space between literal and string macro [-Werror=literal-suffix]
  • error 14
  • sdk/cbl/cbl_common_primitives.h:306:43: error: narrowing conversion of '18446744073709551615ull' from 'U64 {aka long long unsigned int}' to 'long long int' inside { } [-Wnarrowing]
  • error 15
  • sdk/cbl/cbl_common_primitives.h:306:43: error: narrowing conversion of '18446744073709551615ull' from 'U64 {aka long long unsigned int}' to 'long long int' inside { } [-Wnarrowing]
  • error 16
  • sdk/cbl/cbl_common_primitives.h:288:43: error: narrowing conversion of '9223512776490647552ull' from 'U64 {aka long long unsigned int}' to 'long long int' inside { } [-Wnarrowing]
  • error 17
  • sdk/cbl/cbl_common_primitives.h:288:43: error: narrowing conversion of '9223512776490647552ull' from 'U64 {aka long long unsigned int}' to 'long long int' inside { } [-Wnarrowing]
  • error 18
  • sdk/cbl/cbl_common_primitives.h:306:43: error: narrowing conversion of '18446744073709551615ull' from 'U64 {aka long long unsigned int}' to 'long long int' inside { } [-Wnarrowing]
  • error 19
  • sdk/cbl/cbl_common_primitives.h:306:43: error: narrowing conversion of '9223372039002259456ull' from 'U64 {aka long long unsigned int}' to 'long long int' inside { } [-Wnarrowing]
  • error 20
  • sdk/cbl/cbl_common_primitives.h:306:43: error: narrowing conversion of '18446744073709551615ull' from 'U64 {aka long long unsigned int}' to 'long long int' inside { } [-Wnarrowing]
  • error 21
  • sdk/cbl/cbl_common_primitives.h:306:43: error: narrowing conversion of '9223372039002259456ull' from 'U64 {aka long long unsigned int}' to 'long long int' inside { } [-Wnarrowing]
  • error 22
  • sdk/cbl/cbl_common_primitives.h:320:16: error: narrowing conversion of '9223372036854775808ull' from 'long long unsigned int' to 'long long int' inside { } [-Wnarrowing]
  • error 23
  • sdk/cbl/cbl_common_primitives.h:320:16: error: narrowing conversion of '9223372036854775808ull' from 'long long unsigned int' to 'long long int' inside { } [-Wnarrowing]
  • error 24
  • domain/common/include/fwdev.h:86:12: error: expected identifier before 'static_assert'
  • error 25
  • domain/common/include/fwdev.h:86:12: error: expected unqualified-id before 'static_assert'
  • error 26
  • domain/common/include/fwdev.h:88:12: error: expected identifier before 'static_assert'
  • error 27
  • domain/common/include/fwdev.h:88:12: error: expected unqualified-id before 'static_assert'
  • error 28
  • sdk/SSEPlus/include/SSEPlus_platform.h:335:16: error: narrowing conversion of '18446744073709551615ull' from 'long long unsigned int' to 'long long int' inside { } [-Wnarrowing]
  • error 29
  • sdk/SSEPlus/include/SSEPlus_platform.h:335:16: error: narrowing conversion of '18446744073709551615ull' from 'long long unsigned int' to 'long long int' inside { } [-Wnarrowing]
  • error 30
  • sdk/SSEPlus/include/SSEPlus_platform.h:335:16: error: narrowing conversion of '18446744073709551615ull' from 'long long unsigned int' to 'long long int' inside { } [-Wnarrowing]
  • error 31
  • sdk/SSEPlus/include/SSEPlus_platform.h:335:16: error: narrowing conversion of '18446744073709551615ull' from 'long long unsigned int' to 'long long int' inside { } [-Wnarrowing]
  • error 32
  • sdk/SSEPlus/include/SSEPlus_platform.h:335:16: error: narrowing conversion of '18446744073709551615ull' from 'long long unsigned int' to 'long long int' inside { } [-Wnarrowing]
  • error 33
  • sdk/SSEPlus/include/SSEPlus_platform.h:335:16: error: narrowing conversion of '18446744073709551615ull' from 'long long unsigned int' to 'long long int' inside { } [-Wnarrowing]
  • error 34
  • sdk/cbl/cbl_common_primitives.h:288:43: error: narrowing conversion of '9223512776490647552ull' from 'U64 {aka long long unsigned int}' to 'long long int' inside { } [-Wnarrowing]
  • error 35
  • sdk/cbl/cbl_common_primitives.h:288:43: error: narrowing conversion of '9223512776490647552ull' from 'U64 {aka long long unsigned int}' to 'long long int' inside { } [-Wnarrowing]
  • error 36
  • sdk/cbl/cbl_common_primitives.h:306:43: error: narrowing conversion of '9223372039002259456ull' from 'U64 {aka long long unsigned int}' to 'long long int' inside { } [-Wnarrowing]
  • error 37
  • sdk/cbl/cbl_common_primitives.h:306:43: error: narrowing conversion of '9223372039002259456ull' from 'U64 {aka long long unsigned int}' to 'long long int' inside { } [-Wnarrowing]
  • error 38
  • sdk/cbl/cbl_common_primitives.h:320:16: error: narrowing conversion of '9223372036854775808ull' from 'long long unsigned int' to 'long long int' inside { } [-Wnarrowing]
  • error 39
  • sdk/cbl/cbl_common_primitives.h:320:16: error: narrowing conversion of '9223372036854775808ull' from 'long long unsigned int' to 'long long int' inside { } [-Wnarrowing]
  • error 40
  • sdk/cbl/cbl_common_primitives.h:306:43: error: narrowing conversion of '18446744073709551615ull' from 'U64 {aka long long unsigned int}' to 'long long int' inside { } [-Wnarrowing]
  • error 41
  • sdk/cbl/cbl_common_primitives.h:306:43: error: narrowing conversion of '18446744073709551615ull' from 'U64 {aka long long unsigned int}' to 'long long int' inside { } [-Wnarrowing]
  • error 42
  • sdk/cbl/cbl_common_primitives.h:306:43: error: narrowing conversion of '18446744073709551615ull' from 'U64 {aka long long unsigned int}' to 'long long int' inside { } [-Wnarrowing]
  • error 43
  • sdk/cbl/cbl_common_primitives.h:306:43: error: narrowing conversion of '18446744073709551615ull' from 'U64 {aka long long unsigned int}' to 'long long int' inside { } [-Wnarrowing]
  • error 44
  • domain/common/include/fwdev.h:86:12: error: expected identifier before 'static_assert'
  • error 45
  • domain/common/include/fwdev.h:86:12: error: expected unqualified-id before 'static_assert'
  • error 46
  • domain/common/include/fwdev.h:88:12: error: expected identifier before 'static_assert'
  • error 47
  • domain/common/include/fwdev.h:88:12: error: expected unqualified-id before 'static_assert'
  • error 48
  • domain/common/include/fwdev.h:39:43: error: expected '(' before '<' token
  • error 49
  • domain/common/include/fwdev.h:39:43: error: expected primary-expression before '<' token
  • error 50
  • domain/common/include/fwdev.h:39:49: error: expected primary-expression before ')' token
  • error 51
  • domain/common/include/FwSharedCode.h:380:73: error: expected ',' before ';' token
  • error 52
  • domain/common/include/FwSharedCode.h:380:73: error: expected string-literal before ';' token
  • error 53
  • domain/common/include/FwSharedCode.h:380:73: error: expected ')' before ';' token
  • error 54
  • domain/common/include/fwdev.h:39:43: error: expected '(' before '<' token
  • error 55
  • domain/common/include/fwdev.h:39:43: error: expected primary-expression before '<' token
  • error 56
  • domain/common/include/fwdev.h:39:49: error: expected primary-expression before ')' token
  • error 57
  • domain/common/include/FwSharedCode.h:381:73: error: expected ',' before ';' token
  • error 58
  • domain/common/include/FwSharedCode.h:381:73: error: expected string-literal before ';' token
  • error 59
  • domain/common/include/FwSharedCode.h:381:73: error: expected ')' before ';' token
  • error 60
  • domain/common/include/fwdev.h:39:43: error: expected '(' before '<' token
  • error 61
  • domain/common/include/fwdev.h:39:43: error: expected primary-expression before '<' token
  • error 62
  • domain/common/include/fwdev.h:39:49: error: expected primary-expression before ')' token
  • error 63
  • domain/common/include/FwSharedCode.h:382:73: error: expected ',' before ';' token
  • error 64
  • domain/common/include/FwSharedCode.h:382:73: error: expected string-literal before ';' token
  • error 65
  • domain/common/include/FwSharedCode.h:382:73: error: expected ')' before ';' token
  • error 66
  • domain/common/include/fwdev.h:39:43: error: expected '(' before '<' token
  • error 67
  • domain/common/include/fwdev.h:39:43: error: expected primary-expression before '<' token
  • error 68
  • domain/common/include/fwdev.h:39:49: error: expected primary-expression before ')' token
  • error 69
  • domain/common/include/FwSharedCode.h:384:75: error: expected ',' before ';' token
  • error 70
  • domain/common/include/FwSharedCode.h:384:75: error: expected string-literal before ';' token
  • error 71
  • domain/common/include/FwSharedCode.h:384:75: error: expected ')' before ';' token
  • error 72
  • domain/common/include/fwdev.h:39:43: error: expected '(' before '<' token
  • error 73
  • domain/common/include/fwdev.h:39:43: error: expected primary-expression before '<' token
  • error 74
  • domain/common/include/fwdev.h:39:49: error: expected primary-expression before ')' token
  • error 75
  • domain/common/include/FwSharedCode.h:385:75: error: expected ',' before ';' token
  • error 76
  • domain/common/include/FwSharedCode.h:385:75: error: expected string-literal before ';' token
  • error 77
  • domain/common/include/FwSharedCode.h:385:75: error: expected ')' before ';' token
  • error 78
  • domain/common/include/fwdev.h:39:43: error: expected '(' before '<' token
  • error 79
  • domain/common/include/fwdev.h:39:43: error: expected primary-expression before '<' token
  • error 80
  • domain/common/include/fwdev.h:39:49: error: expected primary-expression before ')' token
  • error 81
  • domain/common/include/FwSharedCode.h:386:75: error: expected ',' before ';' token
  • error 82
  • domain/common/include/FwSharedCode.h:386:75: error: expected string-literal before ';' token
  • error 83
  • domain/common/include/FwSharedCode.h:386:75: error: expected ')' before ';' token
  • error 84
  • domain/common/include/fwdev.h:39:43: error: expected '(' before '<' token
  • error 85
  • domain/common/include/fwdev.h:39:43: error: expected primary-expression before '<' token
  • error 86
  • domain/common/include/fwdev.h:39:49: error: expected primary-expression before ')' token
  • error 87
  • domain/common/include/FwSharedCode.h:388:73: error: expected ',' before ';' token
  • error 88
  • domain/common/include/FwSharedCode.h:388:73: error: expected string-literal before ';' token
  • error 89
  • domain/common/include/FwSharedCode.h:388:73: error: expected ')' before ';' token
  • error 90
  • domain/common/include/fwdev.h:39:43: error: expected '(' before '<' token
  • error 91
  • domain/common/include/fwdev.h:39:43: error: expected primary-expression before '<' token
  • error 92
  • domain/common/include/fwdev.h:39:49: error: expected primary-expression before ')' token
  • error 93
  • domain/common/include/FwSharedCode.h:389:73: error: expected ',' before ';' token
  • error 94
  • domain/common/include/FwSharedCode.h:389:73: error: expected string-literal before ';' token
  • error 95
  • domain/common/include/FwSharedCode.h:389:73: error: expected ')' before ';' token
  • error 96
  • domain/common/include/fwdev.h:39:43: error: expected '(' before '<' token
  • error 97
  • domain/common/include/fwdev.h:39:43: error: expected primary-expression before '<' token
  • error 98
  • domain/common/include/fwdev.h:39:49: error: expected primary-expression before ')' token
  • error 99
  • domain/common/include/FwSharedCode.h:390:73: error: expected ',' before ';' token
  • error 100
  • domain/common/include/FwSharedCode.h:390:73: error: expected string-literal before ';' token
  • error 101
  • domain/common/include/FwSharedCode.h:390:73: error: expected ')' before ';' token
  • error 102
  • domain/common/include/fwdev.h:39:43: error: expected '(' before '<' token
  • error 103
  • domain/common/include/fwdev.h:39:43: error: expected primary-expression before '<' token
  • error 104
  • domain/common/include/fwdev.h:39:49: error: expected primary-expression before ')' token
  • error 105
  • domain/common/include/FwSharedCode.h:392:75: error: expected ',' before ';' token
  • error 106
  • domain/common/include/FwSharedCode.h:392:75: error: expected string-literal before ';' token
  • error 107
  • domain/common/include/FwSharedCode.h:392:75: error: expected ')' before ';' token
  • error 108
  • domain/common/include/fwdev.h:39:43: error: expected '(' before '<' token
  • error 109
  • domain/common/include/fwdev.h:39:43: error: expected primary-expression before '<' token
  • error 110
  • domain/common/include/fwdev.h:39:49: error: expected primary-expression before ')' token
  • error 111
  • domain/common/include/FwSharedCode.h:393:75: error: expected ',' before ';' token
  • error 112
  • domain/common/include/FwSharedCode.h:393:75: error: expected string-literal before ';' token
  • error 113
  • domain/common/include/FwSharedCode.h:393:75: error: expected ')' before ';' token
  • error 114
  • domain/common/include/fwdev.h:39:43: error: expected '(' before '<' token
  • error 115
  • domain/common/include/fwdev.h:39:43: error: expected primary-expression before '<' token
  • error 116
  • domain/common/include/fwdev.h:39:49: error: expected primary-expression before ')' token
  • error 117
  • domain/common/include/FwSharedCode.h:394:75: error: expected ',' before ';' token
  • error 118
  • domain/common/include/FwSharedCode.h:394:75: error: expected string-literal before ';' token
  • error 119
  • domain/common/include/FwSharedCode.h:394:75: error: expected ')' before ';' token
  • error 120
  • domain/common/include/fwdev.h:39:43: error: expected '(' before '<' token
  • error 121
  • domain/common/include/fwdev.h:39:43: error: expected primary-expression before '<' token
  • error 122
  • domain/common/include/fwdev.h:39:49: error: expected primary-expression before ')' token
  • error 123
  • domain/common/include/FwSharedCode.h:395:75: error: expected ',' before ';' token
  • error 124
  • domain/common/include/FwSharedCode.h:395:75: error: expected string-literal before ';' token
  • error 125
  • domain/common/include/FwSharedCode.h:395:75: error: expected ')' before ';' token
  • error 126
  • domain/common/include/fwdev.h:39:43: error: expected '(' before '<' token
  • error 127
  • domain/common/include/fwdev.h:39:43: error: expected primary-expression before '<' token
  • error 128
  • domain/common/include/fwdev.h:39:49: error: expected primary-expression before ')' token
  • error 129
  • domain/common/include/FwSharedCode.h:396:87: error: expected ',' before ';' token
  • error 130
  • domain/common/include/FwSharedCode.h:396:87: error: expected string-literal before ';' token
  • error 131
  • domain/common/include/FwSharedCode.h:396:87: error: expected ')' before ';' token
  • error 132
  • domain/common/include/fwdev.h:39:43: error: expected '(' before '<' token
  • error 133
  • domain/common/include/fwdev.h:39:43: error: expected primary-expression before '<' token
  • error 134
  • domain/common/include/fwdev.h:39:49: error: expected primary-expression before ')' token
  • error 135
  • domain/common/include/FwSharedCode.h:397:75: error: expected ',' before ';' token
  • error 136
  • domain/common/include/FwSharedCode.h:397:75: error: expected string-literal before ';' token
  • error 137
  • domain/common/include/FwSharedCode.h:397:75: error: expected ')' before ';' token
  • error 138
  • domain/common/include/fwdev.h:39:43: error: expected '(' before '<' token
  • error 139
  • domain/common/include/fwdev.h:39:43: error: expected primary-expression before '<' token
  • error 140
  • domain/common/include/fwdev.h:39:49: error: expected primary-expression before ')' token
  • error 141
  • domain/common/include/fe.h:1611:40: error: expected ',' before ';' token
  • error 142
  • domain/common/include/fe.h:1611:40: error: expected string-literal before ';' token
  • error 143
  • domain/common/include/fe.h:1611:40: error: expected ')' before ';' token
  • error 144
  • domain/common/include/fwdev.h:39:43: error: expected '(' before '<' token
  • error 145
  • domain/common/include/fwdev.h:39:43: error: expected primary-expression before '<' token
  • error 146
  • domain/common/include/fwdev.h:39:49: error: expected primary-expression before ')' token
  • error 147
  • domain/common/include/fe.h:1619:40: error: expected ',' before ';' token
  • error 148
  • domain/common/include/fe.h:1619:40: error: expected string-literal before ';' token
  • error 149
  • domain/common/include/fe.h:1619:40: error: expected ')' before ';' token
  • error 150
  • domain/common/include/fwdev.h:39:43: error: expected '(' before '<' token
  • error 151
  • domain/common/include/fwdev.h:39:43: error: expected primary-expression before '<' token
  • error 152
  • domain/common/include/fwdev.h:39:49: error: expected primary-expression before ')' token
  • error 153
  • domain/common/include/fe.h:1813:40: error: expected ',' before ';' token
  • error 154
  • domain/common/include/fe.h:1813:40: error: expected string-literal before ';' token
  • error 155
  • domain/common/include/fe.h:1813:40: error: expected ')' before ';' token
  • error 156
  • domain/common/include/fwdev.h:39:43: error: expected '(' before '<' token
  • error 157
  • domain/common/include/fwdev.h:39:43: error: expected primary-expression before '<' token
  • error 158
  • domain/common/include/fwdev.h:39:49: error: expected primary-expression before ')' token
  • error 159
  • domain/common/include/fe.h:1822:40: error: expected ',' before ';' token
  • error 160
  • domain/common/include/fe.h:1822:40: error: expected string-literal before ';' token
  • error 161
  • domain/common/include/fe.h:1822:40: error: expected ')' before ';' token
  • error 162
  • domain/common/include/fwdev.h:39:43: error: expected '(' before '<' token
  • error 163
  • domain/common/include/fwdev.h:39:43: error: expected primary-expression before '<' token
  • error 164
  • domain/common/include/fwdev.h:39:49: error: expected primary-expression before ')' token
  • error 165
  • domain/common/include/fe.h:2024:40: error: expected ',' before ';' token
  • error 166
  • domain/common/include/fe.h:2024:40: error: expected string-literal before ';' token
  • error 167
  • domain/common/include/fe.h:2024:40: error: expected ')' before ';' token
  • error 168
  • domain/common/include/fwdev.h:39:43: error: expected '(' before '<' token
  • error 169
  • domain/common/include/fwdev.h:39:43: error: expected primary-expression before '<' token
  • error 170
  • domain/common/include/fwdev.h:39:49: error: expected primary-expression before ')' token
  • error 171
  • domain/common/include/fe.h:2034:40: error: expected ',' before ';' token
  • error 172
  • domain/common/include/fe.h:2034:40: error: expected string-literal before ';' token
  • error 173
  • domain/common/include/fe.h:2034:40: error: expected ')' before ';' token
  • error 174
  • domain/common/include/fwdev.h:39:43: error: expected '(' before '<' token
  • error 175
  • domain/common/include/fwdev.h:39:43: error: expected primary-expression before '<' token
  • error 176
  • domain/common/include/fwdev.h:39:49: error: expected primary-expression before ')' token
  • error 177
  • domain/common/include/fe.h:2244:40: error: expected ',' before ';' token
  • error 178
  • domain/common/include/fe.h:2244:40: error: expected string-literal before ';' token
  • error 179
  • domain/common/include/fe.h:2244:40: error: expected ')' before ';' token
  • error 180
  • domain/common/include/fwdev.h:39:43: error: expected '(' before '<' token
  • error 181
  • domain/common/include/fwdev.h:39:43: error: expected primary-expression before '<' token
  • error 182
  • domain/common/include/fwdev.h:39:49: error: expected primary-expression before ')' token
  • error 183
  • domain/common/include/fe.h:2253:40: error: expected ',' before ';' token
  • error 184
  • domain/common/include/fe.h:2253:40: error: expected string-literal before ';' token
  • error 185
  • domain/common/include/fe.h:2253:40: error: expected ')' before ';' token
  • error 186
  • domain/common/include/fwdev.h:39:43: error: expected '(' before '<' token
  • error 187
  • domain/common/include/fwdev.h:39:43: error: expected primary-expression before '<' token
  • error 188
  • domain/common/include/fwdev.h:39:49: error: expected primary-expression before ')' token
  • error 189
  • domain/common/include/fe.h:2470:40: error: expected ',' before ';' token
  • error 190
  • domain/common/include/fe.h:2470:40: error: expected string-literal before ';' token
  • error 191
  • domain/common/include/fe.h:2470:40: error: expected ')' before ';' token
  • error 192
  • domain/common/include/fwdev.h:39:43: error: expected '(' before '<' token
  • error 193
  • domain/common/include/fwdev.h:39:43: error: expected primary-expression before '<' token
  • error 194
  • domain/common/include/fwdev.h:39:49: error: expected primary-expression before ')' token
  • error 195
  • domain/common/include/fe.h:2479:40: error: expected ',' before ';' token
  • error 196
  • domain/common/include/fe.h:2479:40: error: expected string-literal before ';' token
  • error 197
  • domain/common/include/fe.h:2479:40: error: expected ')' before ';' token
  • error 198
  • domain/common/include/fwdev.h:39:43: error: expected '(' before '<' token
  • error 199
  • domain/common/include/fwdev.h:39:43: error: expected primary-expression before '<' token
  • error 200
  • domain/common/include/fwdev.h:39:49: error: expected primary-expression before ')' token
  • error 201
  • domain/common/include/fe.h:2706:40: error: expected ',' before ';' token
  • error 202
  • domain/common/include/fe.h:2706:40: error: expected string-literal before ';' token
  • error 203
  • domain/common/include/fe.h:2706:40: error: expected ')' before ';' token
  • error 204
  • domain/common/include/fwdev.h:39:43: error: expected '(' before '<' token
  • error 205
  • domain/common/include/fwdev.h:39:43: error: expected primary-expression before '<' token
  • error 206
  • domain/common/include/fwdev.h:39:49: error: expected primary-expression before ')' token
  • error 207
  • domain/common/include/fe.h:2715:40: error: expected ',' before ';' token
  • error 208
  • domain/common/include/fe.h:2715:40: error: expected string-literal before ';' token
  • error 209
  • domain/common/include/fe.h:2715:40: error: expected ')' before ';' token
  • error 210
  • domain/common/include/fwdev.h:39:43: error: expected '(' before '<' token
  • error 211
  • domain/common/include/fwdev.h:39:43: error: expected primary-expression before '<' token
  • error 212
  • domain/common/include/fwdev.h:39:49: error: expected primary-expression before ')' token
  • error 213
  • domain/common/include/fe.h:2960:40: error: expected ',' before ';' token
  • error 214
  • domain/common/include/fe.h:2960:40: error: expected string-literal before ';' token
  • error 215
  • domain/common/include/fe.h:2960:40: error: expected ')' before ';' token
  • error 216
  • domain/common/include/fwdev.h:39:43: error: expected '(' before '<' token
  • error 217
  • domain/common/include/fwdev.h:39:43: error: expected primary-expression before '<' token
  • error 218
  • domain/common/include/fwdev.h:39:49: error: expected primary-expression before ')' token
  • error 219
  • domain/common/include/fe.h:2969:40: error: expected ',' before ';' token
  • error 220
  • domain/common/include/fe.h:2969:40: error: expected string-literal before ';' token
  • error 221
  • domain/common/include/fe.h:2969:40: error: expected ')' before ';' token
  • error 222
  • domain/common/include/fwdev.h:39:43: error: expected '(' before '<' token
  • error 223
  • domain/common/include/fwdev.h:39:43: error: expected primary-expression before '<' token
  • error 224
  • domain/common/include/fwdev.h:39:49: error: expected primary-expression before ')' token
  • error 225
  • domain/common/include/fe.h:3183:40: error: expected ',' before ';' token
  • error 226
  • domain/common/include/fe.h:3183:40: error: expected string-literal before ';' token
  • error 227
  • domain/common/include/fe.h:3183:40: error: expected ')' before ';' token
  • error 228
  • domain/common/include/fwdev.h:39:43: error: expected '(' before '<' token
  • error 229
  • domain/common/include/fwdev.h:39:43: error: expected primary-expression before '<' token
  • error 230
  • domain/common/include/fwdev.h:39:49: error: expected primary-expression before ')' token
  • error 231
  • domain/common/include/fe.h:3192:40: error: expected ',' before ';' token
  • error 232
  • domain/common/include/fe.h:3192:40: error: expected string-literal before ';' token
  • error 233
  • domain/common/include/fe.h:3192:40: error: expected ')' before ';' token
  • error 234
  • domain/common/include/fwdev.h:39:43: error: expected '(' before '<' token
  • error 235
  • domain/common/include/fwdev.h:39:43: error: expected primary-expression before '<' token
  • error 236
  • domain/common/include/fwdev.h:39:49: error: expected primary-expression before ')' token
  • error 237
  • domain/common/include/fe.h:3423:43: error: expected ',' before ';' token
  • error 238
  • domain/common/include/fe.h:3423:43: error: expected string-literal before ';' token
  • error 239
  • domain/common/include/fe.h:3423:43: error: expected ')' before ';' token
  • error 240
  • domain/common/include/fwdev.h:39:43: error: expected '(' before '<' token
  • error 241
  • domain/common/include/fwdev.h:39:43: error: expected primary-expression before '<' token
  • error 242
  • domain/common/include/fwdev.h:39:49: error: expected primary-expression before ')' token
  • error 243
  • domain/common/include/fe.h:3432:43: error: expected ',' before ';' token
  • error 244
  • domain/common/include/fe.h:3432:43: error: expected string-literal before ';' token
  • error 245
  • domain/common/include/fe.h:3432:43: error: expected ')' before ';' token
  • error 246
  • domain/common/include/fwdev.h:39:43: error: expected '(' before '<' token
  • error 247
  • domain/common/include/fwdev.h:39:43: error: expected primary-expression before '<' token
  • error 248
  • domain/common/include/fwdev.h:39:49: error: expected primary-expression before ')' token
  • error 249
  • domain/fwImage/include/colorModelConversion.h:1634:107: error: expected ',' before ';' token
  • error 250
  • domain/fwImage/include/colorModelConversion.h:1634:107: error: expected string-literal before ';' token
  • error 251
  • domain/fwImage/include/colorModelConversion.h:1634:107: error: expected ')' before ';' token
  • error 252
  • domain/common/include/fwdev.h:39:43: error: expected '(' before '<' token
  • error 253
  • domain/common/include/fwdev.h:39:43: error: expected primary-expression before '<' token
  • error 254
  • domain/common/include/fwdev.h:39:49: error: expected primary-expression before ')' token
  • error 255
  • domain/fwImage/include/colorModelConversion.h:1874:37: error: expected ',' before ';' token
  • error 256
  • domain/fwImage/include/colorModelConversion.h:1874:37: error: expected string-literal before ';' token
  • error 257
  • domain/fwImage/include/colorModelConversion.h:1874:37: error: expected ')' before ';' token
  • error 258
  • domain/common/include/fwdev.h:39:43: error: expected '(' before '<' token
  • error 259
  • domain/common/include/fwdev.h:39:43: error: expected primary-expression before '<' token
  • error 260
  • domain/common/include/fwdev.h:39:49: error: expected primary-expression before ')' token
  • error 261
  • domain/fwImage/include/colorModelConversion.h:1878:37: error: expected ',' before ';' token
  • error 262
  • domain/fwImage/include/colorModelConversion.h:1878:37: error: expected string-literal before ';' token
  • error 263
  • domain/fwImage/include/colorModelConversion.h:1878:37: error: expected ')' before ';' token
  • error 264
  • domain/common/include/fwdev.h:39:43: error: expected '(' before '<' token
  • error 265
  • domain/common/include/fwdev.h:39:43: error: expected primary-expression before '<' token
  • error 266
  • domain/common/include/fwdev.h:39:49: error: expected primary-expression before ')' token
  • error 267
  • domain/fwImage/include/colorModelConversion.h:2180:37: error: expected ',' before ';' token
  • error 268
  • domain/fwImage/include/colorModelConversion.h:2180:37: error: expected string-literal before ';' token
  • error 269
  • domain/fwImage/include/colorModelConversion.h:2180:37: error: expected ')' before ';' token
  • error 270
  • domain/common/include/fwdev.h:39:43: error: expected '(' before '<' token
  • error 271
  • domain/common/include/fwdev.h:39:43: error: expected primary-expression before '<' token
  • error 272
  • domain/common/include/fwdev.h:39:49: error: expected primary-expression before ')' token
  • error 273
  • domain/fwImage/include/colorModelConversion.h:2225:37: error: expected ',' before ';' token
  • error 274
  • domain/fwImage/include/colorModelConversion.h:2225:37: error: expected string-literal before ';' token
  • error 275
  • domain/fwImage/include/colorModelConversion.h:2225:37: error: expected ')' before ';' token
  • error 276
  • domain/common/include/fwdev.h:39:43: error: expected '(' before '<' token
  • error 277
  • domain/common/include/fwdev.h:39:43: error: expected primary-expression before '<' token
  • error 278
  • domain/common/include/fwdev.h:39:49: error: expected primary-expression before ')' token
  • error 279
  • domain/fwImage/include/colorModelConversion.h:2305:37: error: expected ',' before ';' token
  • error 280
  • domain/fwImage/include/colorModelConversion.h:2305:37: error: expected string-literal before ';' token
  • error 281
  • domain/fwImage/include/colorModelConversion.h:2305:37: error: expected ')' before ';' token
  • error 282
  • domain/common/include/fwdev.h:39:43: error: expected '(' before '<' token
  • error 283
  • domain/common/include/fwdev.h:39:43: error: expected primary-expression before '<' token
  • error 284
  • domain/common/include/fwdev.h:39:49: error: expected primary-expression before ')' token
  • error 285
  • domain/fwImage/include/colorModelConversion.h:2310:37: error: expected ',' before ';' token
  • error 286
  • domain/fwImage/include/colorModelConversion.h:2310:37: error: expected string-literal before ';' token
  • error 287
  • domain/fwImage/include/colorModelConversion.h:2310:37: error: expected ')' before ';' token
  • error 288
  • domain/common/include/fwdev.h:39:43: error: expected '(' before '<' token
  • error 289
  • domain/common/include/fwdev.h:39:43: error: expected primary-expression before '<' token
  • error 290
  • domain/common/include/fwdev.h:39:49: error: expected primary-expression before ')' token
  • error 291
  • domain/fwImage/include/colorModelConvSpecial.h:49:35: error: expected ',' before ';' token
  • error 292
  • domain/fwImage/include/colorModelConvSpecial.h:49:35: error: expected string-literal before ';' token
  • error 293
  • domain/fwImage/include/colorModelConvSpecial.h:49:35: error: expected ')' before ';' token
  • error 294
  • domain/common/include/fwdev.h:39:43: error: expected '(' before '<' token
  • error 295
  • domain/common/include/fwdev.h:39:43: error: expected primary-expression before '<' token
  • error 296
  • domain/common/include/fwdev.h:39:49: error: expected primary-expression before ')' token
  • error 297
  • domain/fwImage/include/colorModelConvSpecial.h:1090:37: error: expected ',' before ';' token
  • error 298
  • domain/fwImage/include/colorModelConvSpecial.h:1090:37: error: expected string-literal before ';' token
  • error 299
  • domain/fwImage/include/colorModelConvSpecial.h:1090:37: error: expected ')' before ';' token
  • error 300
  • domain/common/include/fwdev.h:39:43: error: expected '(' before '<' token
  • error 301
  • domain/common/include/fwdev.h:39:43: error: expected primary-expression before '<' token
  • error 302
  • domain/common/include/fwdev.h:39:49: error: expected primary-expression before ')' token
  • error 303
  • domain/fwImage/include/colorModelConversionDefs.h:22:69: error: expected ',' before ';' token
  • error 304
  • domain/fwImage/include/colorModelConversionDefs.h:22:69: error: expected string-literal before ';' token
  • error 305
  • domain/fwImage/include/colorModelConversionDefs.h:22:69: error: expected ')' before ';' token
  • error 306
  • sdk/cbl/cbl_common_primitives.h:288:43: error: narrowing conversion of '18445899545702039552ull' from 'U64 {aka long long unsigned int}' to 'long long int' inside { } [-Wnarrowing]
  • error 307
  • domain/fwImage/include/colorModelConvSpecial.h:353:70: error: narrowing conversion of '((((int)(* ptrSrc)) + ((int)(*(ptrSrc + 3u)))) >> 1)' from 'int' to 'unsigned char' inside { } [-Werror=narrowing]
  • error 308
  • domain/fwImage/include/colorModelConvSpecial.h:354:70: error: narrowing conversion of '((((int)(*(ptrSrc + 1u))) + ((int)(*(ptrSrc + 4u)))) >> 1)' from 'int' to 'unsigned char' inside { } [-Werror=narrowing]
  • error 309
  • domain/fwImage/include/colorModelConvSpecial.h:355:70: error: narrowing conversion of '((((int)(*(ptrSrc + 2u))) + ((int)(*(ptrSrc + 5u)))) >> 1)' from 'int' to 'unsigned char' inside { } [-Werror=narrowing]
  • error 310
  • domain/fwImage/include/colorModelConvSpecial.h:353:70: error: narrowing conversion of '((((int)(* ptrSrc)) + ((int)(*(ptrSrc + 3u)))) >> 1)' from 'int' to 'unsigned char' inside { } [-Werror=narrowing]
  • error 311
  • domain/fwImage/include/colorModelConvSpecial.h:354:70: error: narrowing conversion of '((((int)(*(ptrSrc + 1u))) + ((int)(*(ptrSrc + 4u)))) >> 1)' from 'int' to 'unsigned char' inside { } [-Werror=narrowing]
  • error 312
  • domain/fwImage/include/colorModelConvSpecial.h:355:70: error: narrowing conversion of '((((int)(*(ptrSrc + 2u))) + ((int)(*(ptrSrc + 5u)))) >> 1)' from 'int' to 'unsigned char' inside { } [-Werror=narrowing]
  • error 313
  • domain/fwImage/include/colorModelConvSpecial.h:217:70: error: narrowing conversion of '((((int)(* ptrSrc)) + ((int)(*(ptrSrc + 3u)))) >> 1)' from 'int' to 'unsigned char' inside { } [-Werror=narrowing]
  • error 314
  • domain/fwImage/include/colorModelConvSpecial.h:218:70: error: narrowing conversion of '((((int)(*(ptrSrc + 1u))) + ((int)(*(ptrSrc + 4u)))) >> 1)' from 'int' to 'unsigned char' inside { } [-Werror=narrowing]
  • error 315
  • domain/fwImage/include/colorModelConvSpecial.h:219:70: error: narrowing conversion of '((((int)(*(ptrSrc + 2u))) + ((int)(*(ptrSrc + 5u)))) >> 1)' from 'int' to 'unsigned char' inside { } [-Werror=narrowing]
  • error 316
  • domain/fwImage/include/colorModelConvSpecial.h:217:70: error: narrowing conversion of '((((int)(* ptrSrc)) + ((int)(*(ptrSrc + 3u)))) >> 1)' from 'int' to 'unsigned char' inside { } [-Werror=narrowing]
  • error 317
  • domain/fwImage/include/colorModelConvSpecial.h:218:70: error: narrowing conversion of '((((int)(*(ptrSrc + 1u))) + ((int)(*(ptrSrc + 4u)))) >> 1)' from 'int' to 'unsigned char' inside { } [-Werror=narrowing]
  • error 318
  • domain/fwImage/include/colorModelConvSpecial.h:219:70: error: narrowing conversion of '((((int)(*(ptrSrc + 2u))) + ((int)(*(ptrSrc + 5u)))) >> 1)' from 'int' to 'unsigned char' inside { } [-Werror=narrowing]
  • error 319
  • domain/fwImage/include/colorModelConvSpecial.h:217:70: error: narrowing conversion of '((((int)(* ptrSrc)) + ((int)(*(ptrSrc + 3u)))) >> 1)' from 'int' to 'unsigned char' inside { } [-Werror=narrowing]
  • error 320
  • domain/fwImage/include/colorModelConvSpecial.h:218:70: error: narrowing conversion of '((((int)(*(ptrSrc + 1u))) + ((int)(*(ptrSrc + 4u)))) >> 1)' from 'int' to 'unsigned char' inside { } [-Werror=narrowing]
  • error 321
  • domain/fwImage/include/colorModelConvSpecial.h:219:70: error: narrowing conversion of '((((int)(*(ptrSrc + 2u))) + ((int)(*(ptrSrc + 5u)))) >> 1)' from 'int' to 'unsigned char' inside { } [-Werror=narrowing]
  • error 322
  • domain/fwImage/include/colorModelConvSpecial.h:217:70: error: narrowing conversion of '((((int)(* ptrSrc)) + ((int)(*(ptrSrc + 3u)))) >> 1)' from 'int' to 'unsigned char' inside { } [-Werror=narrowing]
  • error 323
  • domain/fwImage/include/colorModelConvSpecial.h:218:70: error: narrowing conversion of '((((int)(*(ptrSrc + 1u))) + ((int)(*(ptrSrc + 4u)))) >> 1)' from 'int' to 'unsigned char' inside { } [-Werror=narrowing]
  • error 324
  • domain/fwImage/include/colorModelConvSpecial.h:219:70: error: narrowing conversion of '((((int)(*(ptrSrc + 2u))) + ((int)(*(ptrSrc + 5u)))) >> 1)' from 'int' to 'unsigned char' inside { } [-Werror=narrowing]
  • error 325
  • domain/fwImage/include/colorModelConvSpecial.h:283:68: error: narrowing conversion of '((((int)(* ptrSrc)) + ((int)(*(ptrSrc + 4u)))) >> 1)' from 'int' to 'unsigned char' inside { } [-Werror=narrowing]
  • error 326
  • domain/fwImage/include/colorModelConvSpecial.h:284:68: error: narrowing conversion of '((((int)(*(ptrSrc + 1u))) + ((int)(*(ptrSrc + 5u)))) >> 1)' from 'int' to 'unsigned char' inside { } [-Werror=narrowing]
  • error 327
  • domain/fwImage/include/colorModelConvSpecial.h:285:68: error: narrowing conversion of '((((int)(*(ptrSrc + 2u))) + ((int)(*(ptrSrc + 6u)))) >> 1)' from 'int' to 'unsigned char' inside { } [-Werror=narrowing]
  • error 328
  • domain/fwImage/include/colorModelConvSpecial.h:283:68: error: narrowing conversion of '((((int)(* ptrSrc)) + ((int)(*(ptrSrc + 4u)))) >> 1)' from 'int' to 'unsigned char' inside { } [-Werror=narrowing]
  • error 329
  • domain/fwImage/include/colorModelConvSpecial.h:284:68: error: narrowing conversion of '((((int)(*(ptrSrc + 1u))) + ((int)(*(ptrSrc + 5u)))) >> 1)' from 'int' to 'unsigned char' inside { } [-Werror=narrowing]
  • error 330
  • domain/fwImage/include/colorModelConvSpecial.h:285:68: error: narrowing conversion of '((((int)(*(ptrSrc + 2u))) + ((int)(*(ptrSrc + 6u)))) >> 1)' from 'int' to 'unsigned char' inside { } [-Werror=narrowing]
  • error 331
  • error: Bad exit status from /tmp/B.3RZ7Ot/BUILD/tmp/rpm-tmp.74117 (%build)
  • error 332
  • RPM build errors:
  • error 333
  • error: No files produced.

Content:

request from: qboosh
checking if we should skip the build
started at: Sat Apr 15 08:09:36 2017
fetching https://srcbuilder.pld-linux.org/th//srpms/f2f635bd-d21b-4be4-a6b3-63ac516a89c9/framewave-1.3.1-11.src.rpm
fetched 5369219 bytes, 3152.5 K/s
installing srpm: framewave-1.3.1-11.src.rpm
mesg: ttyname failed: Inappropriate ioctl for device
+ install -d /tmp/B.3RZ7Ot/BUILD /tmp/B.3RZ7Ot/RPMS
+ LC_ALL=en_US.UTF-8
+ rpm -qp --changelog framewave-1.3.1-11.src.rpm
* Sat Apr 15 2017 PLD Linux Team <feedback@pld-linux.org>
- For complete changelog see: http://git.pld-linux.org/?p=packages/framewave.git;a=log;h=master
* Mon May 16 2016 Elan Ruusamäe <glen@delfi.ee> 68271a2
- icu-57.1 rebuild - release 11 (by relup.sh) + rpm -Uhv --nodeps --define '_topdir /tmp/B.3RZ7Ot' --define '_specdir %{_topdir}' --define '_sourcedir %{_specdir}' --define '_rpmdir %{_topdir}/RPMS' --define '_builddir %{_topdir}/BUILD' framewave-1.3.1-11.src.rpm Preparing... ################################################## framewave ################################################## + rm -f framewave-1.3.1-11.src.rpm mesg: ttyname failed: Inappropriate ioctl for device + install -m 700 -d /tmp/B.3RZ7Ot/BUILD/tmp mesg: ttyname failed: Inappropriate ioctl for device + TMPDIR=/tmp/B.3RZ7Ot/BUILD/tmp + exec nice -n 0 rpmbuild -bp --short-circuit --nodeps --define '_topdir /tmp/B.3RZ7Ot' --define '_specdir %{_topdir}' --define '_sourcedir %{_specdir}' --define '_rpmdir %{_topdir}/RPMS' --define '_builddir %{_topdir}/BUILD' --target x86_64-pld-linux --define 'prep exit 0' /tmp/B.3RZ7Ot/framewave.spec Building target platforms: x86_64-pld-linux checking BuildConflict-ing packages no BuildConflicts found checking BR rpm: Building target platforms: x86_64-pld-linux no BR needed building RPM using: set -ex; : build-id: f2f635bd-d21b-4be4-a6b3-63ac516a89c9; TMPDIR=/tmp/B.3RZ7Ot/BUILD/tmp exec nice -n 0 rpmbuild -bb --define '_smp_mflags -j5' --define '_make_opts -Otarget' --define '_pld_builder 1' --define '_topdir /tmp/B.3RZ7Ot' --define '_specdir %{_topdir}' --define '_sourcedir %{_specdir}' --define '_rpmdir %{_topdir}/RPMS' --define '_builddir %{_topdir}/BUILD' --target x86_64-pld-linux /tmp/B.3RZ7Ot/framewave.spec mesg: ttyname failed: Inappropriate ioctl for device + : build-id: f2f635bd-d21b-4be4-a6b3-63ac516a89c9 + TMPDIR=/tmp/B.3RZ7Ot/BUILD/tmp + exec nice -n 0 rpmbuild -bb --define '_smp_mflags -j5' --define '_make_opts -Otarget' --define '_pld_builder 1' --define '_topdir /tmp/B.3RZ7Ot' --define '_specdir %{_topdir}' --define '_sourcedir %{_specdir}' --define '_rpmdir %{_topdir}/RPMS' --define '_builddir %{_topdir}/BUILD' --target x86_64-pld-linux /tmp/B.3RZ7Ot/framewave.spec Building target platforms: x86_64-pld-linux Executing(%prep): /bin/sh -e /tmp/B.3RZ7Ot/BUILD/tmp/rpm-tmp.74117 + umask 022 + cd /tmp/B.3RZ7Ot/BUILD + cd /tmp/B.3RZ7Ot/BUILD + rm -rf FRAMEWAVE_1.3.1_SRC + /usr/bin/gzip -dc /tmp/B.3RZ7Ot/FRAMEWAVE_1.3.1_SRC.tar.gz + /bin/tar -xf - + STATUS=0 + '[' 0 -ne 0 ']' + cd FRAMEWAVE_1.3.1_SRC + /bin/id -u + '[' 1000 '=' 0 ']' + /bin/id -u + '[' 1000 '=' 0 ']' + /bin/chmod -Rf a+rX,u+w,g-w,o-w . + echo 'Patch #0 (framewave-system-boost.patch):' Patch #0 (framewave-system-boost.patch): + '[' -f /tmp/B.3RZ7Ot/framewave-system-boost.patch ']' + /bin/cat /tmp/B.3RZ7Ot/framewave-system-boost.patch + /usr/bin/patch -s -p1 + echo 'Patch #1 (framewave-c++.patch):' Patch #1 (framewave-c++.patch): + '[' -f /tmp/B.3RZ7Ot/framewave-c++.patch ']' + /bin/cat /tmp/B.3RZ7Ot/framewave-c++.patch + /usr/bin/patch -s -p1 + echo 'Patch #2 (no-forced-arch-bits.patch):' Patch #2 (no-forced-arch-bits.patch): + '[' -f /tmp/B.3RZ7Ot/no-forced-arch-bits.patch ']' + /bin/cat /tmp/B.3RZ7Ot/no-forced-arch-bits.patch + /usr/bin/patch -s -p1 + echo 'Patch #3 (framewave-templates.patch):' Patch #3 (framewave-templates.patch): + '[' -f /tmp/B.3RZ7Ot/framewave-templates.patch ']' + /bin/cat /tmp/B.3RZ7Ot/framewave-templates.patch + /usr/bin/patch -s -p1 + /bin/rm '--interactive=never' BuildTools/bin/FwHeaderConvert_lin BuildTools/bin/FwHeaderConvert_mac BuildTools/bin/FwHeaderConvert_sol BuildTools/bin/FwHeaderConvert_win.exe + /bin/sed -i -e 's/'\''-O2'\''/'\''-O2 -fwrapv -pipe -Wformat -Werror=format-security -gdwarf-4 -fno-debug-types-section -fvar-tracking-assignments -g2 -Wp,-D_FORTIFY_SOURCE=2 -fstack-protector-strong --param=ssp-buffer-size=4 -fPIC -march=x86-64 -gdwarf-4 -fno-debug-types-section -fvar-tracking-assignments -g2 '\''/' BuildTools/buildscripts/fwflags_gcc.py + exit 0 Executing(%build): /bin/sh -e /tmp/B.3RZ7Ot/BUILD/tmp/rpm-tmp.74117 TMP=/home/users/builder/tmp HOME=/home/users/builder PATH=/home/users/builder/GNUstep/Tools:/usr/local/bin:/usr/bin:/bin:/home/users/builder/bin TMPDIR=/tmp/B.3RZ7Ot/BUILD/tmp + umask 022 + cd /tmp/B.3RZ7Ot/BUILD + cd FRAMEWAVE_1.3.1_SRC + cd Framewave + mkdir -p build/include build/tmp build/bin + /usr/bin/scons -j5 'LDFLAGS=-Wl,--as-needed -Wl,--no-copy-dt-needed-entries -Wl,-z,relro -Wl,-z,combreloc ' 'CFLAGS=-O2 -fwrapv -pipe -Wformat -Werror=format-security -gdwarf-4 -fno-debug-types-section -fvar-tracking-assignments -g2 -Wp,-D_FORTIFY_SOURCE=2 -fstack-protector-strong --param=ssp-buffer-size=4 -fPIC -march=x86-64 -gdwarf-4 -fno-debug-types-section -fvar-tracking-assignments -g2 ' 'CXXFLAGS=-O2 -fwrapv -pipe -Wformat -Werror=format-security -gdwarf-4 -fno-debug-types-section -fvar-tracking-assignments -g2 -Wp,-D_FORTIFY_SOURCE=2 -fstack-protector-strong --param=ssp-buffer-size=4 -fPIC -march=x86-64 -gdwarf-4 -fno-debug-types-section -fvar-tracking-assignments -g2 ' 'FFLAGS=-O2 -fwrapv -pipe -Wformat -Werror=format-security -gdwarf-4 -fno-debug-types-section -fvar-tracking-assignments -g2 -Wp,-D_FORTIFY_SOURCE=2 -fstack-protector-strong --param=ssp-buffer-size=4 -fPIC -march=x86-64 -gdwarf-4 -fno-debug-types-section -fvar-tracking-assignments -g2 ' 'CPPFLAGS=' 'CC=x86_64-pld-linux-gcc' 'CXX=x86_64-pld-linux-g++' 'libsuffix=lib64' 'prefix=/usr' 'bitness=64' 'libtype=shared' 'variant=release' scons: Reading SConscript files ... scons: warning: The build_dir keyword has been deprecated; use the variant_dir keyword instead. File "/tmp/B.3RZ7Ot/BUILD/FRAMEWAVE_1.3.1_SRC/BuildTools/buildscripts/fwbuild.py", line 118, in subProject scons: warning: The build_dir keyword has been deprecated; use the variant_dir keyword instead. File "/tmp/B.3RZ7Ot/BUILD/FRAMEWAVE_1.3.1_SRC/BuildTools/buildscripts/fwbuild.py", line 118, in subProject scons: warning: The build_dir keyword has been deprecated; use the variant_dir keyword instead. File "/tmp/B.3RZ7Ot/BUILD/FRAMEWAVE_1.3.1_SRC/BuildTools/buildscripts/fwbuild.py", line 118, in subProject scons: warning: The build_dir keyword has been deprecated; use the variant_dir keyword instead. File "/tmp/B.3RZ7Ot/BUILD/FRAMEWAVE_1.3.1_SRC/BuildTools/buildscripts/fwbuild.py", line 118, in subProject scons: warning: The build_dir keyword has been deprecated; use the variant_dir keyword instead. File "/tmp/B.3RZ7Ot/BUILD/FRAMEWAVE_1.3.1_SRC/BuildTools/buildscripts/fwbuild.py", line 118, in subProject scons: done reading SConscript files. scons: Building targets ... g++ -o build/tmp/fwBase_release_shared_64/obj/system.obj -c -Werror -DBLD_REF_ONLY -O2 -fwrapv -pipe -Wformat -Werror=format-security -gdwarf-4 -fno-debug-types-section -fvar-tracking-assignments -g2 -Wp,-D_FORTIFY_SOURCE=2 -fstack-protector-strong --param=ssp-buffer-size=4 -fPIC -march=x86-64 -gdwarf-4 -fno-debug-types-section -fvar-tracking-assignments -g2 -DNDEBUG -DLIN64 -fPIC -Idomain -Isdk -Idomain/fwBase/include -Idomain/common/include -Idomain/common/include/Arithmetic/Impl -Idomain/common/include/Arithmetic/Def -Isdk -Isdk/SSEPlus/include/number -Isdk/SSEPlus/include/native -Isdk/SSEPlus/include/arithmetic -Isdk/SSEPlus/include/emulation -Isdk/SSEPlus/include/convert -Isdk/SSEPlus/include/logical -Isdk/SSEPlus/include/map -Isdk/SSEPlus/include/memory -Isdk/SSEPlus/include -Isdk/cbl -Isdk/external -Idomain/fwBase -Idomain/fwBase/include domain/fwBase/src/system.cpp g++ -o build/tmp/fwBase_release_shared_64/obj/ThreadPool.obj -c -Werror -DBLD_REF_ONLY -O2 -fwrapv -pipe -Wformat -Werror=format-security -gdwarf-4 -fno-debug-types-section -fvar-tracking-assignments -g2 -Wp,-D_FORTIFY_SOURCE=2 -fstack-protector-strong --param=ssp-buffer-size=4 -fPIC -march=x86-64 -gdwarf-4 -fno-debug-types-section -fvar-tracking-assignments -g2 -DNDEBUG -DLIN64 -fPIC -Idomain -Isdk -Idomain/fwBase/include -Idomain/common/include -Idomain/common/include/Arithmetic/Impl -Idomain/common/include/Arithmetic/Def -Isdk -Isdk/SSEPlus/include/number -Isdk/SSEPlus/include/native -Isdk/SSEPlus/include/arithmetic -Isdk/SSEPlus/include/emulation -Isdk/SSEPlus/include/convert -Isdk/SSEPlus/include/logical -Isdk/SSEPlus/include/map -Isdk/SSEPlus/include/memory -Isdk/SSEPlus/include -Isdk/cbl -Isdk/external -Idomain/fwBase -Idomain/fwBase/include domain/fwBase/src/ThreadPool.cpp g++ -o build/tmp/fwBase_release_shared_64/obj/fwBase.obj -c -Werror -DBLD_REF_ONLY -O2 -fwrapv -pipe -Wformat -Werror=format-security -gdwarf-4 -fno-debug-types-section -fvar-tracking-assignments -g2 -Wp,-D_FORTIFY_SOURCE=2 -fstack-protector-strong --param=ssp-buffer-size=4 -fPIC -march=x86-64 -gdwarf-4 -fno-debug-types-section -fvar-tracking-assignments -g2 -DNDEBUG -DLIN64 -fPIC -Idomain -Isdk -Idomain/fwBase/include -Idomain/common/include -Idomain/common/include/Arithmetic/Impl -Idomain/common/include/Arithmetic/Def -Isdk -Isdk/SSEPlus/include/number -Isdk/SSEPlus/include/native -Isdk/SSEPlus/include/arithmetic -Isdk/SSEPlus/include/emulation -Isdk/SSEPlus/include/convert -Isdk/SSEPlus/include/logical -Isdk/SSEPlus/include/map -Isdk/SSEPlus/include/memory -Isdk/SSEPlus/include -Isdk/cbl -Isdk/external -Idomain/fwBase -Idomain/fwBase/include domain/fwBase/src/fwBase.cpp g++ -o build/tmp/fwBase_release_shared_64/common/obj/Constants.obj -c -Werror -DBLD_REF_ONLY -O2 -fwrapv -pipe -Wformat -Werror=format-security -gdwarf-4 -fno-debug-types-section -fvar-tracking-assignments -g2 -Wp,-D_FORTIFY_SOURCE=2 -fstack-protector-strong --param=ssp-buffer-size=4 -fPIC -march=x86-64 -gdwarf-4 -fno-debug-types-section -fvar-tracking-assignments -g2 -DNDEBUG -DLIN64 -fPIC -Idomain -Isdk -Idomain/fwBase/include -Idomain/common/include -Idomain/common/include/Arithmetic/Impl -Idomain/common/include/Arithmetic/Def -Isdk -Isdk/SSEPlus/include/number -Isdk/SSEPlus/include/native -Isdk/SSEPlus/include/arithmetic -Isdk/SSEPlus/include/emulation -Isdk/SSEPlus/include/convert -Isdk/SSEPlus/include/logical -Isdk/SSEPlus/include/map -Isdk/SSEPlus/include/memory -Isdk/SSEPlus/include -Isdk/cbl -Isdk/external -Idomain/fwBase -Idomain/fwBase/include domain/common/src/Constants.cpp g++ -o build/tmp/fwImage_release_shared_64/obj/_refr_colorModelConversion_RGB_YCBCR.obj -c -Werror -DBLD_REF_ONLY -DOPT_PREFIX=_refr_ -O2 -fwrapv -pipe -Wformat -Werror=format-security -gdwarf-4 -fno-debug-types-section -fvar-tracking-assignments -g2 -Wp,-D_FORTIFY_SOURCE=2 -fstack-protector-strong --param=ssp-buffer-size=4 -fPIC -march=x86-64 -gdwarf-4 -fno-debug-types-section -fvar-tracking-assignments -g2 -DOPT_LEVEL=REFR -DNDEBUG -DLIN64 -DDISPATCH=DT_REFR -DOPT_REFR -fPIC -Idomain -Isdk -Idomain/fwBase/include -Idomain/common/include -Idomain/common/include/Arithmetic/Impl -Idomain/common/include/Arithmetic/Def -Isdk -Isdk/SSEPlus/include/number -Isdk/SSEPlus/include/native -Isdk/SSEPlus/include/arithmetic -Isdk/SSEPlus/include/emulation -Isdk/SSEPlus/include/convert -Isdk/SSEPlus/include/logical -Isdk/SSEPlus/include/map -Isdk/SSEPlus/include/memory -Isdk/SSEPlus/include -Isdk/cbl -Isdk/external -Idomain/fwImage -Idomain/fwImage/include domain/fwImage/src/colorModelConversion_RGB_YCBCR.cpp In file included from sdk/cbl/cbl.h:11:0, from domain/common/include/system.h:188, from domain/fwBase/src/system.cpp:8: sdk/cbl/cbl_common_primitives.h:288:43: error: narrowing conversion of '9223512776490647552ull' from 'U64 {aka long long unsigned int}' to 'long long int' inside { } [-Wnarrowing] (U64)(g), (U64)(h) ) } ^ sdk/cbl/cbl_common_primitives.h:291:5: note: in expansion of macro 'CONST_SETR_16I' CONST_SETR_16I( (h), (g), (f), (e), (d), (c), (b), (a) ) ^~~~~~~~~~~~~~ sdk/cbl/cbl_common_primitives.h:294:5: note: in expansion of macro 'CONST_SET_16I' CONST_SET_16I( (x), (x), (x), (x), (x), (x), (x), (x) ) ^~~~~~~~~~~~~ sdk/cbl/cbl_common_primitives.h:394:44: note: in expansion of macro 'CONST_SET1_16I' const __m128i __g_min_S16_vector = CONST_SET1_16I( CBL_S16_MIN ); ^~~~~~~~~~~~~~ sdk/cbl/cbl_common_primitives.h:288:43: error: narrowing conversion of '9223512776490647552ull' from 'U64 {aka long long unsigned int}' to 'long long int' inside { } [-Wnarrowing] (U64)(g), (U64)(h) ) } ^ sdk/cbl/cbl_common_primitives.h:291:5: note: in expansion of macro 'CONST_SETR_16I' CONST_SETR_16I( (h), (g), (f), (e), (d), (c), (b), (a) ) ^~~~~~~~~~~~~~ sdk/cbl/cbl_common_primitives.h:294:5: note: in expansion of macro 'CONST_SET_16I' CONST_SET_16I( (x), (x), (x), (x), (x), (x), (x), (x) ) ^~~~~~~~~~~~~ sdk/cbl/cbl_common_primitives.h:394:44: note: in expansion of macro 'CONST_SET1_16I' const __m128i __g_min_S16_vector = CONST_SET1_16I( CBL_S16_MIN ); ^~~~~~~~~~~~~~ sdk/cbl/cbl_common_primitives.h:306:43: error: narrowing conversion of '9223372039002259456ull' from 'U64 {aka long long unsigned int}' to 'long long int' inside { } [-Wnarrowing] __CNST32TO64_( (U64)(c), (U64)(d) ) } ^ sdk/cbl/cbl_common_primitives.h:309:5: note: in expansion of macro 'CONST_SETR_32I' CONST_SETR_32I( (d), (c), (b), (a) ) ^~~~~~~~~~~~~~ sdk/cbl/cbl_common_primitives.h:312:5: note: in expansion of macro 'CONST_SET_32I' CONST_SET_32I( (x), (x), (x), (x) ) ^~~~~~~~~~~~~ sdk/cbl/cbl_common_primitives.h:396:44: note: in expansion of macro 'CONST_SET1_32I' const __m128i __g_min_S32_vector = CONST_SET1_32I( CBL_S32_MIN ); ^~~~~~~~~~~~~~ sdk/cbl/cbl_common_primitives.h:306:43: error: narrowing conversion of '9223372039002259456ull' from 'U64 {aka long long unsigned int}' to 'long long int' inside { } [-Wnarrowing] __CNST32TO64_( (U64)(c), (U64)(d) ) } ^ sdk/cbl/cbl_common_primitives.h:309:5: note: in expansion of macro 'CONST_SETR_32I' CONST_SETR_32I( (d), (c), (b), (a) ) ^~~~~~~~~~~~~~ sdk/cbl/cbl_common_primitives.h:312:5: note: in expansion of macro 'CONST_SET_32I' CONST_SET_32I( (x), (x), (x), (x) ) ^~~~~~~~~~~~~ sdk/cbl/cbl_common_primitives.h:396:44: note: in expansion of macro 'CONST_SET1_32I' const __m128i __g_min_S32_vector = CONST_SET1_32I( CBL_S32_MIN ); ^~~~~~~~~~~~~~ sdk/cbl/cbl_common_primitives.h:320:16: error: narrowing conversion of '9223372036854775808ull' from 'long long unsigned int' to 'long long int' inside { } [-Wnarrowing] { (a), (b) } ^ sdk/cbl/cbl_common_primitives.h:323:5: note: in expansion of macro 'CONST_SETR_64I' CONST_SETR_64I( (b), (a) ) ^~~~~~~~~~~~~~ sdk/cbl/cbl_common_primitives.h:326:5: note: in expansion of macro 'CONST_SET_64I' CONST_SET_64I( (x), (x) ) ^~~~~~~~~~~~~ sdk/cbl/cbl_common_primitives.h:398:44: note: in expansion of macro 'CONST_SET1_64I' const __m128i __g_min_S64_vector = CONST_SET1_64I( CBL_S64_MIN ); ^~~~~~~~~~~~~~ sdk/cbl/cbl_common_primitives.h:320:16: error: narrowing conversion of '9223372036854775808ull' from 'long long unsigned int' to 'long long int' inside { } [-Wnarrowing] { (a), (b) } ^ sdk/cbl/cbl_common_primitives.h:323:5: note: in expansion of macro 'CONST_SETR_64I' CONST_SETR_64I( (b), (a) ) ^~~~~~~~~~~~~~ sdk/cbl/cbl_common_primitives.h:326:5: note: in expansion of macro 'CONST_SET_64I' CONST_SET_64I( (x), (x) ) ^~~~~~~~~~~~~ sdk/cbl/cbl_common_primitives.h:398:44: note: in expansion of macro 'CONST_SET1_64I' const __m128i __g_min_S64_vector = CONST_SET1_64I( CBL_S64_MIN ); ^~~~~~~~~~~~~~ In file included from sdk/cbl/cbl.h:11:0, from domain/common/include/system.h:188, from domain/common/include/fwdev.h:19, from domain/fwBase/src/fwBase.cpp:9: sdk/cbl/cbl_common_primitives.h:288:43: error: narrowing conversion of '9223512776490647552ull' from 'U64 {aka long long unsigned int}' to 'long long int' inside { } [-Wnarrowing] (U64)(g), (U64)(h) ) } ^ sdk/cbl/cbl_common_primitives.h:291:5: note: in expansion of macro 'CONST_SETR_16I' CONST_SETR_16I( (h), (g), (f), (e), (d), (c), (b), (a) ) ^~~~~~~~~~~~~~ sdk/cbl/cbl_common_primitives.h:294:5: note: in expansion of macro 'CONST_SET_16I' CONST_SET_16I( (x), (x), (x), (x), (x), (x), (x), (x) ) ^~~~~~~~~~~~~ sdk/cbl/cbl_common_primitives.h:394:44: note: in expansion of macro 'CONST_SET1_16I' const __m128i __g_min_S16_vector = CONST_SET1_16I( CBL_S16_MIN ); ^~~~~~~~~~~~~~ sdk/cbl/cbl_common_primitives.h:288:43: error: narrowing conversion of '9223512776490647552ull' from 'U64 {aka long long unsigned int}' to 'long long int' inside { } [-Wnarrowing] (U64)(g), (U64)(h) ) } ^ sdk/cbl/cbl_common_primitives.h:291:5: note: in expansion of macro 'CONST_SETR_16I' CONST_SETR_16I( (h), (g), (f), (e), (d), (c), (b), (a) ) ^~~~~~~~~~~~~~ sdk/cbl/cbl_common_primitives.h:294:5: note: in expansion of macro 'CONST_SET_16I' CONST_SET_16I( (x), (x), (x), (x), (x), (x), (x), (x) ) ^~~~~~~~~~~~~ sdk/cbl/cbl_common_primitives.h:394:44: note: in expansion of macro 'CONST_SET1_16I' const __m128i __g_min_S16_vector = CONST_SET1_16I( CBL_S16_MIN ); ^~~~~~~~~~~~~~ sdk/cbl/cbl_common_primitives.h:306:43: error: narrowing conversion of '9223372039002259456ull' from 'U64 {aka long long unsigned int}' to 'long long int' inside { } [-Wnarrowing] __CNST32TO64_( (U64)(c), (U64)(d) ) } ^ sdk/cbl/cbl_common_primitives.h:309:5: note: in expansion of macro 'CONST_SETR_32I' CONST_SETR_32I( (d), (c), (b), (a) ) ^~~~~~~~~~~~~~ sdk/cbl/cbl_common_primitives.h:312:5: note: in expansion of macro 'CONST_SET_32I' CONST_SET_32I( (x), (x), (x), (x) ) ^~~~~~~~~~~~~ sdk/cbl/cbl_common_primitives.h:396:44: note: in expansion of macro 'CONST_SET1_32I' const __m128i __g_min_S32_vector = CONST_SET1_32I( CBL_S32_MIN ); ^~~~~~~~~~~~~~ sdk/cbl/cbl_common_primitives.h:306:43: error: narrowing conversion of '9223372039002259456ull' from 'U64 {aka long long unsigned int}' to 'long long int' inside { } [-Wnarrowing] __CNST32TO64_( (U64)(c), (U64)(d) ) } ^ sdk/cbl/cbl_common_primitives.h:309:5: note: in expansion of macro 'CONST_SETR_32I' CONST_SETR_32I( (d), (c), (b), (a) ) ^~~~~~~~~~~~~~ sdk/cbl/cbl_common_primitives.h:312:5: note: in expansion of macro 'CONST_SET_32I' CONST_SET_32I( (x), (x), (x), (x) ) ^~~~~~~~~~~~~ sdk/cbl/cbl_common_primitives.h:396:44: note: in expansion of macro 'CONST_SET1_32I' const __m128i __g_min_S32_vector = CONST_SET1_32I( CBL_S32_MIN ); ^~~~~~~~~~~~~~ sdk/cbl/cbl_common_primitives.h:320:16: error: narrowing conversion of '9223372036854775808ull' from 'long long unsigned int' to 'long long int' inside { } [-Wnarrowing] { (a), (b) } ^ sdk/cbl/cbl_common_primitives.h:323:5: note: in expansion of macro 'CONST_SETR_64I' CONST_SETR_64I( (b), (a) ) ^~~~~~~~~~~~~~ sdk/cbl/cbl_common_primitives.h:326:5: note: in expansion of macro 'CONST_SET_64I' CONST_SET_64I( (x), (x) ) ^~~~~~~~~~~~~ sdk/cbl/cbl_common_primitives.h:398:44: note: in expansion of macro 'CONST_SET1_64I' const __m128i __g_min_S64_vector = CONST_SET1_64I( CBL_S64_MIN ); ^~~~~~~~~~~~~~ sdk/cbl/cbl_common_primitives.h:320:16: error: narrowing conversion of '9223372036854775808ull' from 'long long unsigned int' to 'long long int' inside { } [-Wnarrowing] { (a), (b) } ^ sdk/cbl/cbl_common_primitives.h:323:5: note: in expansion of macro 'CONST_SETR_64I' CONST_SETR_64I( (b), (a) ) ^~~~~~~~~~~~~~ sdk/cbl/cbl_common_primitives.h:326:5: note: in expansion of macro 'CONST_SET_64I' CONST_SET_64I( (x), (x) ) ^~~~~~~~~~~~~ sdk/cbl/cbl_common_primitives.h:398:44: note: in expansion of macro 'CONST_SET1_64I' const __m128i __g_min_S64_vector = CONST_SET1_64I( CBL_S64_MIN ); ^~~~~~~~~~~~~~ In file included from sdk/SSEPlus/include/SSEPlus_REF.h:8:0, from domain/common/include/system.h:154, from domain/common/include/fwdev.h:19, from domain/fwImage/include/colorModelConvConst.h:9, from domain/fwImage/include/colorModelConversion.h:9, from domain/fwImage/src/colorModelConversion_RGB_YCBCR.cpp:6: sdk/SSEPlus/include/SSEPlus_base.h:89:25: error: invalid suffix on literal; C++11 requires a space between literal and string macro [-Werror=literal-suffix] #define WARN( ) __FILE__"("STRING(__LINE__)") : NOTE " ^ sdk/cbl/cbl_pack_unpack_primitives_sse2.h: In static member function 'static Ref_m128i CBL_LIBRARY::CBL_SSE2::Pack64STo32S(const Ref_m128i&, const Ref_m128i&)': sdk/cbl/cbl_common_primitives.h:306:43: error: narrowing conversion of '18446744073709551615ull' from 'U64 {aka long long unsigned int}' to 'long long int' inside { } [-Wnarrowing] __CNST32TO64_( (U64)(c), (U64)(d) ) } ^ sdk/cbl/cbl_common_primitives.h:309:5: note: in expansion of macro 'CONST_SETR_32I' CONST_SETR_32I( (d), (c), (b), (a) ) ^~~~~~~~~~~~~~ sdk/cbl/cbl_common_primitives.h:312:5: note: in expansion of macro 'CONST_SET_32I' CONST_SET_32I( (x), (x), (x), (x) ) ^~~~~~~~~~~~~ sdk/cbl/cbl_pack_unpack_primitives_sse2.h:362:25: note: in expansion of macro 'CONST_SET1_32I' const __m128i nOne = CONST_SET1_32I(0xFFFFFFFF); ^~~~~~~~~~~~~~ sdk/cbl/cbl_common_primitives.h:306:43: error: narrowing conversion of '18446744073709551615ull' from 'U64 {aka long long unsigned int}' to 'long long int' inside { } [-Wnarrowing] __CNST32TO64_( (U64)(c), (U64)(d) ) } ^ sdk/cbl/cbl_common_primitives.h:309:5: note: in expansion of macro 'CONST_SETR_32I' CONST_SETR_32I( (d), (c), (b), (a) ) ^~~~~~~~~~~~~~ sdk/cbl/cbl_common_primitives.h:312:5: note: in expansion of macro 'CONST_SET_32I' CONST_SET_32I( (x), (x), (x), (x) ) ^~~~~~~~~~~~~ sdk/cbl/cbl_pack_unpack_primitives_sse2.h:362:25: note: in expansion of macro 'CONST_SET1_32I' const __m128i nOne = CONST_SET1_32I(0xFFFFFFFF); ^~~~~~~~~~~~~~ scons: *** [build/tmp/fwBase_release_shared_64/obj/system.obj] Error 1 In file included from sdk/cbl/cbl.h:11:0, from domain/common/include/system.h:188, from domain/common/include/Constants.h:10, from domain/common/src/Constants.cpp:8: sdk/cbl/cbl_common_primitives.h:288:43: error: narrowing conversion of '9223512776490647552ull' from 'U64 {aka long long unsigned int}' to 'long long int' inside { } [-Wnarrowing] (U64)(g), (U64)(h) ) } ^ sdk/cbl/cbl_common_primitives.h:291:5: note: in expansion of macro 'CONST_SETR_16I' CONST_SETR_16I( (h), (g), (f), (e), (d), (c), (b), (a) ) ^~~~~~~~~~~~~~ sdk/cbl/cbl_common_primitives.h:294:5: note: in expansion of macro 'CONST_SET_16I' CONST_SET_16I( (x), (x), (x), (x), (x), (x), (x), (x) ) ^~~~~~~~~~~~~ sdk/cbl/cbl_common_primitives.h:394:44: note: in expansion of macro 'CONST_SET1_16I' const __m128i __g_min_S16_vector = CONST_SET1_16I( CBL_S16_MIN ); ^~~~~~~~~~~~~~ sdk/cbl/cbl_common_primitives.h:288:43: error: narrowing conversion of '9223512776490647552ull' from 'U64 {aka long long unsigned int}' to 'long long int' inside { } [-Wnarrowing] (U64)(g), (U64)(h) ) } ^ sdk/cbl/cbl_common_primitives.h:291:5: note: in expansion of macro 'CONST_SETR_16I' CONST_SETR_16I( (h), (g), (f), (e), (d), (c), (b), (a) ) ^~~~~~~~~~~~~~ sdk/cbl/cbl_common_primitives.h:294:5: note: in expansion of macro 'CONST_SET_16I' CONST_SET_16I( (x), (x), (x), (x), (x), (x), (x), (x) ) ^~~~~~~~~~~~~ sdk/cbl/cbl_common_primitives.h:394:44: note: in expansion of macro 'CONST_SET1_16I' const __m128i __g_min_S16_vector = CONST_SET1_16I( CBL_S16_MIN ); ^~~~~~~~~~~~~~ sdk/cbl/cbl_pack_unpack_primitives_sse2.h: In static member function 'static Ref_m128i CBL_LIBRARY::CBL_SSE2::Pack64STo32S(const Ref_m128i&, const Ref_m128i&)': sdk/cbl/cbl_common_primitives.h:306:43: error: narrowing conversion of '18446744073709551615ull' from 'U64 {aka long long unsigned int}' to 'long long int' inside { } [-Wnarrowing] __CNST32TO64_( (U64)(c), (U64)(d) ) } ^ sdk/cbl/cbl_common_primitives.h:309:5: note: in expansion of macro 'CONST_SETR_32I' CONST_SETR_32I( (d), (c), (b), (a) ) ^~~~~~~~~~~~~~ sdk/cbl/cbl_common_primitives.h:312:5: note: in expansion of macro 'CONST_SET_32I' CONST_SET_32I( (x), (x), (x), (x) ) ^~~~~~~~~~~~~ sdk/cbl/cbl_pack_unpack_primitives_sse2.h:362:25: note: in expansion of macro 'CONST_SET1_32I' const __m128i nOne = CONST_SET1_32I(0xFFFFFFFF); ^~~~~~~~~~~~~~ sdk/cbl/cbl_common_primitives.h:306:43: error: narrowing conversion of '9223372039002259456ull' from 'U64 {aka long long unsigned int}' to 'long long int' inside { } [-Wnarrowing] __CNST32TO64_( (U64)(c), (U64)(d) ) } ^ sdk/cbl/cbl_common_primitives.h:309:5: note: in expansion of macro 'CONST_SETR_32I' CONST_SETR_32I( (d), (c), (b), (a) ) ^~~~~~~~~~~~~~ sdk/cbl/cbl_common_primitives.h:312:5: note: in expansion of macro 'CONST_SET_32I' CONST_SET_32I( (x), (x), (x), (x) ) ^~~~~~~~~~~~~ sdk/cbl/cbl_common_primitives.h:396:44: note: in expansion of macro 'CONST_SET1_32I' const __m128i __g_min_S32_vector = CONST_SET1_32I( CBL_S32_MIN ); ^~~~~~~~~~~~~~ sdk/cbl/cbl_common_primitives.h:306:43: error: narrowing conversion of '18446744073709551615ull' from 'U64 {aka long long unsigned int}' to 'long long int' inside { } [-Wnarrowing] __CNST32TO64_( (U64)(c), (U64)(d) ) } ^ sdk/cbl/cbl_common_primitives.h:309:5: note: in expansion of macro 'CONST_SETR_32I' CONST_SETR_32I( (d), (c), (b), (a) ) ^~~~~~~~~~~~~~ sdk/cbl/cbl_common_primitives.h:312:5: note: in expansion of macro 'CONST_SET_32I' CONST_SET_32I( (x), (x), (x), (x) ) ^~~~~~~~~~~~~ sdk/cbl/cbl_pack_unpack_primitives_sse2.h:362:25: note: in expansion of macro 'CONST_SET1_32I' const __m128i nOne = CONST_SET1_32I(0xFFFFFFFF); ^~~~~~~~~~~~~~ sdk/cbl/cbl_common_primitives.h:306:43: error: narrowing conversion of '9223372039002259456ull' from 'U64 {aka long long unsigned int}' to 'long long int' inside { } [-Wnarrowing] __CNST32TO64_( (U64)(c), (U64)(d) ) } ^ sdk/cbl/cbl_common_primitives.h:309:5: note: in expansion of macro 'CONST_SETR_32I' CONST_SETR_32I( (d), (c), (b), (a) ) ^~~~~~~~~~~~~~ sdk/cbl/cbl_common_primitives.h:312:5: note: in expansion of macro 'CONST_SET_32I' CONST_SET_32I( (x), (x), (x), (x) ) ^~~~~~~~~~~~~ sdk/cbl/cbl_common_primitives.h:396:44: note: in expansion of macro 'CONST_SET1_32I' const __m128i __g_min_S32_vector = CONST_SET1_32I( CBL_S32_MIN ); ^~~~~~~~~~~~~~ sdk/cbl/cbl_common_primitives.h:320:16: error: narrowing conversion of '9223372036854775808ull' from 'long long unsigned int' to 'long long int' inside { } [-Wnarrowing] { (a), (b) } ^ sdk/cbl/cbl_common_primitives.h:323:5: note: in expansion of macro 'CONST_SETR_64I' CONST_SETR_64I( (b), (a) ) ^~~~~~~~~~~~~~ sdk/cbl/cbl_common_primitives.h:326:5: note: in expansion of macro 'CONST_SET_64I' CONST_SET_64I( (x), (x) ) ^~~~~~~~~~~~~ sdk/cbl/cbl_common_primitives.h:398:44: note: in expansion of macro 'CONST_SET1_64I' const __m128i __g_min_S64_vector = CONST_SET1_64I( CBL_S64_MIN ); ^~~~~~~~~~~~~~ sdk/cbl/cbl_common_primitives.h:320:16: error: narrowing conversion of '9223372036854775808ull' from 'long long unsigned int' to 'long long int' inside { } [-Wnarrowing] { (a), (b) } ^ sdk/cbl/cbl_common_primitives.h:323:5: note: in expansion of macro 'CONST_SETR_64I' CONST_SETR_64I( (b), (a) ) ^~~~~~~~~~~~~~ sdk/cbl/cbl_common_primitives.h:326:5: note: in expansion of macro 'CONST_SET_64I' CONST_SET_64I( (x), (x) ) ^~~~~~~~~~~~~ sdk/cbl/cbl_common_primitives.h:398:44: note: in expansion of macro 'CONST_SET1_64I' const __m128i __g_min_S64_vector = CONST_SET1_64I( CBL_S64_MIN ); ^~~~~~~~~~~~~~ In file included from domain/fwBase/src/fwBase.cpp:9:0: domain/common/include/fwdev.h: At global scope: domain/common/include/fwdev.h:86:12: error: expected identifier before 'static_assert' struct static_assert {}; ^~~~~~~~~~~~~ domain/common/include/fwdev.h:86:12: error: expected unqualified-id before 'static_assert' domain/common/include/fwdev.h:88:12: error: expected identifier before 'static_assert' struct static_assert<false> ^~~~~~~~~~~~~ domain/common/include/fwdev.h:88:12: error: expected unqualified-id before 'static_assert' scons: *** [build/tmp/fwBase_release_shared_64/obj/fwBase.obj] Error 1 In file included from sdk/SSEPlus/include/SSEPlus_base.h:8:0, from sdk/SSEPlus/include/SSEPlus_REF.h:8, from domain/common/include/system.h:154, from domain/common/include/fwdev.h:19, from domain/fwImage/include/colorModelConvConst.h:9, from domain/fwImage/include/colorModelConversion.h:9, from domain/fwImage/src/colorModelConversion_RGB_YCBCR.cpp:6: sdk/SSEPlus/include/emulation/SSEPlus_emulation_comps_REF.h: In function 'Ref_m128i ssp_comtrue_epi16_REF(Ref_m128i, Ref_m128i)': sdk/SSEPlus/include/SSEPlus_platform.h:335:16: error: narrowing conversion of '18446744073709551615ull' from 'long long unsigned int' to 'long long int' inside { } [-Wnarrowing] { (a), (b) } ^ sdk/SSEPlus/include/SSEPlus_platform.h:338:5: note: in expansion of macro 'SSP_CONST_SETR_64I' SSP_CONST_SETR_64I( (b), (a) ) ^~~~~~~~~~~~~~~~~~ sdk/SSEPlus/include/emulation/SSEPlus_emulation_comps_REF.h:1601:29: note: in expansion of macro 'SSP_CONST_SET_64I' const static __m128i tmp = SSP_CONST_SET_64I( 0xFFFFFFFFFFFFFFFFULL, 0xFFFFFFFFFFFFFFFFULL ); ^~~~~~~~~~~~~~~~~ sdk/SSEPlus/include/SSEPlus_platform.h:335:16: error: narrowing conversion of '18446744073709551615ull' from 'long long unsigned int' to 'long long int' inside { } [-Wnarrowing] { (a), (b) } ^ sdk/SSEPlus/include/SSEPlus_platform.h:338:5: note: in expansion of macro 'SSP_CONST_SETR_64I' SSP_CONST_SETR_64I( (b), (a) ) ^~~~~~~~~~~~~~~~~~ sdk/SSEPlus/include/emulation/SSEPlus_emulation_comps_REF.h:1601:29: note: in expansion of macro 'SSP_CONST_SET_64I' const static __m128i tmp = SSP_CONST_SET_64I( 0xFFFFFFFFFFFFFFFFULL, 0xFFFFFFFFFFFFFFFFULL ); ^~~~~~~~~~~~~~~~~ sdk/SSEPlus/include/emulation/SSEPlus_emulation_comps_REF.h: In function 'Ref_m128d ssp_comtrue_pd_REF(Ref_m128d, Ref_m128d)': sdk/SSEPlus/include/SSEPlus_platform.h:335:16: error: narrowing conversion of '18446744073709551615ull' from 'long long unsigned int' to 'long long int' inside { } [-Wnarrowing] { (a), (b) } ^ sdk/SSEPlus/include/SSEPlus_platform.h:338:5: note: in expansion of macro 'SSP_CONST_SETR_64I' SSP_CONST_SETR_64I( (b), (a) ) ^~~~~~~~~~~~~~~~~~ sdk/SSEPlus/include/emulation/SSEPlus_emulation_comps_REF.h:1651:32: note: in expansion of macro 'SSP_CONST_SET_64I' const static __m128i tmp = SSP_CONST_SET_64I( 0xFFFFFFFFFFFFFFFFULL, 0xFFFFFFFFFFFFFFFFULL ); ^~~~~~~~~~~~~~~~~ sdk/SSEPlus/include/SSEPlus_platform.h:335:16: error: narrowing conversion of '18446744073709551615ull' from 'long long unsigned int' to 'long long int' inside { } [-Wnarrowing] { (a), (b) } ^ sdk/SSEPlus/include/SSEPlus_platform.h:338:5: note: in expansion of macro 'SSP_CONST_SETR_64I' SSP_CONST_SETR_64I( (b), (a) ) ^~~~~~~~~~~~~~~~~~ sdk/SSEPlus/include/emulation/SSEPlus_emulation_comps_REF.h:1651:32: note: in expansion of macro 'SSP_CONST_SET_64I' const static __m128i tmp = SSP_CONST_SET_64I( 0xFFFFFFFFFFFFFFFFULL, 0xFFFFFFFFFFFFFFFFULL ); ^~~~~~~~~~~~~~~~~ sdk/SSEPlus/include/emulation/SSEPlus_emulation_comps_REF.h: In function 'Ref_m128 ssp_comtrue_ps_REF(Ref_m128, Ref_m128)': sdk/SSEPlus/include/SSEPlus_platform.h:335:16: error: narrowing conversion of '18446744073709551615ull' from 'long long unsigned int' to 'long long int' inside { } [-Wnarrowing] { (a), (b) } ^ sdk/SSEPlus/include/SSEPlus_platform.h:338:5: note: in expansion of macro 'SSP_CONST_SETR_64I' SSP_CONST_SETR_64I( (b), (a) ) ^~~~~~~~~~~~~~~~~~ sdk/SSEPlus/include/emulation/SSEPlus_emulation_comps_REF.h:1661:32: note: in expansion of macro 'SSP_CONST_SET_64I' const static __m128i tmp = SSP_CONST_SET_64I( 0xFFFFFFFFFFFFFFFFULL, 0xFFFFFFFFFFFFFFFFULL ); ^~~~~~~~~~~~~~~~~ sdk/SSEPlus/include/SSEPlus_platform.h:335:16: error: narrowing conversion of '18446744073709551615ull' from 'long long unsigned int' to 'long long int' inside { } [-Wnarrowing] { (a), (b) } ^ sdk/SSEPlus/include/SSEPlus_platform.h:338:5: note: in expansion of macro 'SSP_CONST_SETR_64I' SSP_CONST_SETR_64I( (b), (a) ) ^~~~~~~~~~~~~~~~~~ sdk/SSEPlus/include/emulation/SSEPlus_emulation_comps_REF.h:1661:32: note: in expansion of macro 'SSP_CONST_SET_64I' const static __m128i tmp = SSP_CONST_SET_64I( 0xFFFFFFFFFFFFFFFFULL, 0xFFFFFFFFFFFFFFFFULL ); ^~~~~~~~~~~~~~~~~ In file included from sdk/cbl/cbl.h:11:0, from domain/common/include/system.h:188, from domain/common/include/fwdev.h:19, from domain/fwImage/include/colorModelConvConst.h:9, from domain/fwImage/include/colorModelConversion.h:9, from domain/fwImage/src/colorModelConversion_RGB_YCBCR.cpp:6: sdk/cbl/cbl_common_primitives.h: At global scope: sdk/cbl/cbl_common_primitives.h:288:43: error: narrowing conversion of '9223512776490647552ull' from 'U64 {aka long long unsigned int}' to 'long long int' inside { } [-Wnarrowing] (U64)(g), (U64)(h) ) } ^ sdk/cbl/cbl_common_primitives.h:291:5: note: in expansion of macro 'CONST_SETR_16I' CONST_SETR_16I( (h), (g), (f), (e), (d), (c), (b), (a) ) ^~~~~~~~~~~~~~ sdk/cbl/cbl_common_primitives.h:294:5: note: in expansion of macro 'CONST_SET_16I' CONST_SET_16I( (x), (x), (x), (x), (x), (x), (x), (x) ) ^~~~~~~~~~~~~ sdk/cbl/cbl_common_primitives.h:394:44: note: in expansion of macro 'CONST_SET1_16I' const __m128i __g_min_S16_vector = CONST_SET1_16I( CBL_S16_MIN ); ^~~~~~~~~~~~~~ sdk/cbl/cbl_common_primitives.h:288:43: error: narrowing conversion of '9223512776490647552ull' from 'U64 {aka long long unsigned int}' to 'long long int' inside { } [-Wnarrowing] (U64)(g), (U64)(h) ) } ^ sdk/cbl/cbl_common_primitives.h:291:5: note: in expansion of macro 'CONST_SETR_16I' CONST_SETR_16I( (h), (g), (f), (e), (d), (c), (b), (a) ) ^~~~~~~~~~~~~~ sdk/cbl/cbl_common_primitives.h:294:5: note: in expansion of macro 'CONST_SET_16I' CONST_SET_16I( (x), (x), (x), (x), (x), (x), (x), (x) ) ^~~~~~~~~~~~~ sdk/cbl/cbl_common_primitives.h:394:44: note: in expansion of macro 'CONST_SET1_16I' const __m128i __g_min_S16_vector = CONST_SET1_16I( CBL_S16_MIN ); ^~~~~~~~~~~~~~ sdk/cbl/cbl_common_primitives.h:306:43: error: narrowing conversion of '9223372039002259456ull' from 'U64 {aka long long unsigned int}' to 'long long int' inside { } [-Wnarrowing] __CNST32TO64_( (U64)(c), (U64)(d) ) } ^ sdk/cbl/cbl_common_primitives.h:309:5: note: in expansion of macro 'CONST_SETR_32I' CONST_SETR_32I( (d), (c), (b), (a) ) ^~~~~~~~~~~~~~ sdk/cbl/cbl_common_primitives.h:312:5: note: in expansion of macro 'CONST_SET_32I' CONST_SET_32I( (x), (x), (x), (x) ) ^~~~~~~~~~~~~ sdk/cbl/cbl_common_primitives.h:396:44: note: in expansion of macro 'CONST_SET1_32I' const __m128i __g_min_S32_vector = CONST_SET1_32I( CBL_S32_MIN ); ^~~~~~~~~~~~~~ sdk/cbl/cbl_common_primitives.h:306:43: error: narrowing conversion of '9223372039002259456ull' from 'U64 {aka long long unsigned int}' to 'long long int' inside { } [-Wnarrowing] __CNST32TO64_( (U64)(c), (U64)(d) ) } ^ sdk/cbl/cbl_common_primitives.h:309:5: note: in expansion of macro 'CONST_SETR_32I' CONST_SETR_32I( (d), (c), (b), (a) ) ^~~~~~~~~~~~~~ sdk/cbl/cbl_common_primitives.h:312:5: note: in expansion of macro 'CONST_SET_32I' CONST_SET_32I( (x), (x), (x), (x) ) ^~~~~~~~~~~~~ sdk/cbl/cbl_common_primitives.h:396:44: note: in expansion of macro 'CONST_SET1_32I' const __m128i __g_min_S32_vector = CONST_SET1_32I( CBL_S32_MIN ); ^~~~~~~~~~~~~~ sdk/cbl/cbl_common_primitives.h:320:16: error: narrowing conversion of '9223372036854775808ull' from 'long long unsigned int' to 'long long int' inside { } [-Wnarrowing] { (a), (b) } ^ sdk/cbl/cbl_common_primitives.h:323:5: note: in expansion of macro 'CONST_SETR_64I' CONST_SETR_64I( (b), (a) ) ^~~~~~~~~~~~~~ sdk/cbl/cbl_common_primitives.h:326:5: note: in expansion of macro 'CONST_SET_64I' CONST_SET_64I( (x), (x) ) ^~~~~~~~~~~~~ sdk/cbl/cbl_common_primitives.h:398:44: note: in expansion of macro 'CONST_SET1_64I' const __m128i __g_min_S64_vector = CONST_SET1_64I( CBL_S64_MIN ); ^~~~~~~~~~~~~~ sdk/cbl/cbl_common_primitives.h:320:16: error: narrowing conversion of '9223372036854775808ull' from 'long long unsigned int' to 'long long int' inside { } [-Wnarrowing] { (a), (b) } ^ sdk/cbl/cbl_common_primitives.h:323:5: note: in expansion of macro 'CONST_SETR_64I' CONST_SETR_64I( (b), (a) ) ^~~~~~~~~~~~~~ sdk/cbl/cbl_common_primitives.h:326:5: note: in expansion of macro 'CONST_SET_64I' CONST_SET_64I( (x), (x) ) ^~~~~~~~~~~~~ sdk/cbl/cbl_common_primitives.h:398:44: note: in expansion of macro 'CONST_SET1_64I' const __m128i __g_min_S64_vector = CONST_SET1_64I( CBL_S64_MIN ); ^~~~~~~~~~~~~~ sdk/cbl/cbl_pack_unpack_primitives_sse2.h: In static member function 'static Ref_m128i CBL_LIBRARY::CBL_SSE2::Pack64STo32S(const Ref_m128i&, const Ref_m128i&)': sdk/cbl/cbl_common_primitives.h:306:43: error: narrowing conversion of '18446744073709551615ull' from 'U64 {aka long long unsigned int}' to 'long long int' inside { } [-Wnarrowing] __CNST32TO64_( (U64)(c), (U64)(d) ) } ^ sdk/cbl/cbl_common_primitives.h:309:5: note: in expansion of macro 'CONST_SETR_32I' CONST_SETR_32I( (d), (c), (b), (a) ) ^~~~~~~~~~~~~~ sdk/cbl/cbl_common_primitives.h:312:5: note: in expansion of macro 'CONST_SET_32I' CONST_SET_32I( (x), (x), (x), (x) ) ^~~~~~~~~~~~~ sdk/cbl/cbl_pack_unpack_primitives_sse2.h:362:25: note: in expansion of macro 'CONST_SET1_32I' const __m128i nOne = CONST_SET1_32I(0xFFFFFFFF); ^~~~~~~~~~~~~~ sdk/cbl/cbl_common_primitives.h:306:43: error: narrowing conversion of '18446744073709551615ull' from 'U64 {aka long long unsigned int}' to 'long long int' inside { } [-Wnarrowing] __CNST32TO64_( (U64)(c), (U64)(d) ) } ^ sdk/cbl/cbl_common_primitives.h:309:5: note: in expansion of macro 'CONST_SETR_32I' CONST_SETR_32I( (d), (c), (b), (a) ) ^~~~~~~~~~~~~~ sdk/cbl/cbl_common_primitives.h:312:5: note: in expansion of macro 'CONST_SET_32I' CONST_SET_32I( (x), (x), (x), (x) ) ^~~~~~~~~~~~~ sdk/cbl/cbl_pack_unpack_primitives_sse2.h:362:25: note: in expansion of macro 'CONST_SET1_32I' const __m128i nOne = CONST_SET1_32I(0xFFFFFFFF); ^~~~~~~~~~~~~~ scons: *** [build/tmp/fwBase_release_shared_64/common/obj/Constants.obj] Error 1 sdk/cbl/cbl_pack_unpack_primitives_sse2.h: In static member function 'static Ref_m128i CBL_LIB_REFR::CBL_SSE2::Pack64STo32S(const Ref_m128i&, const Ref_m128i&)': sdk/cbl/cbl_common_primitives.h:306:43: error: narrowing conversion of '18446744073709551615ull' from 'U64 {aka long long unsigned int}' to 'long long int' inside { } [-Wnarrowing] __CNST32TO64_( (U64)(c), (U64)(d) ) } ^ sdk/cbl/cbl_common_primitives.h:309:5: note: in expansion of macro 'CONST_SETR_32I' CONST_SETR_32I( (d), (c), (b), (a) ) ^~~~~~~~~~~~~~ sdk/cbl/cbl_common_primitives.h:312:5: note: in expansion of macro 'CONST_SET_32I' CONST_SET_32I( (x), (x), (x), (x) ) ^~~~~~~~~~~~~ sdk/cbl/cbl_pack_unpack_primitives_sse2.h:362:25: note: in expansion of macro 'CONST_SET1_32I' const __m128i nOne = CONST_SET1_32I(0xFFFFFFFF); ^~~~~~~~~~~~~~ sdk/cbl/cbl_common_primitives.h:306:43: error: narrowing conversion of '18446744073709551615ull' from 'U64 {aka long long unsigned int}' to 'long long int' inside { } [-Wnarrowing] __CNST32TO64_( (U64)(c), (U64)(d) ) } ^ sdk/cbl/cbl_common_primitives.h:309:5: note: in expansion of macro 'CONST_SETR_32I' CONST_SETR_32I( (d), (c), (b), (a) ) ^~~~~~~~~~~~~~ sdk/cbl/cbl_common_primitives.h:312:5: note: in expansion of macro 'CONST_SET_32I' CONST_SET_32I( (x), (x), (x), (x) ) ^~~~~~~~~~~~~ sdk/cbl/cbl_pack_unpack_primitives_sse2.h:362:25: note: in expansion of macro 'CONST_SET1_32I' const __m128i nOne = CONST_SET1_32I(0xFFFFFFFF); ^~~~~~~~~~~~~~ In file included from domain/fwImage/include/colorModelConvConst.h:9:0, from domain/fwImage/include/colorModelConversion.h:9, from domain/fwImage/src/colorModelConversion_RGB_YCBCR.cpp:6: domain/common/include/fwdev.h: At global scope: domain/common/include/fwdev.h:86:12: error: expected identifier before 'static_assert' struct static_assert {}; ^~~~~~~~~~~~~ domain/common/include/fwdev.h:86:12: error: expected unqualified-id before 'static_assert' domain/common/include/fwdev.h:88:12: error: expected identifier before 'static_assert' struct static_assert<false> ^~~~~~~~~~~~~ domain/common/include/fwdev.h:88:12: error: expected unqualified-id before 'static_assert' domain/common/include/FwSharedCode.h: In static member function 'static TD REFR::FW_REF::Normalize<TS, TD>::LUVNormalizeL(double)': domain/common/include/fwdev.h:39:43: error: expected '(' before '<' token #define STATIC_ASSERT( arg ) static_assert<arg>() ^ domain/common/include/FwSharedCode.h:380:53: note: in expansion of macro 'STATIC_ASSERT' static TD LUVNormalizeL ( const double s ){ STATIC_ASSERT(false); return 0; } ^~~~~~~~~~~~~ domain/common/include/fwdev.h:39:43: error: expected primary-expression before '<' token #define STATIC_ASSERT( arg ) static_assert<arg>() ^ domain/common/include/FwSharedCode.h:380:53: note: in expansion of macro 'STATIC_ASSERT' static TD LUVNormalizeL ( const double s ){ STATIC_ASSERT(false); return 0; } ^~~~~~~~~~~~~ domain/common/include/fwdev.h:39:49: error: expected primary-expression before ')' token #define STATIC_ASSERT( arg ) static_assert<arg>() ^ domain/common/include/FwSharedCode.h:380:53: note: in expansion of macro 'STATIC_ASSERT' static TD LUVNormalizeL ( const double s ){ STATIC_ASSERT(false); return 0; } ^~~~~~~~~~~~~ In file included from domain/common/include/FwSharedCode_SSE2.h:10:0, from domain/fwImage/include/colorModelConvConst.h:10, from domain/fwImage/include/colorModelConversion.h:9, from domain/fwImage/src/colorModelConversion_RGB_YCBCR.cpp:6: domain/common/include/FwSharedCode.h:380:73: error: expected ',' before ';' token static TD LUVNormalizeL ( const double s ){ STATIC_ASSERT(false); return 0; } ^ domain/common/include/FwSharedCode.h:380:73: error: expected string-literal before ';' token domain/common/include/FwSharedCode.h:380:73: error: expected ')' before ';' token In file included from domain/fwImage/include/colorModelConvConst.h:9:0, from domain/fwImage/include/colorModelConversion.h:9, from domain/fwImage/src/colorModelConversion_RGB_YCBCR.cpp:6: domain/common/include/FwSharedCode.h: In static member function 'static TD REFR::FW_REF::Normalize<TS, TD>::LUVNormalizeU(double)': domain/common/include/fwdev.h:39:43: error: expected '(' before '<' token #define STATIC_ASSERT( arg ) static_assert<arg>() ^ domain/common/include/FwSharedCode.h:381:53: note: in expansion of macro 'STATIC_ASSERT' static TD LUVNormalizeU ( const double s ){ STATIC_ASSERT(false); return 0; } ^~~~~~~~~~~~~ domain/common/include/fwdev.h:39:43: error: expected primary-expression before '<' token #define STATIC_ASSERT( arg ) static_assert<arg>() ^ domain/common/include/FwSharedCode.h:381:53: note: in expansion of macro 'STATIC_ASSERT' static TD LUVNormalizeU ( const double s ){ STATIC_ASSERT(false); return 0; } ^~~~~~~~~~~~~ domain/common/include/fwdev.h:39:49: error: expected primary-expression before ')' token #define STATIC_ASSERT( arg ) static_assert<arg>() ^ domain/common/include/FwSharedCode.h:381:53: note: in expansion of macro 'STATIC_ASSERT' static TD LUVNormalizeU ( const double s ){ STATIC_ASSERT(false); return 0; } ^~~~~~~~~~~~~ In file included from domain/common/include/FwSharedCode_SSE2.h:10:0, from domain/fwImage/include/colorModelConvConst.h:10, from domain/fwImage/include/colorModelConversion.h:9, from domain/fwImage/src/colorModelConversion_RGB_YCBCR.cpp:6: domain/common/include/FwSharedCode.h:381:73: error: expected ',' before ';' token static TD LUVNormalizeU ( const double s ){ STATIC_ASSERT(false); return 0; } ^ domain/common/include/FwSharedCode.h:381:73: error: expected string-literal before ';' token domain/common/include/FwSharedCode.h:381:73: error: expected ')' before ';' token In file included from domain/fwImage/include/colorModelConvConst.h:9:0, from domain/fwImage/include/colorModelConversion.h:9, from domain/fwImage/src/colorModelConversion_RGB_YCBCR.cpp:6: domain/common/include/FwSharedCode.h: In static member function 'static TD REFR::FW_REF::Normalize<TS, TD>::LUVNormalizeV(double)': domain/common/include/fwdev.h:39:43: error: expected '(' before '<' token #define STATIC_ASSERT( arg ) static_assert<arg>() ^ domain/common/include/FwSharedCode.h:382:53: note: in expansion of macro 'STATIC_ASSERT' static TD LUVNormalizeV ( const double s ){ STATIC_ASSERT(false); return 0; } ^~~~~~~~~~~~~ domain/common/include/fwdev.h:39:43: error: expected primary-expression before '<' token #define STATIC_ASSERT( arg ) static_assert<arg>() ^ domain/common/include/FwSharedCode.h:382:53: note: in expansion of macro 'STATIC_ASSERT' static TD LUVNormalizeV ( const double s ){ STATIC_ASSERT(false); return 0; } ^~~~~~~~~~~~~ domain/common/include/fwdev.h:39:49: error: expected primary-expression before ')' token #define STATIC_ASSERT( arg ) static_assert<arg>() ^ domain/common/include/FwSharedCode.h:382:53: note: in expansion of macro 'STATIC_ASSERT' static TD LUVNormalizeV ( const double s ){ STATIC_ASSERT(false); return 0; } ^~~~~~~~~~~~~ In file included from domain/common/include/FwSharedCode_SSE2.h:10:0, from domain/fwImage/include/colorModelConvConst.h:10, from domain/fwImage/include/colorModelConversion.h:9, from domain/fwImage/src/colorModelConversion_RGB_YCBCR.cpp:6: domain/common/include/FwSharedCode.h:382:73: error: expected ',' before ';' token static TD LUVNormalizeV ( const double s ){ STATIC_ASSERT(false); return 0; } ^ domain/common/include/FwSharedCode.h:382:73: error: expected string-literal before ';' token domain/common/include/FwSharedCode.h:382:73: error: expected ')' before ';' token In file included from domain/fwImage/include/colorModelConvConst.h:9:0, from domain/fwImage/include/colorModelConversion.h:9, from domain/fwImage/src/colorModelConversion_RGB_YCBCR.cpp:6: domain/common/include/FwSharedCode.h: In static member function 'static double REFR::FW_REF::Normalize<TS, TD>::LUVUnNormalizeL(TS)': domain/common/include/fwdev.h:39:43: error: expected '(' before '<' token #define STATIC_ASSERT( arg ) static_assert<arg>() ^ domain/common/include/FwSharedCode.h:384:55: note: in expansion of macro 'STATIC_ASSERT' static double LUVUnNormalizeL ( const TS s ){ STATIC_ASSERT(false); return 0; } ^~~~~~~~~~~~~ domain/common/include/fwdev.h:39:43: error: expected primary-expression before '<' token #define STATIC_ASSERT( arg ) static_assert<arg>() ^ domain/common/include/FwSharedCode.h:384:55: note: in expansion of macro 'STATIC_ASSERT' static double LUVUnNormalizeL ( const TS s ){ STATIC_ASSERT(false); return 0; } ^~~~~~~~~~~~~ domain/common/include/fwdev.h:39:49: error: expected primary-expression before ')' token #define STATIC_ASSERT( arg ) static_assert<arg>() ^ domain/common/include/FwSharedCode.h:384:55: note: in expansion of macro 'STATIC_ASSERT' static double LUVUnNormalizeL ( const TS s ){ STATIC_ASSERT(false); return 0; } ^~~~~~~~~~~~~ In file included from domain/common/include/FwSharedCode_SSE2.h:10:0, from domain/fwImage/include/colorModelConvConst.h:10, from domain/fwImage/include/colorModelConversion.h:9, from domain/fwImage/src/colorModelConversion_RGB_YCBCR.cpp:6: domain/common/include/FwSharedCode.h:384:75: error: expected ',' before ';' token static double LUVUnNormalizeL ( const TS s ){ STATIC_ASSERT(false); return 0; } ^ domain/common/include/FwSharedCode.h:384:75: error: expected string-literal before ';' token domain/common/include/FwSharedCode.h:384:75: error: expected ')' before ';' token In file included from domain/fwImage/include/colorModelConvConst.h:9:0, from domain/fwImage/include/colorModelConversion.h:9, from domain/fwImage/src/colorModelConversion_RGB_YCBCR.cpp:6: domain/common/include/FwSharedCode.h: In static member function 'static double REFR::FW_REF::Normalize<TS, TD>::LUVUnNormalizeU(TS)': domain/common/include/fwdev.h:39:43: error: expected '(' before '<' token #define STATIC_ASSERT( arg ) static_assert<arg>() ^ domain/common/include/FwSharedCode.h:385:55: note: in expansion of macro 'STATIC_ASSERT' static double LUVUnNormalizeU ( const TS s ){ STATIC_ASSERT(false); return 0; } ^~~~~~~~~~~~~ domain/common/include/fwdev.h:39:43: error: expected primary-expression before '<' token #define STATIC_ASSERT( arg ) static_assert<arg>() ^ domain/common/include/FwSharedCode.h:385:55: note: in expansion of macro 'STATIC_ASSERT' static double LUVUnNormalizeU ( const TS s ){ STATIC_ASSERT(false); return 0; } ^~~~~~~~~~~~~ domain/common/include/fwdev.h:39:49: error: expected primary-expression before ')' token #define STATIC_ASSERT( arg ) static_assert<arg>() ^ domain/common/include/FwSharedCode.h:385:55: note: in expansion of macro 'STATIC_ASSERT' static double LUVUnNormalizeU ( const TS s ){ STATIC_ASSERT(false); return 0; } ^~~~~~~~~~~~~ In file included from domain/common/include/FwSharedCode_SSE2.h:10:0, from domain/fwImage/include/colorModelConvConst.h:10, from domain/fwImage/include/colorModelConversion.h:9, from domain/fwImage/src/colorModelConversion_RGB_YCBCR.cpp:6: domain/common/include/FwSharedCode.h:385:75: error: expected ',' before ';' token static double LUVUnNormalizeU ( const TS s ){ STATIC_ASSERT(false); return 0; } ^ domain/common/include/FwSharedCode.h:385:75: error: expected string-literal before ';' token domain/common/include/FwSharedCode.h:385:75: error: expected ')' before ';' token In file included from domain/fwImage/include/colorModelConvConst.h:9:0, from domain/fwImage/include/colorModelConversion.h:9, from domain/fwImage/src/colorModelConversion_RGB_YCBCR.cpp:6: domain/common/include/FwSharedCode.h: In static member function 'static double REFR::FW_REF::Normalize<TS, TD>::LUVUnNormalizeV(TS)': domain/common/include/fwdev.h:39:43: error: expected '(' before '<' token #define STATIC_ASSERT( arg ) static_assert<arg>() ^ domain/common/include/FwSharedCode.h:386:55: note: in expansion of macro 'STATIC_ASSERT' static double LUVUnNormalizeV ( const TS s ){ STATIC_ASSERT(false); return 0; } ^~~~~~~~~~~~~ domain/common/include/fwdev.h:39:43: error: expected primary-expression before '<' token #define STATIC_ASSERT( arg ) static_assert<arg>() ^ domain/common/include/FwSharedCode.h:386:55: note: in expansion of macro 'STATIC_ASSERT' static double LUVUnNormalizeV ( const TS s ){ STATIC_ASSERT(false); return 0; } ^~~~~~~~~~~~~ domain/common/include/fwdev.h:39:49: error: expected primary-expression before ')' token #define STATIC_ASSERT( arg ) static_assert<arg>() ^ domain/common/include/FwSharedCode.h:386:55: note: in expansion of macro 'STATIC_ASSERT' static double LUVUnNormalizeV ( const TS s ){ STATIC_ASSERT(false); return 0; } ^~~~~~~~~~~~~ In file included from domain/common/include/FwSharedCode_SSE2.h:10:0, from domain/fwImage/include/colorModelConvConst.h:10, from domain/fwImage/include/colorModelConversion.h:9, from domain/fwImage/src/colorModelConversion_RGB_YCBCR.cpp:6: domain/common/include/FwSharedCode.h:386:75: error: expected ',' before ';' token static double LUVUnNormalizeV ( const TS s ){ STATIC_ASSERT(false); return 0; } ^ domain/common/include/FwSharedCode.h:386:75: error: expected string-literal before ';' token domain/common/include/FwSharedCode.h:386:75: error: expected ')' before ';' token In file included from domain/fwImage/include/colorModelConvConst.h:9:0, from domain/fwImage/include/colorModelConversion.h:9, from domain/fwImage/src/colorModelConversion_RGB_YCBCR.cpp:6: domain/common/include/FwSharedCode.h: In static member function 'static TD REFR::FW_REF::Normalize<TS, TD>::LabNormalizeL(double)': domain/common/include/fwdev.h:39:43: error: expected '(' before '<' token #define STATIC_ASSERT( arg ) static_assert<arg>() ^ domain/common/include/FwSharedCode.h:388:53: note: in expansion of macro 'STATIC_ASSERT' static TD LabNormalizeL ( const double s ){ STATIC_ASSERT(false); return 0; } ^~~~~~~~~~~~~ domain/common/include/fwdev.h:39:43: error: expected primary-expression before '<' token #define STATIC_ASSERT( arg ) static_assert<arg>() ^ domain/common/include/FwSharedCode.h:388:53: note: in expansion of macro 'STATIC_ASSERT' static TD LabNormalizeL ( const double s ){ STATIC_ASSERT(false); return 0; } ^~~~~~~~~~~~~ domain/common/include/fwdev.h:39:49: error: expected primary-expression before ')' token #define STATIC_ASSERT( arg ) static_assert<arg>() ^ domain/common/include/FwSharedCode.h:388:53: note: in expansion of macro 'STATIC_ASSERT' static TD LabNormalizeL ( const double s ){ STATIC_ASSERT(false); return 0; } ^~~~~~~~~~~~~ In file included from domain/common/include/FwSharedCode_SSE2.h:10:0, from domain/fwImage/include/colorModelConvConst.h:10, from domain/fwImage/include/colorModelConversion.h:9, from domain/fwImage/src/colorModelConversion_RGB_YCBCR.cpp:6: domain/common/include/FwSharedCode.h:388:73: error: expected ',' before ';' token static TD LabNormalizeL ( const double s ){ STATIC_ASSERT(false); return 0; } ^ domain/common/include/FwSharedCode.h:388:73: error: expected string-literal before ';' token domain/common/include/FwSharedCode.h:388:73: error: expected ')' before ';' token In file included from domain/fwImage/include/colorModelConvConst.h:9:0, from domain/fwImage/include/colorModelConversion.h:9, from domain/fwImage/src/colorModelConversion_RGB_YCBCR.cpp:6: domain/common/include/FwSharedCode.h: In static member function 'static TD REFR::FW_REF::Normalize<TS, TD>::LabNormalizea(double)': domain/common/include/fwdev.h:39:43: error: expected '(' before '<' token #define STATIC_ASSERT( arg ) static_assert<arg>() ^ domain/common/include/FwSharedCode.h:389:53: note: in expansion of macro 'STATIC_ASSERT' static TD LabNormalizea ( const double s ){ STATIC_ASSERT(false); return 0; } ^~~~~~~~~~~~~ domain/common/include/fwdev.h:39:43: error: expected primary-expression before '<' token #define STATIC_ASSERT( arg ) static_assert<arg>() ^ domain/common/include/FwSharedCode.h:389:53: note: in expansion of macro 'STATIC_ASSERT' static TD LabNormalizea ( const double s ){ STATIC_ASSERT(false); return 0; } ^~~~~~~~~~~~~ domain/common/include/fwdev.h:39:49: error: expected primary-expression before ')' token #define STATIC_ASSERT( arg ) static_assert<arg>() ^ domain/common/include/FwSharedCode.h:389:53: note: in expansion of macro 'STATIC_ASSERT' static TD LabNormalizea ( const double s ){ STATIC_ASSERT(false); return 0; } ^~~~~~~~~~~~~ In file included from domain/common/include/FwSharedCode_SSE2.h:10:0, from domain/fwImage/include/colorModelConvConst.h:10, from domain/fwImage/include/colorModelConversion.h:9, from domain/fwImage/src/colorModelConversion_RGB_YCBCR.cpp:6: domain/common/include/FwSharedCode.h:389:73: error: expected ',' before ';' token static TD LabNormalizea ( const double s ){ STATIC_ASSERT(false); return 0; } ^ domain/common/include/FwSharedCode.h:389:73: error: expected string-literal before ';' token domain/common/include/FwSharedCode.h:389:73: error: expected ')' before ';' token In file included from domain/fwImage/include/colorModelConvConst.h:9:0, from domain/fwImage/include/colorModelConversion.h:9, from domain/fwImage/src/colorModelConversion_RGB_YCBCR.cpp:6: domain/common/include/FwSharedCode.h: In static member function 'static TD REFR::FW_REF::Normalize<TS, TD>::LabNormalizeb(double)': domain/common/include/fwdev.h:39:43: error: expected '(' before '<' token #define STATIC_ASSERT( arg ) static_assert<arg>() ^ domain/common/include/FwSharedCode.h:390:53: note: in expansion of macro 'STATIC_ASSERT' static TD LabNormalizeb ( const double s ){ STATIC_ASSERT(false); return 0; } ^~~~~~~~~~~~~ domain/common/include/fwdev.h:39:43: error: expected primary-expression before '<' token #define STATIC_ASSERT( arg ) static_assert<arg>() ^ domain/common/include/FwSharedCode.h:390:53: note: in expansion of macro 'STATIC_ASSERT' static TD LabNormalizeb ( const double s ){ STATIC_ASSERT(false); return 0; } ^~~~~~~~~~~~~ domain/common/include/fwdev.h:39:49: error: expected primary-expression before ')' token #define STATIC_ASSERT( arg ) static_assert<arg>() ^ domain/common/include/FwSharedCode.h:390:53: note: in expansion of macro 'STATIC_ASSERT' static TD LabNormalizeb ( const double s ){ STATIC_ASSERT(false); return 0; } ^~~~~~~~~~~~~ In file included from domain/common/include/FwSharedCode_SSE2.h:10:0, from domain/fwImage/include/colorModelConvConst.h:10, from domain/fwImage/include/colorModelConversion.h:9, from domain/fwImage/src/colorModelConversion_RGB_YCBCR.cpp:6: domain/common/include/FwSharedCode.h:390:73: error: expected ',' before ';' token static TD LabNormalizeb ( const double s ){ STATIC_ASSERT(false); return 0; } ^ domain/common/include/FwSharedCode.h:390:73: error: expected string-literal before ';' token domain/common/include/FwSharedCode.h:390:73: error: expected ')' before ';' token In file included from domain/fwImage/include/colorModelConvConst.h:9:0, from domain/fwImage/include/colorModelConversion.h:9, from domain/fwImage/src/colorModelConversion_RGB_YCBCR.cpp:6: domain/common/include/FwSharedCode.h: In static member function 'static double REFR::FW_REF::Normalize<TS, TD>::LabUnNormalizeL(TS)': domain/common/include/fwdev.h:39:43: error: expected '(' before '<' token #define STATIC_ASSERT( arg ) static_assert<arg>() ^ domain/common/include/FwSharedCode.h:392:55: note: in expansion of macro 'STATIC_ASSERT' static double LabUnNormalizeL ( const TS s ){ STATIC_ASSERT(false); return 0; } ^~~~~~~~~~~~~ domain/common/include/fwdev.h:39:43: error: expected primary-expression before '<' token #define STATIC_ASSERT( arg ) static_assert<arg>() ^ domain/common/include/FwSharedCode.h:392:55: note: in expansion of macro 'STATIC_ASSERT' static double LabUnNormalizeL ( const TS s ){ STATIC_ASSERT(false); return 0; } ^~~~~~~~~~~~~ domain/common/include/fwdev.h:39:49: error: expected primary-expression before ')' token #define STATIC_ASSERT( arg ) static_assert<arg>() ^ domain/common/include/FwSharedCode.h:392:55: note: in expansion of macro 'STATIC_ASSERT' static double LabUnNormalizeL ( const TS s ){ STATIC_ASSERT(false); return 0; } ^~~~~~~~~~~~~ In file included from domain/common/include/FwSharedCode_SSE2.h:10:0, from domain/fwImage/include/colorModelConvConst.h:10, from domain/fwImage/include/colorModelConversion.h:9, from domain/fwImage/src/colorModelConversion_RGB_YCBCR.cpp:6: domain/common/include/FwSharedCode.h:392:75: error: expected ',' before ';' token static double LabUnNormalizeL ( const TS s ){ STATIC_ASSERT(false); return 0; } ^ domain/common/include/FwSharedCode.h:392:75: error: expected string-literal before ';' token domain/common/include/FwSharedCode.h:392:75: error: expected ')' before ';' token In file included from domain/fwImage/include/colorModelConvConst.h:9:0, from domain/fwImage/include/colorModelConversion.h:9, from domain/fwImage/src/colorModelConversion_RGB_YCBCR.cpp:6: domain/common/include/FwSharedCode.h: In static member function 'static double REFR::FW_REF::Normalize<TS, TD>::LabUnNormalizea(TS)': domain/common/include/fwdev.h:39:43: error: expected '(' before '<' token #define STATIC_ASSERT( arg ) static_assert<arg>() ^ domain/common/include/FwSharedCode.h:393:55: note: in expansion of macro 'STATIC_ASSERT' static double LabUnNormalizea ( const TS s ){ STATIC_ASSERT(false); return 0; } ^~~~~~~~~~~~~ domain/common/include/fwdev.h:39:43: error: expected primary-expression before '<' token #define STATIC_ASSERT( arg ) static_assert<arg>() ^ domain/common/include/FwSharedCode.h:393:55: note: in expansion of macro 'STATIC_ASSERT' static double LabUnNormalizea ( const TS s ){ STATIC_ASSERT(false); return 0; } ^~~~~~~~~~~~~ domain/common/include/fwdev.h:39:49: error: expected primary-expression before ')' token #define STATIC_ASSERT( arg ) static_assert<arg>() ^ domain/common/include/FwSharedCode.h:393:55: note: in expansion of macro 'STATIC_ASSERT' static double LabUnNormalizea ( const TS s ){ STATIC_ASSERT(false); return 0; } ^~~~~~~~~~~~~ In file included from domain/common/include/FwSharedCode_SSE2.h:10:0, from domain/fwImage/include/colorModelConvConst.h:10, from domain/fwImage/include/colorModelConversion.h:9, from domain/fwImage/src/colorModelConversion_RGB_YCBCR.cpp:6: domain/common/include/FwSharedCode.h:393:75: error: expected ',' before ';' token static double LabUnNormalizea ( const TS s ){ STATIC_ASSERT(false); return 0; } ^ domain/common/include/FwSharedCode.h:393:75: error: expected string-literal before ';' token domain/common/include/FwSharedCode.h:393:75: error: expected ')' before ';' token In file included from domain/fwImage/include/colorModelConvConst.h:9:0, from domain/fwImage/include/colorModelConversion.h:9, from domain/fwImage/src/colorModelConversion_RGB_YCBCR.cpp:6: domain/common/include/FwSharedCode.h: In static member function 'static double REFR::FW_REF::Normalize<TS, TD>::LabUnNormalizeb(TS)': domain/common/include/fwdev.h:39:43: error: expected '(' before '<' token #define STATIC_ASSERT( arg ) static_assert<arg>() ^ domain/common/include/FwSharedCode.h:394:55: note: in expansion of macro 'STATIC_ASSERT' static double LabUnNormalizeb ( const TS s ){ STATIC_ASSERT(false); return 0; } ^~~~~~~~~~~~~ domain/common/include/fwdev.h:39:43: error: expected primary-expression before '<' token #define STATIC_ASSERT( arg ) static_assert<arg>() ^ domain/common/include/FwSharedCode.h:394:55: note: in expansion of macro 'STATIC_ASSERT' static double LabUnNormalizeb ( const TS s ){ STATIC_ASSERT(false); return 0; } ^~~~~~~~~~~~~ domain/common/include/fwdev.h:39:49: error: expected primary-expression before ')' token #define STATIC_ASSERT( arg ) static_assert<arg>() ^ domain/common/include/FwSharedCode.h:394:55: note: in expansion of macro 'STATIC_ASSERT' static double LabUnNormalizeb ( const TS s ){ STATIC_ASSERT(false); return 0; } ^~~~~~~~~~~~~ In file included from domain/common/include/FwSharedCode_SSE2.h:10:0, from domain/fwImage/include/colorModelConvConst.h:10, from domain/fwImage/include/colorModelConversion.h:9, from domain/fwImage/src/colorModelConversion_RGB_YCBCR.cpp:6: domain/common/include/FwSharedCode.h:394:75: error: expected ',' before ';' token static double LabUnNormalizeb ( const TS s ){ STATIC_ASSERT(false); return 0; } ^ domain/common/include/FwSharedCode.h:394:75: error: expected string-literal before ';' token domain/common/include/FwSharedCode.h:394:75: error: expected ')' before ';' token In file included from domain/fwImage/include/colorModelConvConst.h:9:0, from domain/fwImage/include/colorModelConversion.h:9, from domain/fwImage/src/colorModelConversion_RGB_YCBCR.cpp:6: domain/common/include/FwSharedCode.h: In static member function 'static double REFR::FW_REF::Normalize<TS, TD>::Scale(double)': domain/common/include/fwdev.h:39:43: error: expected '(' before '<' token #define STATIC_ASSERT( arg ) static_assert<arg>() ^ domain/common/include/FwSharedCode.h:395:55: note: in expansion of macro 'STATIC_ASSERT' static double Scale ( const double s) { STATIC_ASSERT(false); return 0; } ^~~~~~~~~~~~~ domain/common/include/fwdev.h:39:43: error: expected primary-expression before '<' token #define STATIC_ASSERT( arg ) static_assert<arg>() ^ domain/common/include/FwSharedCode.h:395:55: note: in expansion of macro 'STATIC_ASSERT' static double Scale ( const double s) { STATIC_ASSERT(false); return 0; } ^~~~~~~~~~~~~ domain/common/include/fwdev.h:39:49: error: expected primary-expression before ')' token #define STATIC_ASSERT( arg ) static_assert<arg>() ^ domain/common/include/FwSharedCode.h:395:55: note: in expansion of macro 'STATIC_ASSERT' static double Scale ( const double s) { STATIC_ASSERT(false); return 0; } ^~~~~~~~~~~~~ In file included from domain/common/include/FwSharedCode_SSE2.h:10:0, from domain/fwImage/include/colorModelConvConst.h:10, from domain/fwImage/include/colorModelConversion.h:9, from domain/fwImage/src/colorModelConversion_RGB_YCBCR.cpp:6: domain/common/include/FwSharedCode.h:395:75: error: expected ',' before ';' token static double Scale ( const double s) { STATIC_ASSERT(false); return 0; } ^ domain/common/include/FwSharedCode.h:395:75: error: expected string-literal before ';' token domain/common/include/FwSharedCode.h:395:75: error: expected ')' before ';' token In file included from domain/fwImage/include/colorModelConvConst.h:9:0, from domain/fwImage/include/colorModelConversion.h:9, from domain/fwImage/src/colorModelConversion_RGB_YCBCR.cpp:6: domain/common/include/FwSharedCode.h: In static member function 'static TD REFR::FW_REF::Normalize<TS, TD>::Scale(double, double)': domain/common/include/fwdev.h:39:43: error: expected '(' before '<' token #define STATIC_ASSERT( arg ) static_assert<arg>() ^ domain/common/include/FwSharedCode.h:396:67: note: in expansion of macro 'STATIC_ASSERT' static TD Scale ( const double s, const double val ){ STATIC_ASSERT(false); return 0; } ^~~~~~~~~~~~~ domain/common/include/fwdev.h:39:43: error: expected primary-expression before '<' token #define STATIC_ASSERT( arg ) static_assert<arg>() ^ domain/common/include/FwSharedCode.h:396:67: note: in expansion of macro 'STATIC_ASSERT' static TD Scale ( const double s, const double val ){ STATIC_ASSERT(false); return 0; } ^~~~~~~~~~~~~ domain/common/include/fwdev.h:39:49: error: expected primary-expression before ')' token #define STATIC_ASSERT( arg ) static_assert<arg>() ^ domain/common/include/FwSharedCode.h:396:67: note: in expansion of macro 'STATIC_ASSERT' static TD Scale ( const double s, const double val ){ STATIC_ASSERT(false); return 0; } ^~~~~~~~~~~~~ In file included from domain/common/include/FwSharedCode_SSE2.h:10:0, from domain/fwImage/include/colorModelConvConst.h:10, from domain/fwImage/include/colorModelConversion.h:9, from domain/fwImage/src/colorModelConversion_RGB_YCBCR.cpp:6: domain/common/include/FwSharedCode.h:396:87: error: expected ',' before ';' token static TD Scale ( const double s, const double val ){ STATIC_ASSERT(false); return 0; } ^ domain/common/include/FwSharedCode.h:396:87: error: expected string-literal before ';' token domain/common/include/FwSharedCode.h:396:87: error: expected ')' before ';' token In file included from domain/fwImage/include/colorModelConvConst.h:9:0, from domain/fwImage/include/colorModelConversion.h:9, from domain/fwImage/src/colorModelConversion_RGB_YCBCR.cpp:6: domain/common/include/FwSharedCode.h: In static member function 'static TD REFR::FW_REF::Normalize<TS, TD>::Unscale(double)': domain/common/include/fwdev.h:39:43: error: expected '(' before '<' token #define STATIC_ASSERT( arg ) static_assert<arg>() ^ domain/common/include/FwSharedCode.h:397:55: note: in expansion of macro 'STATIC_ASSERT' static TD Unscale ( const double s ) { STATIC_ASSERT(false); return 0; } ^~~~~~~~~~~~~ domain/common/include/fwdev.h:39:43: error: expected primary-expression before '<' token #define STATIC_ASSERT( arg ) static_assert<arg>() ^ domain/common/include/FwSharedCode.h:397:55: note: in expansion of macro 'STATIC_ASSERT' static TD Unscale ( const double s ) { STATIC_ASSERT(false); return 0; } ^~~~~~~~~~~~~ domain/common/include/fwdev.h:39:49: error: expected primary-expression before ')' token #define STATIC_ASSERT( arg ) static_assert<arg>() ^ domain/common/include/FwSharedCode.h:397:55: note: in expansion of macro 'STATIC_ASSERT' static TD Unscale ( const double s ) { STATIC_ASSERT(false); return 0; } ^~~~~~~~~~~~~ In file included from domain/common/include/FwSharedCode_SSE2.h:10:0, from domain/fwImage/include/colorModelConvConst.h:10, from domain/fwImage/include/colorModelConversion.h:9, from domain/fwImage/src/colorModelConversion_RGB_YCBCR.cpp:6: domain/common/include/FwSharedCode.h:397:75: error: expected ',' before ';' token static TD Unscale ( const double s ) { STATIC_ASSERT(false); return 0; } ^ domain/common/include/FwSharedCode.h:397:75: error: expected string-literal before ';' token domain/common/include/FwSharedCode.h:397:75: error: expected ')' before ';' token In file included from domain/fwImage/include/colorModelConvConst.h:9:0, from domain/fwImage/include/colorModelConversion.h:9, from domain/fwImage/src/colorModelConversion_RGB_YCBCR.cpp:6: domain/common/include/fe.h: In constructor 'REFR::_refr_FE_PRIVATE::B1<FE, alg>::B1(FE&, REFR::_refr_FE_PRIVATE::B1<FE, alg>::TD1*, int, U32)': domain/common/include/fwdev.h:39:43: error: expected '(' before '<' token #define STATIC_ASSERT( arg ) static_assert<arg>() ^ domain/common/include/fe.h:1611:10: note: in expansion of macro 'STATIC_ASSERT' STATIC_ASSERT( ALG_1D == alg ); ^~~~~~~~~~~~~ domain/common/include/fwdev.h:39:43: error: expected primary-expression before '<' token #define STATIC_ASSERT( arg ) static_assert<arg>() ^ domain/common/include/fe.h:1611:10: note: in expansion of macro 'STATIC_ASSERT' STATIC_ASSERT( ALG_1D == alg ); ^~~~~~~~~~~~~ domain/common/include/fwdev.h:39:49: error: expected primary-expression before ')' token #define STATIC_ASSERT( arg ) static_assert<arg>() ^ domain/common/include/fe.h:1611:10: note: in expansion of macro 'STATIC_ASSERT' STATIC_ASSERT( ALG_1D == alg ); ^~~~~~~~~~~~~ In file included from domain/fwImage/include/colorModelConversion.h:11:0, from domain/fwImage/src/colorModelConversion_RGB_YCBCR.cpp:6: domain/common/include/fe.h:1611:40: error: expected ',' before ';' token STATIC_ASSERT( ALG_1D == alg ); ^ domain/common/include/fe.h:1611:40: error: expected string-literal before ';' token domain/common/include/fe.h:1611:40: error: expected ')' before ';' token In file included from domain/fwImage/include/colorModelConvConst.h:9:0, from domain/fwImage/include/colorModelConversion.h:9, from domain/fwImage/src/colorModelConversion_RGB_YCBCR.cpp:6: domain/common/include/fe.h: In constructor 'REFR::_refr_FE_PRIVATE::B1<FE, alg>::B1(FE&, REFR::_refr_FE_PRIVATE::B1<FE, alg>::TD1*, int, FwiSize, U32)': domain/common/include/fwdev.h:39:43: error: expected '(' before '<' token #define STATIC_ASSERT( arg ) static_assert<arg>() ^ domain/common/include/fe.h:1619:10: note: in expansion of macro 'STATIC_ASSERT' STATIC_ASSERT( ALG_2D == alg ); ^~~~~~~~~~~~~ domain/common/include/fwdev.h:39:43: error: expected primary-expression before '<' token #define STATIC_ASSERT( arg ) static_assert<arg>() ^ domain/common/include/fe.h:1619:10: note: in expansion of macro 'STATIC_ASSERT' STATIC_ASSERT( ALG_2D == alg ); ^~~~~~~~~~~~~ domain/common/include/fwdev.h:39:49: error: expected primary-expression before ')' token #define STATIC_ASSERT( arg ) static_assert<arg>() ^ domain/common/include/fe.h:1619:10: note: in expansion of macro 'STATIC_ASSERT' STATIC_ASSERT( ALG_2D == alg ); ^~~~~~~~~~~~~ In file included from domain/fwImage/include/colorModelConversion.h:11:0, from domain/fwImage/src/colorModelConversion_RGB_YCBCR.cpp:6: domain/common/include/fe.h:1619:40: error: expected ',' before ';' token STATIC_ASSERT( ALG_2D == alg ); ^ domain/common/include/fe.h:1619:40: error: expected string-literal before ';' token domain/common/include/fe.h:1619:40: error: expected ')' before ';' token In file included from domain/fwImage/include/colorModelConvConst.h:9:0, from domain/fwImage/include/colorModelConversion.h:9, from domain/fwImage/src/colorModelConversion_RGB_YCBCR.cpp:6: domain/common/include/fe.h: In constructor 'REFR::_refr_FE_PRIVATE::B2<FE, alg>::B2(FE&, const TS1*, REFR::_refr_FE_PRIVATE::B2<FE, alg>::TD1*, int, U32)': domain/common/include/fwdev.h:39:43: error: expected '(' before '<' token #define STATIC_ASSERT( arg ) static_assert<arg>() ^ domain/common/include/fe.h:1813:10: note: in expansion of macro 'STATIC_ASSERT' STATIC_ASSERT( ALG_1D == alg ); ^~~~~~~~~~~~~ domain/common/include/fwdev.h:39:43: error: expected primary-expression before '<' token #define STATIC_ASSERT( arg ) static_assert<arg>() ^ domain/common/include/fe.h:1813:10: note: in expansion of macro 'STATIC_ASSERT' STATIC_ASSERT( ALG_1D == alg ); ^~~~~~~~~~~~~ domain/common/include/fwdev.h:39:49: error: expected primary-expression before ')' token #define STATIC_ASSERT( arg ) static_assert<arg>() ^ domain/common/include/fe.h:1813:10: note: in expansion of macro 'STATIC_ASSERT' STATIC_ASSERT( ALG_1D == alg ); ^~~~~~~~~~~~~ In file included from domain/fwImage/include/colorModelConversion.h:11:0, from domain/fwImage/src/colorModelConversion_RGB_YCBCR.cpp:6: domain/common/include/fe.h:1813:40: error: expected ',' before ';' token STATIC_ASSERT( ALG_1D == alg ); ^ domain/common/include/fe.h:1813:40: error: expected string-literal before ';' token domain/common/include/fe.h:1813:40: error: expected ')' before ';' token In file included from domain/fwImage/include/colorModelConvConst.h:9:0, from domain/fwImage/include/colorModelConversion.h:9, from domain/fwImage/src/colorModelConversion_RGB_YCBCR.cpp:6: domain/common/include/fe.h: In constructor 'REFR::_refr_FE_PRIVATE::B2<FE, alg>::B2(FE&, const TS1*, int, REFR::_refr_FE_PRIVATE::B2<FE, alg>::TD1*, int, FwiSize, U32)': domain/common/include/fwdev.h:39:43: error: expected '(' before '<' token #define STATIC_ASSERT( arg ) static_assert<arg>() ^ domain/common/include/fe.h:1822:10: note: in expansion of macro 'STATIC_ASSERT' STATIC_ASSERT( ALG_2D == alg ); ^~~~~~~~~~~~~ domain/common/include/fwdev.h:39:43: error: expected primary-expression before '<' token #define STATIC_ASSERT( arg ) static_assert<arg>() ^ domain/common/include/fe.h:1822:10: note: in expansion of macro 'STATIC_ASSERT' STATIC_ASSERT( ALG_2D == alg ); ^~~~~~~~~~~~~ domain/common/include/fwdev.h:39:49: error: expected primary-expression before ')' token #define STATIC_ASSERT( arg ) static_assert<arg>() ^ domain/common/include/fe.h:1822:10: note: in expansion of macro 'STATIC_ASSERT' STATIC_ASSERT( ALG_2D == alg ); ^~~~~~~~~~~~~ In file included from domain/fwImage/include/colorModelConversion.h:11:0, from domain/fwImage/src/colorModelConversion_RGB_YCBCR.cpp:6: domain/common/include/fe.h:1822:40: error: expected ',' before ';' token STATIC_ASSERT( ALG_2D == alg ); ^ domain/common/include/fe.h:1822:40: error: expected string-literal before ';' token domain/common/include/fe.h:1822:40: error: expected ')' before ';' token In file included from domain/fwImage/include/colorModelConvConst.h:9:0, from domain/fwImage/include/colorModelConversion.h:9, from domain/fwImage/src/colorModelConversion_RGB_YCBCR.cpp:6: domain/common/include/fe.h: In constructor 'REFR::_refr_FE_PRIVATE::B3<FE, alg>::B3(FE&, const TS1*, const TS2*, REFR::_refr_FE_PRIVATE::B3<FE, alg>::TD1*, int, U32)': domain/common/include/fwdev.h:39:43: error: expected '(' before '<' token #define STATIC_ASSERT( arg ) static_assert<arg>() ^ domain/common/include/fe.h:2024:10: note: in expansion of macro 'STATIC_ASSERT' STATIC_ASSERT( ALG_1D == alg ); ^~~~~~~~~~~~~ domain/common/include/fwdev.h:39:43: error: expected primary-expression before '<' token #define STATIC_ASSERT( arg ) static_assert<arg>() ^ domain/common/include/fe.h:2024:10: note: in expansion of macro 'STATIC_ASSERT' STATIC_ASSERT( ALG_1D == alg ); ^~~~~~~~~~~~~ domain/common/include/fwdev.h:39:49: error: expected primary-expression before ')' token #define STATIC_ASSERT( arg ) static_assert<arg>() ^ domain/common/include/fe.h:2024:10: note: in expansion of macro 'STATIC_ASSERT' STATIC_ASSERT( ALG_1D == alg ); ^~~~~~~~~~~~~ In file included from domain/fwImage/include/colorModelConversion.h:11:0, from domain/fwImage/src/colorModelConversion_RGB_YCBCR.cpp:6: domain/common/include/fe.h:2024:40: error: expected ',' before ';' token STATIC_ASSERT( ALG_1D == alg ); ^ domain/common/include/fe.h:2024:40: error: expected string-literal before ';' token domain/common/include/fe.h:2024:40: error: expected ')' before ';' token In file included from domain/fwImage/include/colorModelConvConst.h:9:0, from domain/fwImage/include/colorModelConversion.h:9, from domain/fwImage/src/colorModelConversion_RGB_YCBCR.cpp:6: domain/common/include/fe.h: In constructor 'REFR::_refr_FE_PRIVATE::B3<FE, alg>::B3(FE&, const TS1*, int, const TS2*, int, REFR::_refr_FE_PRIVATE::B3<FE, alg>::TD1*, int, FwiSize, U32)': domain/common/include/fwdev.h:39:43: error: expected '(' before '<' token #define STATIC_ASSERT( arg ) static_assert<arg>() ^ domain/common/include/fe.h:2034:10: note: in expansion of macro 'STATIC_ASSERT' STATIC_ASSERT( ALG_2D == alg ); ^~~~~~~~~~~~~ domain/common/include/fwdev.h:39:43: error: expected primary-expression before '<' token #define STATIC_ASSERT( arg ) static_assert<arg>() ^ domain/common/include/fe.h:2034:10: note: in expansion of macro 'STATIC_ASSERT' STATIC_ASSERT( ALG_2D == alg ); ^~~~~~~~~~~~~ domain/common/include/fwdev.h:39:49: error: expected primary-expression before ')' token #define STATIC_ASSERT( arg ) static_assert<arg>() ^ domain/common/include/fe.h:2034:10: note: in expansion of macro 'STATIC_ASSERT' STATIC_ASSERT( ALG_2D == alg ); ^~~~~~~~~~~~~ In file included from domain/fwImage/include/colorModelConversion.h:11:0, from domain/fwImage/src/colorModelConversion_RGB_YCBCR.cpp:6: domain/common/include/fe.h:2034:40: error: expected ',' before ';' token STATIC_ASSERT( ALG_2D == alg ); ^ domain/common/include/fe.h:2034:40: error: expected string-literal before ';' token domain/common/include/fe.h:2034:40: error: expected ')' before ';' token In file included from domain/fwImage/include/colorModelConvConst.h:9:0, from domain/fwImage/include/colorModelConversion.h:9, from domain/fwImage/src/colorModelConversion_RGB_YCBCR.cpp:6: domain/common/include/fe.h: In constructor 'REFR::_refr_FE_PRIVATE::B4<FE, alg>::B4(FE&, const TS1*, const TS2*, const TS3*, REFR::_refr_FE_PRIVATE::B4<FE, alg>::TD1*, int, U32)': domain/common/include/fwdev.h:39:43: error: expected '(' before '<' token #define STATIC_ASSERT( arg ) static_assert<arg>() ^ domain/common/include/fe.h:2244:10: note: in expansion of macro 'STATIC_ASSERT' STATIC_ASSERT( ALG_1D == alg ); ^~~~~~~~~~~~~ domain/common/include/fwdev.h:39:43: error: expected primary-expression before '<' token #define STATIC_ASSERT( arg ) static_assert<arg>() ^ domain/common/include/fe.h:2244:10: note: in expansion of macro 'STATIC_ASSERT' STATIC_ASSERT( ALG_1D == alg ); ^~~~~~~~~~~~~ domain/common/include/fwdev.h:39:49: error: expected primary-expression before ')' token #define STATIC_ASSERT( arg ) static_assert<arg>() ^ domain/common/include/fe.h:2244:10: note: in expansion of macro 'STATIC_ASSERT' STATIC_ASSERT( ALG_1D == alg ); ^~~~~~~~~~~~~ In file included from domain/fwImage/include/colorModelConversion.h:11:0, from domain/fwImage/src/colorModelConversion_RGB_YCBCR.cpp:6: domain/common/include/fe.h:2244:40: error: expected ',' before ';' token STATIC_ASSERT( ALG_1D == alg ); ^ domain/common/include/fe.h:2244:40: error: expected string-literal before ';' token domain/common/include/fe.h:2244:40: error: expected ')' before ';' token In file included from domain/fwImage/include/colorModelConvConst.h:9:0, from domain/fwImage/include/colorModelConversion.h:9, from domain/fwImage/src/colorModelConversion_RGB_YCBCR.cpp:6: domain/common/include/fe.h: In constructor 'REFR::_refr_FE_PRIVATE::B4<FE, alg>::B4(FE&, const TS1*, int, const TS2*, int, const TS3*, int, REFR::_refr_FE_PRIVATE::B4<FE, alg>::TD1*, int, FwiSize, U32)': domain/common/include/fwdev.h:39:43: error: expected '(' before '<' token #define STATIC_ASSERT( arg ) static_assert<arg>() ^ domain/common/include/fe.h:2253:10: note: in expansion of macro 'STATIC_ASSERT' STATIC_ASSERT( ALG_2D == alg ); ^~~~~~~~~~~~~ domain/common/include/fwdev.h:39:43: error: expected primary-expression before '<' token #define STATIC_ASSERT( arg ) static_assert<arg>() ^ domain/common/include/fe.h:2253:10: note: in expansion of macro 'STATIC_ASSERT' STATIC_ASSERT( ALG_2D == alg ); ^~~~~~~~~~~~~ domain/common/include/fwdev.h:39:49: error: expected primary-expression before ')' token #define STATIC_ASSERT( arg ) static_assert<arg>() ^ domain/common/include/fe.h:2253:10: note: in expansion of macro 'STATIC_ASSERT' STATIC_ASSERT( ALG_2D == alg ); ^~~~~~~~~~~~~ In file included from domain/fwImage/include/colorModelConversion.h:11:0, from domain/fwImage/src/colorModelConversion_RGB_YCBCR.cpp:6: domain/common/include/fe.h:2253:40: error: expected ',' before ';' token STATIC_ASSERT( ALG_2D == alg ); ^ domain/common/include/fe.h:2253:40: error: expected string-literal before ';' token domain/common/include/fe.h:2253:40: error: expected ')' before ';' token In file included from domain/fwImage/include/colorModelConvConst.h:9:0, from domain/fwImage/include/colorModelConversion.h:9, from domain/fwImage/src/colorModelConversion_RGB_YCBCR.cpp:6: domain/common/include/fe.h: In constructor 'REFR::_refr_FE_PRIVATE::B4S1D<FE, alg>::B4S1D(FE&, const TS1*, const TS2*, const TS3*, const TS4*, REFR::_refr_FE_PRIVATE::B4S1D<FE, alg>::TD1*, int, U32)': domain/common/include/fwdev.h:39:43: error: expected '(' before '<' token #define STATIC_ASSERT( arg ) static_assert<arg>() ^ domain/common/include/fe.h:2470:10: note: in expansion of macro 'STATIC_ASSERT' STATIC_ASSERT( ALG_1D == alg ); ^~~~~~~~~~~~~ domain/common/include/fwdev.h:39:43: error: expected primary-expression before '<' token #define STATIC_ASSERT( arg ) static_assert<arg>() ^ domain/common/include/fe.h:2470:10: note: in expansion of macro 'STATIC_ASSERT' STATIC_ASSERT( ALG_1D == alg ); ^~~~~~~~~~~~~ domain/common/include/fwdev.h:39:49: error: expected primary-expression before ')' token #define STATIC_ASSERT( arg ) static_assert<arg>() ^ domain/common/include/fe.h:2470:10: note: in expansion of macro 'STATIC_ASSERT' STATIC_ASSERT( ALG_1D == alg ); ^~~~~~~~~~~~~ In file included from domain/fwImage/include/colorModelConversion.h:11:0, from domain/fwImage/src/colorModelConversion_RGB_YCBCR.cpp:6: domain/common/include/fe.h:2470:40: error: expected ',' before ';' token STATIC_ASSERT( ALG_1D == alg ); ^ domain/common/include/fe.h:2470:40: error: expected string-literal before ';' token domain/common/include/fe.h:2470:40: error: expected ')' before ';' token In file included from domain/fwImage/include/colorModelConvConst.h:9:0, from domain/fwImage/include/colorModelConversion.h:9, from domain/fwImage/src/colorModelConversion_RGB_YCBCR.cpp:6: domain/common/include/fe.h: In constructor 'REFR::_refr_FE_PRIVATE::B4S1D<FE, alg>::B4S1D(FE&, const TS1*, int, const TS2*, int, const TS3*, int, const TS4*, int, REFR::_refr_FE_PRIVATE::B4S1D<FE, alg>::TD1*, int, FwiSize, U32)': domain/common/include/fwdev.h:39:43: error: expected '(' before '<' token #define STATIC_ASSERT( arg ) static_assert<arg>() ^ domain/common/include/fe.h:2479:10: note: in expansion of macro 'STATIC_ASSERT' STATIC_ASSERT( ALG_2D == alg ); ^~~~~~~~~~~~~ domain/common/include/fwdev.h:39:43: error: expected primary-expression before '<' token #define STATIC_ASSERT( arg ) static_assert<arg>() ^ domain/common/include/fe.h:2479:10: note: in expansion of macro 'STATIC_ASSERT' STATIC_ASSERT( ALG_2D == alg ); ^~~~~~~~~~~~~ domain/common/include/fwdev.h:39:49: error: expected primary-expression before ')' token #define STATIC_ASSERT( arg ) static_assert<arg>() ^ domain/common/include/fe.h:2479:10: note: in expansion of macro 'STATIC_ASSERT' STATIC_ASSERT( ALG_2D == alg ); ^~~~~~~~~~~~~ In file included from domain/fwImage/include/colorModelConversion.h:11:0, from domain/fwImage/src/colorModelConversion_RGB_YCBCR.cpp:6: domain/common/include/fe.h:2479:40: error: expected ',' before ';' token STATIC_ASSERT( ALG_2D == alg ); ^ domain/common/include/fe.h:2479:40: error: expected string-literal before ';' token domain/common/include/fe.h:2479:40: error: expected ')' before ';' token In file included from domain/fwImage/include/colorModelConvConst.h:9:0, from domain/fwImage/include/colorModelConversion.h:9, from domain/fwImage/src/colorModelConversion_RGB_YCBCR.cpp:6: domain/common/include/fe.h: In constructor 'REFR::_refr_FE_PRIVATE::B3S3D<FE, alg>::B3S3D(FE&, const TS1*, const TS2*, const TS3*, REFR::_refr_FE_PRIVATE::B3S3D<FE, alg>::TD1*, REFR::_refr_FE_PRIVATE::B3S3D<FE, alg>::TD2*, REFR::_refr_FE_PRIVATE::B3S3D<FE, alg>::TD3*, int, U32)': domain/common/include/fwdev.h:39:43: error: expected '(' before '<' token #define STATIC_ASSERT( arg ) static_assert<arg>() ^ domain/common/include/fe.h:2706:10: note: in expansion of macro 'STATIC_ASSERT' STATIC_ASSERT( ALG_1D == alg ); ^~~~~~~~~~~~~ domain/common/include/fwdev.h:39:43: error: expected primary-expression before '<' token #define STATIC_ASSERT( arg ) static_assert<arg>() ^ domain/common/include/fe.h:2706:10: note: in expansion of macro 'STATIC_ASSERT' STATIC_ASSERT( ALG_1D == alg ); ^~~~~~~~~~~~~ domain/common/include/fwdev.h:39:49: error: expected primary-expression before ')' token #define STATIC_ASSERT( arg ) static_assert<arg>() ^ domain/common/include/fe.h:2706:10: note: in expansion of macro 'STATIC_ASSERT' STATIC_ASSERT( ALG_1D == alg ); ^~~~~~~~~~~~~ In file included from domain/fwImage/include/colorModelConversion.h:11:0, from domain/fwImage/src/colorModelConversion_RGB_YCBCR.cpp:6: domain/common/include/fe.h:2706:40: error: expected ',' before ';' token STATIC_ASSERT( ALG_1D == alg ); ^ domain/common/include/fe.h:2706:40: error: expected string-literal before ';' token domain/common/include/fe.h:2706:40: error: expected ')' before ';' token In file included from domain/fwImage/include/colorModelConvConst.h:9:0, from domain/fwImage/include/colorModelConversion.h:9, from domain/fwImage/src/colorModelConversion_RGB_YCBCR.cpp:6: domain/common/include/fe.h: In constructor 'REFR::_refr_FE_PRIVATE::B3S3D<FE, alg>::B3S3D(FE&, const TS1*, int, const TS2*, int, const TS3*, int, REFR::_refr_FE_PRIVATE::B3S3D<FE, alg>::TD1*, int, REFR::_refr_FE_PRIVATE::B3S3D<FE, alg>::TD2*, int, REFR::_refr_FE_PRIVATE::B3S3D<FE, alg>::TD3*, int, FwiSize, U32)': domain/common/include/fwdev.h:39:43: error: expected '(' before '<' token #define STATIC_ASSERT( arg ) static_assert<arg>() ^ domain/common/include/fe.h:2715:10: note: in expansion of macro 'STATIC_ASSERT' STATIC_ASSERT( ALG_2D == alg ); ^~~~~~~~~~~~~ domain/common/include/fwdev.h:39:43: error: expected primary-expression before '<' token #define STATIC_ASSERT( arg ) static_assert<arg>() ^ domain/common/include/fe.h:2715:10: note: in expansion of macro 'STATIC_ASSERT' STATIC_ASSERT( ALG_2D == alg ); ^~~~~~~~~~~~~ domain/common/include/fwdev.h:39:49: error: expected primary-expression before ')' token #define STATIC_ASSERT( arg ) static_assert<arg>() ^ domain/common/include/fe.h:2715:10: note: in expansion of macro 'STATIC_ASSERT' STATIC_ASSERT( ALG_2D == alg ); ^~~~~~~~~~~~~ In file included from domain/fwImage/include/colorModelConversion.h:11:0, from domain/fwImage/src/colorModelConversion_RGB_YCBCR.cpp:6: domain/common/include/fe.h:2715:40: error: expected ',' before ';' token STATIC_ASSERT( ALG_2D == alg ); ^ domain/common/include/fe.h:2715:40: error: expected string-literal before ';' token domain/common/include/fe.h:2715:40: error: expected ')' before ';' token In file included from domain/fwImage/include/colorModelConvConst.h:9:0, from domain/fwImage/include/colorModelConversion.h:9, from domain/fwImage/src/colorModelConversion_RGB_YCBCR.cpp:6: domain/common/include/fe.h: In constructor 'REFR::_refr_FE_PRIVATE::B4S4D<FE, alg>::B4S4D(FE&, const TS1*, const TS2*, const TS3*, const TS4*, REFR::_refr_FE_PRIVATE::B4S4D<FE, alg>::TD1*, REFR::_refr_FE_PRIVATE::B4S4D<FE, alg>::TD2*, REFR::_refr_FE_PRIVATE::B4S4D<FE, alg>::TD3*, REFR::_refr_FE_PRIVATE::B4S4D<FE, alg>::TD4*, int, U32)': domain/common/include/fwdev.h:39:43: error: expected '(' before '<' token #define STATIC_ASSERT( arg ) static_assert<arg>() ^ domain/common/include/fe.h:2960:10: note: in expansion of macro 'STATIC_ASSERT' STATIC_ASSERT( ALG_1D == alg ); ^~~~~~~~~~~~~ domain/common/include/fwdev.h:39:43: error: expected primary-expression before '<' token #define STATIC_ASSERT( arg ) static_assert<arg>() ^ domain/common/include/fe.h:2960:10: note: in expansion of macro 'STATIC_ASSERT' STATIC_ASSERT( ALG_1D == alg ); ^~~~~~~~~~~~~ domain/common/include/fwdev.h:39:49: error: expected primary-expression before ')' token #define STATIC_ASSERT( arg ) static_assert<arg>() ^ domain/common/include/fe.h:2960:10: note: in expansion of macro 'STATIC_ASSERT' STATIC_ASSERT( ALG_1D == alg ); ^~~~~~~~~~~~~ In file included from domain/fwImage/include/colorModelConversion.h:11:0, from domain/fwImage/src/colorModelConversion_RGB_YCBCR.cpp:6: domain/common/include/fe.h:2960:40: error: expected ',' before ';' token STATIC_ASSERT( ALG_1D == alg ); ^ domain/common/include/fe.h:2960:40: error: expected string-literal before ';' token domain/common/include/fe.h:2960:40: error: expected ')' before ';' token In file included from domain/fwImage/include/colorModelConvConst.h:9:0, from domain/fwImage/include/colorModelConversion.h:9, from domain/fwImage/src/colorModelConversion_RGB_YCBCR.cpp:6: domain/common/include/fe.h: In constructor 'REFR::_refr_FE_PRIVATE::B4S4D<FE, alg>::B4S4D(FE&, const TS1*, int, const TS2*, int, const TS3*, int, const TS4*, int, REFR::_refr_FE_PRIVATE::B4S4D<FE, alg>::TD1*, int, REFR::_refr_FE_PRIVATE::B4S4D<FE, alg>::TD2*, int, REFR::_refr_FE_PRIVATE::B4S4D<FE, alg>::TD3*, int, REFR::_refr_FE_PRIVATE::B4S4D<FE, alg>::TD4*, int, FwiSize, U32)': domain/common/include/fwdev.h:39:43: error: expected '(' before '<' token #define STATIC_ASSERT( arg ) static_assert<arg>() ^ domain/common/include/fe.h:2969:10: note: in expansion of macro 'STATIC_ASSERT' STATIC_ASSERT( ALG_2D == alg ); ^~~~~~~~~~~~~ domain/common/include/fwdev.h:39:43: error: expected primary-expression before '<' token #define STATIC_ASSERT( arg ) static_assert<arg>() ^ domain/common/include/fe.h:2969:10: note: in expansion of macro 'STATIC_ASSERT' STATIC_ASSERT( ALG_2D == alg ); ^~~~~~~~~~~~~ domain/common/include/fwdev.h:39:49: error: expected primary-expression before ')' token #define STATIC_ASSERT( arg ) static_assert<arg>() ^ domain/common/include/fe.h:2969:10: note: in expansion of macro 'STATIC_ASSERT' STATIC_ASSERT( ALG_2D == alg ); ^~~~~~~~~~~~~ In file included from domain/fwImage/include/colorModelConversion.h:11:0, from domain/fwImage/src/colorModelConversion_RGB_YCBCR.cpp:6: domain/common/include/fe.h:2969:40: error: expected ',' before ';' token STATIC_ASSERT( ALG_2D == alg ); ^ domain/common/include/fe.h:2969:40: error: expected string-literal before ';' token domain/common/include/fe.h:2969:40: error: expected ')' before ';' token In file included from domain/fwImage/include/colorModelConvConst.h:9:0, from domain/fwImage/include/colorModelConversion.h:9, from domain/fwImage/src/colorModelConversion_RGB_YCBCR.cpp:6: domain/common/include/fe.h: In constructor 'REFR::_refr_FE_PRIVATE::B1S3D<FE, alg>::B1S3D(FE&, const TS1*, REFR::_refr_FE_PRIVATE::B1S3D<FE, alg>::TD1*, REFR::_refr_FE_PRIVATE::B1S3D<FE, alg>::TD2*, REFR::_refr_FE_PRIVATE::B1S3D<FE, alg>::TD3*, int, U32)': domain/common/include/fwdev.h:39:43: error: expected '(' before '<' token #define STATIC_ASSERT( arg ) static_assert<arg>() ^ domain/common/include/fe.h:3183:10: note: in expansion of macro 'STATIC_ASSERT' STATIC_ASSERT( ALG_1D == alg ); ^~~~~~~~~~~~~ domain/common/include/fwdev.h:39:43: error: expected primary-expression before '<' token #define STATIC_ASSERT( arg ) static_assert<arg>() ^ domain/common/include/fe.h:3183:10: note: in expansion of macro 'STATIC_ASSERT' STATIC_ASSERT( ALG_1D == alg ); ^~~~~~~~~~~~~ domain/common/include/fwdev.h:39:49: error: expected primary-expression before ')' token #define STATIC_ASSERT( arg ) static_assert<arg>() ^ domain/common/include/fe.h:3183:10: note: in expansion of macro 'STATIC_ASSERT' STATIC_ASSERT( ALG_1D == alg ); ^~~~~~~~~~~~~ In file included from domain/fwImage/include/colorModelConversion.h:11:0, from domain/fwImage/src/colorModelConversion_RGB_YCBCR.cpp:6: domain/common/include/fe.h:3183:40: error: expected ',' before ';' token STATIC_ASSERT( ALG_1D == alg ); ^ domain/common/include/fe.h:3183:40: error: expected string-literal before ';' token domain/common/include/fe.h:3183:40: error: expected ')' before ';' token In file included from domain/fwImage/include/colorModelConvConst.h:9:0, from domain/fwImage/include/colorModelConversion.h:9, from domain/fwImage/src/colorModelConversion_RGB_YCBCR.cpp:6: domain/common/include/fe.h: In constructor 'REFR::_refr_FE_PRIVATE::B1S3D<FE, alg>::B1S3D(FE&, const TS1*, int, REFR::_refr_FE_PRIVATE::B1S3D<FE, alg>::TD1*, int, REFR::_refr_FE_PRIVATE::B1S3D<FE, alg>::TD2*, int, REFR::_refr_FE_PRIVATE::B1S3D<FE, alg>::TD3*, int, FwiSize, U32)': domain/common/include/fwdev.h:39:43: error: expected '(' before '<' token #define STATIC_ASSERT( arg ) static_assert<arg>() ^ domain/common/include/fe.h:3192:10: note: in expansion of macro 'STATIC_ASSERT' STATIC_ASSERT( ALG_2D == alg ); ^~~~~~~~~~~~~ domain/common/include/fwdev.h:39:43: error: expected primary-expression before '<' token #define STATIC_ASSERT( arg ) static_assert<arg>() ^ domain/common/include/fe.h:3192:10: note: in expansion of macro 'STATIC_ASSERT' STATIC_ASSERT( ALG_2D == alg ); ^~~~~~~~~~~~~ domain/common/include/fwdev.h:39:49: error: expected primary-expression before ')' token #define STATIC_ASSERT( arg ) static_assert<arg>() ^ domain/common/include/fe.h:3192:10: note: in expansion of macro 'STATIC_ASSERT' STATIC_ASSERT( ALG_2D == alg ); ^~~~~~~~~~~~~ In file included from domain/fwImage/include/colorModelConversion.h:11:0, from domain/fwImage/src/colorModelConversion_RGB_YCBCR.cpp:6: domain/common/include/fe.h:3192:40: error: expected ',' before ';' token STATIC_ASSERT( ALG_2D == alg ); ^ domain/common/include/fe.h:3192:40: error: expected string-literal before ';' token domain/common/include/fe.h:3192:40: error: expected ')' before ';' token In file included from domain/fwImage/include/colorModelConvConst.h:9:0, from domain/fwImage/include/colorModelConversion.h:9, from domain/fwImage/src/colorModelConversion_RGB_YCBCR.cpp:6: domain/common/include/fe.h: In constructor 'REFR::_refr_FE_PRIVATE::B1S4D<FE, alg>::B1S4D(FE&, const TS1*, REFR::_refr_FE_PRIVATE::B1S4D<FE, alg>::TD1*, REFR::_refr_FE_PRIVATE::B1S4D<FE, alg>::TD2*, REFR::_refr_FE_PRIVATE::B1S4D<FE, alg>::TD3*, REFR::_refr_FE_PRIVATE::B1S4D<FE, alg>::TD4*, int, U32)': domain/common/include/fwdev.h:39:43: error: expected '(' before '<' token #define STATIC_ASSERT( arg ) static_assert<arg>() ^ domain/common/include/fe.h:3423:13: note: in expansion of macro 'STATIC_ASSERT' STATIC_ASSERT( ALG_1D == alg ); ^~~~~~~~~~~~~ domain/common/include/fwdev.h:39:43: error: expected primary-expression before '<' token #define STATIC_ASSERT( arg ) static_assert<arg>() ^ domain/common/include/fe.h:3423:13: note: in expansion of macro 'STATIC_ASSERT' STATIC_ASSERT( ALG_1D == alg ); ^~~~~~~~~~~~~ domain/common/include/fwdev.h:39:49: error: expected primary-expression before ')' token #define STATIC_ASSERT( arg ) static_assert<arg>() ^ domain/common/include/fe.h:3423:13: note: in expansion of macro 'STATIC_ASSERT' STATIC_ASSERT( ALG_1D == alg ); ^~~~~~~~~~~~~ In file included from domain/fwImage/include/colorModelConversion.h:11:0, from domain/fwImage/src/colorModelConversion_RGB_YCBCR.cpp:6: domain/common/include/fe.h:3423:43: error: expected ',' before ';' token STATIC_ASSERT( ALG_1D == alg ); ^ domain/common/include/fe.h:3423:43: error: expected string-literal before ';' token domain/common/include/fe.h:3423:43: error: expected ')' before ';' token In file included from domain/fwImage/include/colorModelConvConst.h:9:0, from domain/fwImage/include/colorModelConversion.h:9, from domain/fwImage/src/colorModelConversion_RGB_YCBCR.cpp:6: domain/common/include/fe.h: In constructor 'REFR::_refr_FE_PRIVATE::B1S4D<FE, alg>::B1S4D(FE&, const TS1*, int, REFR::_refr_FE_PRIVATE::B1S4D<FE, alg>::TD1*, int, REFR::_refr_FE_PRIVATE::B1S4D<FE, alg>::TD2*, int, REFR::_refr_FE_PRIVATE::B1S4D<FE, alg>::TD3*, int, REFR::_refr_FE_PRIVATE::B1S4D<FE, alg>::TD4*, int, FwiSize, U32)': domain/common/include/fwdev.h:39:43: error: expected '(' before '<' token #define STATIC_ASSERT( arg ) static_assert<arg>() ^ domain/common/include/fe.h:3432:13: note: in expansion of macro 'STATIC_ASSERT' STATIC_ASSERT( ALG_2D == alg ); ^~~~~~~~~~~~~ domain/common/include/fwdev.h:39:43: error: expected primary-expression before '<' token #define STATIC_ASSERT( arg ) static_assert<arg>() ^ domain/common/include/fe.h:3432:13: note: in expansion of macro 'STATIC_ASSERT' STATIC_ASSERT( ALG_2D == alg ); ^~~~~~~~~~~~~ domain/common/include/fwdev.h:39:49: error: expected primary-expression before ')' token #define STATIC_ASSERT( arg ) static_assert<arg>() ^ domain/common/include/fe.h:3432:13: note: in expansion of macro 'STATIC_ASSERT' STATIC_ASSERT( ALG_2D == alg ); ^~~~~~~~~~~~~ In file included from domain/fwImage/include/colorModelConversion.h:11:0, from domain/fwImage/src/colorModelConversion_RGB_YCBCR.cpp:6: domain/common/include/fe.h:3432:43: error: expected ',' before ';' token STATIC_ASSERT( ALG_2D == alg ); ^ domain/common/include/fe.h:3432:43: error: expected string-literal before ';' token domain/common/include/fe.h:3432:43: error: expected ')' before ';' token In file included from domain/fwImage/include/colorModelConvConst.h:9:0, from domain/fwImage/include/colorModelConversion.h:9, from domain/fwImage/src/colorModelConversion_RGB_YCBCR.cpp:6: domain/fwImage/include/colorModelConversion.h: In static member function 'static Ref_m128i REFR::CMC::Pixel<fn, pid, prc, mp>::Process(XMM128&, XMM128&, XMM128&)': domain/common/include/fwdev.h:39:43: error: expected '(' before '<' token #define STATIC_ASSERT( arg ) static_assert<arg>() ^ domain/fwImage/include/colorModelConversion.h:1634:87: note: in expansion of macro 'STATIC_ASSERT' static SYS_INLINE __m128i Process( XMM128 &pX, XMM128 &pY, XMM128 &pZ ) { STATIC_ASSERT(false); } ^~~~~~~~~~~~~ domain/common/include/fwdev.h:39:43: error: expected primary-expression before '<' token #define STATIC_ASSERT( arg ) static_assert<arg>() ^ domain/fwImage/include/colorModelConversion.h:1634:87: note: in expansion of macro 'STATIC_ASSERT' static SYS_INLINE __m128i Process( XMM128 &pX, XMM128 &pY, XMM128 &pZ ) { STATIC_ASSERT(false); } ^~~~~~~~~~~~~ domain/common/include/fwdev.h:39:49: error: expected primary-expression before ')' token #define STATIC_ASSERT( arg ) static_assert<arg>() ^ domain/fwImage/include/colorModelConversion.h:1634:87: note: in expansion of macro 'STATIC_ASSERT' static SYS_INLINE __m128i Process( XMM128 &pX, XMM128 &pY, XMM128 &pZ ) { STATIC_ASSERT(false); } ^~~~~~~~~~~~~ In file included from domain/fwImage/src/colorModelConversion_RGB_YCBCR.cpp:6:0: domain/fwImage/include/colorModelConversion.h:1634:107: error: expected ',' before ';' token static SYS_INLINE __m128i Process( XMM128 &pX, XMM128 &pY, XMM128 &pZ ) { STATIC_ASSERT(false); } ^ domain/fwImage/include/colorModelConversion.h:1634:107: error: expected string-literal before ';' token domain/fwImage/include/colorModelConversion.h:1634:107: error: expected ')' before ';' token In file included from domain/fwImage/include/colorModelConvConst.h:9:0, from domain/fwImage/include/colorModelConversion.h:9, from domain/fwImage/src/colorModelConversion_RGB_YCBCR.cpp:6: domain/fwImage/include/colorModelConversion.h: In static member function 'static void REFR::CMC::PRow<mp1, mp2, mp3, fn, prc, ch>::Process(Fw8u*&, Fw8u*&, Fw32u)': domain/common/include/fwdev.h:39:43: error: expected '(' before '<' token #define STATIC_ASSERT( arg ) static_assert<arg>() ^ domain/fwImage/include/colorModelConversion.h:1874:17: note: in expansion of macro 'STATIC_ASSERT' STATIC_ASSERT(false); ^~~~~~~~~~~~~ domain/common/include/fwdev.h:39:43: error: expected primary-expression before '<' token #define STATIC_ASSERT( arg ) static_assert<arg>() ^ domain/fwImage/include/colorModelConversion.h:1874:17: note: in expansion of macro 'STATIC_ASSERT' STATIC_ASSERT(false); ^~~~~~~~~~~~~ domain/common/include/fwdev.h:39:49: error: expected primary-expression before ')' token #define STATIC_ASSERT( arg ) static_assert<arg>() ^ domain/fwImage/include/colorModelConversion.h:1874:17: note: in expansion of macro 'STATIC_ASSERT' STATIC_ASSERT(false); ^~~~~~~~~~~~~ In file included from domain/fwImage/src/colorModelConversion_RGB_YCBCR.cpp:6:0: domain/fwImage/include/colorModelConversion.h:1874:37: error: expected ',' before ';' token STATIC_ASSERT(false); ^ domain/fwImage/include/colorModelConversion.h:1874:37: error: expected string-literal before ';' token domain/fwImage/include/colorModelConversion.h:1874:37: error: expected ')' before ';' token In file included from domain/fwImage/include/colorModelConvConst.h:9:0, from domain/fwImage/include/colorModelConversion.h:9, from domain/fwImage/src/colorModelConversion_RGB_YCBCR.cpp:6: domain/fwImage/include/colorModelConversion.h: In static member function 'static void REFR::CMC::PRow<mp1, mp2, mp3, fn, prc, ch>::ProcessPlanar(Fw8u**, Fw8u**, Fw32u)': domain/common/include/fwdev.h:39:43: error: expected '(' before '<' token #define STATIC_ASSERT( arg ) static_assert<arg>() ^ domain/fwImage/include/colorModelConversion.h:1878:17: note: in expansion of macro 'STATIC_ASSERT' STATIC_ASSERT(false); ^~~~~~~~~~~~~ domain/common/include/fwdev.h:39:43: error: expected primary-expression before '<' token #define STATIC_ASSERT( arg ) static_assert<arg>() ^ domain/fwImage/include/colorModelConversion.h:1878:17: note: in expansion of macro 'STATIC_ASSERT' STATIC_ASSERT(false); ^~~~~~~~~~~~~ domain/common/include/fwdev.h:39:49: error: expected primary-expression before ')' token #define STATIC_ASSERT( arg ) static_assert<arg>() ^ domain/fwImage/include/colorModelConversion.h:1878:17: note: in expansion of macro 'STATIC_ASSERT' STATIC_ASSERT(false); ^~~~~~~~~~~~~ In file included from domain/fwImage/src/colorModelConversion_RGB_YCBCR.cpp:6:0: domain/fwImage/include/colorModelConversion.h:1878:37: error: expected ',' before ';' token STATIC_ASSERT(false); ^ domain/fwImage/include/colorModelConversion.h:1878:37: error: expected string-literal before ';' token domain/fwImage/include/colorModelConversion.h:1878:37: error: expected ')' before ';' token In file included from domain/fwImage/include/colorModelConvConst.h:9:0, from domain/fwImage/include/colorModelConversion.h:9, from domain/fwImage/src/colorModelConversion_RGB_YCBCR.cpp:6: domain/fwImage/include/colorModelConversion.h: In static member function 'static FwStatus REFR::CMC::ModelPlanar<ch>::ConvertREF(const Fw8u* const*, int, Fw8u**, int, FwiSize)': domain/common/include/fwdev.h:39:43: error: expected '(' before '<' token #define STATIC_ASSERT( arg ) static_assert<arg>() ^ domain/fwImage/include/colorModelConversion.h:2180:17: note: in expansion of macro 'STATIC_ASSERT' STATIC_ASSERT(false); ^~~~~~~~~~~~~ domain/common/include/fwdev.h:39:43: error: expected primary-expression before '<' token #define STATIC_ASSERT( arg ) static_assert<arg>() ^ domain/fwImage/include/colorModelConversion.h:2180:17: note: in expansion of macro 'STATIC_ASSERT' STATIC_ASSERT(false); ^~~~~~~~~~~~~ domain/common/include/fwdev.h:39:49: error: expected primary-expression before ')' token #define STATIC_ASSERT( arg ) static_assert<arg>() ^ domain/fwImage/include/colorModelConversion.h:2180:17: note: in expansion of macro 'STATIC_ASSERT' STATIC_ASSERT(false); ^~~~~~~~~~~~~ In file included from domain/fwImage/src/colorModelConversion_RGB_YCBCR.cpp:6:0: domain/fwImage/include/colorModelConversion.h:2180:37: error: expected ',' before ';' token STATIC_ASSERT(false); ^ domain/fwImage/include/colorModelConversion.h:2180:37: error: expected string-literal before ';' token domain/fwImage/include/colorModelConversion.h:2180:37: error: expected ')' before ';' token In file included from domain/fwImage/include/colorModelConvConst.h:9:0, from domain/fwImage/include/colorModelConversion.h:9, from domain/fwImage/src/colorModelConversion_RGB_YCBCR.cpp:6: domain/fwImage/include/colorModelConversion.h: In static member function 'static FwStatus REFR::CMC::ModelCP<ch>::ConvertREF(const Fw8u*, int, Fw8u**, int, FwiSize)': domain/common/include/fwdev.h:39:43: error: expected '(' before '<' token #define STATIC_ASSERT( arg ) static_assert<arg>() ^ domain/fwImage/include/colorModelConversion.h:2225:17: note: in expansion of macro 'STATIC_ASSERT' STATIC_ASSERT(false); ^~~~~~~~~~~~~ domain/common/include/fwdev.h:39:43: error: expected primary-expression before '<' token #define STATIC_ASSERT( arg ) static_assert<arg>() ^ domain/fwImage/include/colorModelConversion.h:2225:17: note: in expansion of macro 'STATIC_ASSERT' STATIC_ASSERT(false); ^~~~~~~~~~~~~ domain/common/include/fwdev.h:39:49: error: expected primary-expression before ')' token #define STATIC_ASSERT( arg ) static_assert<arg>() ^ domain/fwImage/include/colorModelConversion.h:2225:17: note: in expansion of macro 'STATIC_ASSERT' STATIC_ASSERT(false); ^~~~~~~~~~~~~ In file included from domain/fwImage/src/colorModelConversion_RGB_YCBCR.cpp:6:0: domain/fwImage/include/colorModelConversion.h:2225:37: error: expected ',' before ';' token STATIC_ASSERT(false); ^ domain/fwImage/include/colorModelConversion.h:2225:37: error: expected string-literal before ';' token domain/fwImage/include/colorModelConversion.h:2225:37: error: expected ')' before ';' token In file included from domain/fwImage/include/colorModelConvConst.h:9:0, from domain/fwImage/include/colorModelConversion.h:9, from domain/fwImage/src/colorModelConversion_RGB_YCBCR.cpp:6: domain/fwImage/include/colorModelConversion.h: In static member function 'static FwStatus REFR::CMC::ModelPC<ch>::ConvertREF(const Fw8u* const*, int, Fw8u*, int, FwiSize)': domain/common/include/fwdev.h:39:43: error: expected '(' before '<' token #define STATIC_ASSERT( arg ) static_assert<arg>() ^ domain/fwImage/include/colorModelConversion.h:2305:17: note: in expansion of macro 'STATIC_ASSERT' STATIC_ASSERT(false); ^~~~~~~~~~~~~ domain/common/include/fwdev.h:39:43: error: expected primary-expression before '<' token #define STATIC_ASSERT( arg ) static_assert<arg>() ^ domain/fwImage/include/colorModelConversion.h:2305:17: note: in expansion of macro 'STATIC_ASSERT' STATIC_ASSERT(false); ^~~~~~~~~~~~~ domain/common/include/fwdev.h:39:49: error: expected primary-expression before ')' token #define STATIC_ASSERT( arg ) static_assert<arg>() ^ domain/fwImage/include/colorModelConversion.h:2305:17: note: in expansion of macro 'STATIC_ASSERT' STATIC_ASSERT(false); ^~~~~~~~~~~~~ In file included from domain/fwImage/src/colorModelConversion_RGB_YCBCR.cpp:6:0: domain/fwImage/include/colorModelConversion.h:2305:37: error: expected ',' before ';' token STATIC_ASSERT(false); ^ domain/fwImage/include/colorModelConversion.h:2305:37: error: expected string-literal before ';' token domain/fwImage/include/colorModelConversion.h:2305:37: error: expected ')' before ';' token In file included from domain/fwImage/include/colorModelConvConst.h:9:0, from domain/fwImage/include/colorModelConversion.h:9, from domain/fwImage/src/colorModelConversion_RGB_YCBCR.cpp:6: domain/fwImage/include/colorModelConversion.h: In static member function 'static FwStatus REFR::CMC::ModelPC<ch>::ConvertREF(const Fw8u* const*, int*, Fw8u*, int, FwiSize)': domain/common/include/fwdev.h:39:43: error: expected '(' before '<' token #define STATIC_ASSERT( arg ) static_assert<arg>() ^ domain/fwImage/include/colorModelConversion.h:2310:17: note: in expansion of macro 'STATIC_ASSERT' STATIC_ASSERT(false); ^~~~~~~~~~~~~ domain/common/include/fwdev.h:39:43: error: expected primary-expression before '<' token #define STATIC_ASSERT( arg ) static_assert<arg>() ^ domain/fwImage/include/colorModelConversion.h:2310:17: note: in expansion of macro 'STATIC_ASSERT' STATIC_ASSERT(false); ^~~~~~~~~~~~~ domain/common/include/fwdev.h:39:49: error: expected primary-expression before ')' token #define STATIC_ASSERT( arg ) static_assert<arg>() ^ domain/fwImage/include/colorModelConversion.h:2310:17: note: in expansion of macro 'STATIC_ASSERT' STATIC_ASSERT(false); ^~~~~~~~~~~~~ In file included from domain/fwImage/src/colorModelConversion_RGB_YCBCR.cpp:6:0: domain/fwImage/include/colorModelConversion.h:2310:37: error: expected ',' before ';' token STATIC_ASSERT(false); ^ domain/fwImage/include/colorModelConversion.h:2310:37: error: expected string-literal before ';' token domain/fwImage/include/colorModelConversion.h:2310:37: error: expected ')' before ';' token In file included from domain/fwImage/include/colorModelConvConst.h:9:0, from domain/fwImage/include/colorModelConversion.h:9, from domain/fwImage/src/colorModelConversion_RGB_YCBCR.cpp:6: domain/fwImage/include/colorModelConvSpecial.h: In static member function 'static void REFR::CMC_SS::Pixel<TS, TD, pfn, chSrc, chDst, pxl>::Process(const TS*, void*, TD*, void*, Fw8u)': domain/common/include/fwdev.h:39:43: error: expected '(' before '<' token #define STATIC_ASSERT( arg ) static_assert<arg>() ^ domain/fwImage/include/colorModelConvSpecial.h:49:15: note: in expansion of macro 'STATIC_ASSERT' { STATIC_ASSERT(false); } ^~~~~~~~~~~~~ domain/common/include/fwdev.h:39:43: error: expected primary-expression before '<' token #define STATIC_ASSERT( arg ) static_assert<arg>() ^ domain/fwImage/include/colorModelConvSpecial.h:49:15: note: in expansion of macro 'STATIC_ASSERT' { STATIC_ASSERT(false); } ^~~~~~~~~~~~~ domain/common/include/fwdev.h:39:49: error: expected primary-expression before ')' token #define STATIC_ASSERT( arg ) static_assert<arg>() ^ domain/fwImage/include/colorModelConvSpecial.h:49:15: note: in expansion of macro 'STATIC_ASSERT' { STATIC_ASSERT(false); } ^~~~~~~~~~~~~ In file included from domain/fwImage/src/colorModelConversion_RGB_YCBCR.cpp:7:0: domain/fwImage/include/colorModelConvSpecial.h:49:35: error: expected ',' before ';' token { STATIC_ASSERT(false); } ^ domain/fwImage/include/colorModelConvSpecial.h:49:35: error: expected string-literal before ';' token domain/fwImage/include/colorModelConvSpecial.h:49:35: error: expected ')' before ';' token In file included from domain/fwImage/include/colorModelConvConst.h:9:0, from domain/fwImage/include/colorModelConversion.h:9, from domain/fwImage/src/colorModelConversion_RGB_YCBCR.cpp:6: domain/fwImage/include/colorModelConvSpecial.h: In static member function 'static void REFR::CMC_SS::Block<chSrc, chDst, TS, TD, pfn, ChSrcStep, ChDstStep, pxl>::ProcessBlock(void*, void*, const Fw8u*, Fw8u*, Fw8u)': domain/common/include/fwdev.h:39:43: error: expected '(' before '<' token #define STATIC_ASSERT( arg ) static_assert<arg>() ^ domain/fwImage/include/colorModelConvSpecial.h:1090:17: note: in expansion of macro 'STATIC_ASSERT' STATIC_ASSERT(false); ^~~~~~~~~~~~~ domain/common/include/fwdev.h:39:43: error: expected primary-expression before '<' token #define STATIC_ASSERT( arg ) static_assert<arg>() ^ domain/fwImage/include/colorModelConvSpecial.h:1090:17: note: in expansion of macro 'STATIC_ASSERT' STATIC_ASSERT(false); ^~~~~~~~~~~~~ domain/common/include/fwdev.h:39:49: error: expected primary-expression before ')' token #define STATIC_ASSERT( arg ) static_assert<arg>() ^ domain/fwImage/include/colorModelConvSpecial.h:1090:17: note: in expansion of macro 'STATIC_ASSERT' STATIC_ASSERT(false); ^~~~~~~~~~~~~ In file included from domain/fwImage/src/colorModelConversion_RGB_YCBCR.cpp:7:0: domain/fwImage/include/colorModelConvSpecial.h:1090:37: error: expected ',' before ';' token STATIC_ASSERT(false); ^ domain/fwImage/include/colorModelConvSpecial.h:1090:37: error: expected string-literal before ';' token domain/fwImage/include/colorModelConvSpecial.h:1090:37: error: expected ')' before ';' token In file included from domain/fwImage/include/colorModelConvConst.h:9:0, from domain/fwImage/include/colorModelConversion.h:9, from domain/fwImage/src/colorModelConversion_RGB_YCBCR.cpp:6: domain/fwImage/include/colorModelConversionDefs.h: In static member function 'static void REFR::CMC::P_Model<mp1, mp2, mp3, fn, prc, ch>::Process(REFR::RegFile&)': domain/common/include/fwdev.h:39:43: error: expected '(' before '<' token #define STATIC_ASSERT( arg ) static_assert<arg>() ^ domain/fwImage/include/colorModelConversionDefs.h:22:49: note: in expansion of macro 'STATIC_ASSERT' static void Process( RegFile &r ) { STATIC_ASSERT(false); } ^~~~~~~~~~~~~ domain/common/include/fwdev.h:39:43: error: expected primary-expression before '<' token #define STATIC_ASSERT( arg ) static_assert<arg>() ^ domain/fwImage/include/colorModelConversionDefs.h:22:49: note: in expansion of macro 'STATIC_ASSERT' static void Process( RegFile &r ) { STATIC_ASSERT(false); } ^~~~~~~~~~~~~ domain/common/include/fwdev.h:39:49: error: expected primary-expression before ')' token #define STATIC_ASSERT( arg ) static_assert<arg>() ^ domain/fwImage/include/colorModelConversionDefs.h:22:49: note: in expansion of macro 'STATIC_ASSERT' static void Process( RegFile &r ) { STATIC_ASSERT(false); } ^~~~~~~~~~~~~ In file included from domain/fwImage/src/colorModelConversion_RGB_YCBCR.cpp:9:0: domain/fwImage/include/colorModelConversionDefs.h:22:69: error: expected ',' before ';' token static void Process( RegFile &r ) { STATIC_ASSERT(false); } ^ domain/fwImage/include/colorModelConversionDefs.h:22:69: error: expected string-literal before ';' token domain/fwImage/include/colorModelConversionDefs.h:22:69: error: expected ')' before ';' token In file included from sdk/cbl/cbl.h:11:0, from domain/common/include/system.h:188, from domain/common/include/fwdev.h:19, from domain/fwImage/include/colorModelConvConst.h:9, from domain/fwImage/include/colorModelConversion.h:9, from domain/fwImage/src/colorModelConversion_RGB_YCBCR.cpp:6: domain/fwImage/include/color.h: In function 'void REFR::ConvertRGBToYCbCr420_8u_C3P3R_SSE_1D(const Fw8u*, int, Fw8u**, int, int, int)': sdk/cbl/cbl_common_primitives.h:288:43: error: narrowing conversion of '18445899545702039552ull' from 'U64 {aka long long unsigned int}' to 'long long int' inside { } [-Wnarrowing] (U64)(g), (U64)(h) ) } ^ sdk/cbl/cbl_common_primitives.h:291:5: note: in expansion of macro 'CONST_SETR_16I' CONST_SETR_16I( (h), (g), (f), (e), (d), (c), (b), (a) ) ^~~~~~~~~~~~~~ domain/fwImage/include/color.h:270:48: note: in expansion of macro 'CONST_SET_16I' static const __m128i rgbtoYcbcr_crcb = CONST_SET_16I(-4,-24,28,0,0,28,-19,-9); ^~~~~~~~~~~~~ In file included from domain/fwImage/src/colorModelConversion_RGB_YCBCR.cpp:7:0: domain/fwImage/include/colorModelConvSpecial.h: In instantiation of 'static void REFR::CMC_SS::Pixel<TS, TD, pfn, (REFR::CMC::ChCount)1u, (REFR::CMC::ChCount)7u, pxl>::Process(const TS*, void*, TD*, void*, Fw8u) [with TS = unsigned char; TD = unsigned char; void (* pfn)(const Fw8u*, REFR::CH, Fw8u*, REFR::CH) = REFR::RGBToYCbCr<unsigned char, unsigned char>; REFR::CMC_SS::CMCProcPxl pxl = (REFR::CMC_SS::CMCProcPxl)1u; Fw8u = unsigned char]': domain/fwImage/include/colorModelConvSpecial.h:1101:63: required from 'static void REFR::CMC_SS::Block<chSrc, chDst, TS, TD, pfn, (REFR::CMC_SS::CMCStep)0u, (REFR::CMC_SS::CMCStep)0u, pxl>::ProcessBlock(void*, void*, const Fw8u*, Fw8u*, Fw8u) [with REFR::CMC::ChCount chSrc = (REFR::CMC::ChCount)1u; REFR::CMC::ChCount chDst = (REFR::CMC::ChCount)7u; TS = unsigned char; TD = unsigned char; void (* pfn)(const Fw8u*, REFR::CH, Fw8u*, REFR::CH) = REFR::RGBToYCbCr<unsigned char, unsigned char>; REFR::CMC_SS::CMCProcPxl pxl = (REFR::CMC_SS::CMCProcPxl)1u; Fw8u = unsigned char]' domain/fwImage/include/colorModelConvSpecial.h:1218:97: required from 'FwStatus REFR::CMC_SS::Model::ConvertREF(const Fw8u*, int, Fw8u*, int, FwiSize, Fw8u) [with REFR::CMC_SS::CMCStep ChSrcStep = (REFR::CMC_SS::CMCStep)0u; REFR::CMC_SS::CMCStep ChDstStep = (REFR::CMC_SS::CMCStep)0u; unsigned int VertInterval = 1u; int SrcInterval = 6; int DstInterval = 4; REFR::CMC::ChCount chSrc = (REFR::CMC::ChCount)1u; REFR::CMC::ChCount chDst = (REFR::CMC::ChCount)7u; TS = unsigned char; TD = unsigned char; void (* pfn)(const Fw8u*, REFR::CH, Fw8u*, REFR::CH) = REFR::RGBToYCbCr<unsigned char, unsigned char>; Fw8u = unsigned char]' domain/fwImage/src/colorModelConversion_RGB_YCBCR.cpp:272:81: required from here domain/fwImage/include/colorModelConvSpecial.h:353:70: error: narrowing conversion of '((((int)(* ptrSrc)) + ((int)(*(ptrSrc + 3u)))) >> 1)' from 'int' to 'unsigned char' inside { } [-Werror=narrowing] TS srcData[3] = { (*ptrSrc + *(ptrSrc + 3))>>1, ~~~~~~~~~~~~~~~~~~~~~~~~~~~~~~~^~~ domain/fwImage/include/colorModelConvSpecial.h:354:70: error: narrowing conversion of '((((int)(*(ptrSrc + 1u))) + ((int)(*(ptrSrc + 4u)))) >> 1)' from 'int' to 'unsigned char' inside { } [-Werror=narrowing] (*(ptrSrc + 1) + *(ptrSrc + 4))>>1, ~~~~~~~~~~~~~~~~~~~~~~~~~~~~~~~^~~ domain/fwImage/include/colorModelConvSpecial.h:355:70: error: narrowing conversion of '((((int)(*(ptrSrc + 2u))) + ((int)(*(ptrSrc + 5u)))) >> 1)' from 'int' to 'unsigned char' inside { } [-Werror=narrowing] (*(ptrSrc + 2) + *(ptrSrc + 5))>>1 }; ~~~~~~~~~~~~~~~~~~~~~~~~~~~~~~~^~~ domain/fwImage/include/colorModelConvSpecial.h: In instantiation of 'static void REFR::CMC_SS::Pixel<TS, TD, pfn, (REFR::CMC::ChCount)1u, (REFR::CMC::ChCount)7u, pxl>::Process(const TS*, void*, TD*, void*, Fw8u) [with TS = unsigned char; TD = unsigned char; void (* pfn)(const Fw8u*, REFR::CH, Fw8u*, REFR::CH) = REFR::RGBToYCbCr<unsigned char, unsigned char>; REFR::CMC_SS::CMCProcPxl pxl = (REFR::CMC_SS::CMCProcPxl)0u; Fw8u = unsigned char]': domain/fwImage/include/colorModelConvSpecial.h:1101:63: required from 'static void REFR::CMC_SS::Block<chSrc, chDst, TS, TD, pfn, (REFR::CMC_SS::CMCStep)0u, (REFR::CMC_SS::CMCStep)0u, pxl>::ProcessBlock(void*, void*, const Fw8u*, Fw8u*, Fw8u) [with REFR::CMC::ChCount chSrc = (REFR::CMC::ChCount)1u; REFR::CMC::ChCount chDst = (REFR::CMC::ChCount)7u; TS = unsigned char; TD = unsigned char; void (* pfn)(const Fw8u*, REFR::CH, Fw8u*, REFR::CH) = REFR::RGBToYCbCr<unsigned char, unsigned char>; REFR::CMC_SS::CMCProcPxl pxl = (REFR::CMC_SS::CMCProcPxl)0u; Fw8u = unsigned char]' domain/fwImage/include/colorModelConvSpecial.h:1228:100: required from 'FwStatus REFR::CMC_SS::Model::ConvertREF(const Fw8u*, int, Fw8u*, int, FwiSize, Fw8u) [with REFR::CMC_SS::CMCStep ChSrcStep = (REFR::CMC_SS::CMCStep)0u; REFR::CMC_SS::CMCStep ChDstStep = (REFR::CMC_SS::CMCStep)0u; unsigned int VertInterval = 1u; int SrcInterval = 6; int DstInterval = 4; REFR::CMC::ChCount chSrc = (REFR::CMC::ChCount)1u; REFR::CMC::ChCount chDst = (REFR::CMC::ChCount)7u; TS = unsigned char; TD = unsigned char; void (* pfn)(const Fw8u*, REFR::CH, Fw8u*, REFR::CH) = REFR::RGBToYCbCr<unsigned char, unsigned char>; Fw8u = unsigned char]' domain/fwImage/src/colorModelConversion_RGB_YCBCR.cpp:272:81: required from here domain/fwImage/include/colorModelConvSpecial.h:353:70: error: narrowing conversion of '((((int)(* ptrSrc)) + ((int)(*(ptrSrc + 3u)))) >> 1)' from 'int' to 'unsigned char' inside { } [-Werror=narrowing] TS srcData[3] = { (*ptrSrc + *(ptrSrc + 3))>>1, ~~~~~~~~~~~~~~~~~~~~~~~~~~~~~~~^~~ domain/fwImage/include/colorModelConvSpecial.h:354:70: error: narrowing conversion of '((((int)(*(ptrSrc + 1u))) + ((int)(*(ptrSrc + 4u)))) >> 1)' from 'int' to 'unsigned char' inside { } [-Werror=narrowing] (*(ptrSrc + 1) + *(ptrSrc + 4))>>1, ~~~~~~~~~~~~~~~~~~~~~~~~~~~~~~~^~~ domain/fwImage/include/colorModelConvSpecial.h:355:70: error: narrowing conversion of '((((int)(*(ptrSrc + 2u))) + ((int)(*(ptrSrc + 5u)))) >> 1)' from 'int' to 'unsigned char' inside { } [-Werror=narrowing] (*(ptrSrc + 2) + *(ptrSrc + 5))>>1 }; ~~~~~~~~~~~~~~~~~~~~~~~~~~~~~~~^~~ domain/fwImage/include/colorModelConvSpecial.h: In instantiation of 'static void REFR::CMC_SS::Pixel<TS, TD, pfn, (REFR::CMC::ChCount)1u, (REFR::CMC::ChCount)8u, pxl>::Process(const TS*, void*, TD*, void*, Fw8u) [with TS = unsigned char; TD = unsigned char; void (* pfn)(const Fw8u*, REFR::CH, Fw8u*, REFR::CH) = REFR::RGBToYCbCr<unsigned char, unsigned char>; REFR::CMC_SS::CMCProcPxl pxl = (REFR::CMC_SS::CMCProcPxl)1u; Fw8u = unsigned char]': domain/fwImage/include/colorModelConvSpecial.h:1101:63: required from 'static void REFR::CMC_SS::Block<chSrc, chDst, TS, TD, pfn, (REFR::CMC_SS::CMCStep)0u, (REFR::CMC_SS::CMCStep)0u, pxl>::ProcessBlock(void*, void*, const Fw8u*, Fw8u*, Fw8u) [with REFR::CMC::ChCount chSrc = (REFR::CMC::ChCount)1u; REFR::CMC::ChCount chDst = (REFR::CMC::ChCount)8u; TS = unsigned char; TD = unsigned char; void (* pfn)(const Fw8u*, REFR::CH, Fw8u*, REFR::CH) = REFR::RGBToYCbCr<unsigned char, unsigned char>; REFR::CMC_SS::CMCProcPxl pxl = (REFR::CMC_SS::CMCProcPxl)1u; Fw8u = unsigned char]' domain/fwImage/include/colorModelConvSpecial.h:1218:97: required from 'FwStatus REFR::CMC_SS::Model::ConvertREF(const Fw8u*, int, Fw8u*, int, FwiSize, Fw8u) [with REFR::CMC_SS::CMCStep ChSrcStep = (REFR::CMC_SS::CMCStep)0u; REFR::CMC_SS::CMCStep ChDstStep = (REFR::CMC_SS::CMCStep)0u; unsigned int VertInterval = 1u; int SrcInterval = 6; int DstInterval = 4; REFR::CMC::ChCount chSrc = (REFR::CMC::ChCount)1u; REFR::CMC::ChCount chDst = (REFR::CMC::ChCount)8u; TS = unsigned char; TD = unsigned char; void (* pfn)(const Fw8u*, REFR::CH, Fw8u*, REFR::CH) = REFR::RGBToYCbCr<unsigned char, unsigned char>; Fw8u = unsigned char]' domain/fwImage/src/colorModelConversion_RGB_YCBCR.cpp:340:80: required from here domain/fwImage/include/colorModelConvSpecial.h:217:70: error: narrowing conversion of '((((int)(* ptrSrc)) + ((int)(*(ptrSrc + 3u)))) >> 1)' from 'int' to 'unsigned char' inside { } [-Werror=narrowing] TS srcData[3] = { (*ptrSrc + *(ptrSrc + 3))>>1, // R ~~~~~~~~~~~~~~~~~~~~~~~~~~~~~~~^~~ domain/fwImage/include/colorModelConvSpecial.h:218:70: error: narrowing conversion of '((((int)(*(ptrSrc + 1u))) + ((int)(*(ptrSrc + 4u)))) >> 1)' from 'int' to 'unsigned char' inside { } [-Werror=narrowing] (*(ptrSrc + 1) + *(ptrSrc + 4))>>1, // G ~~~~~~~~~~~~~~~~~~~~~~~~~~~~~~~^~~ domain/fwImage/include/colorModelConvSpecial.h:219:70: error: narrowing conversion of '((((int)(*(ptrSrc + 2u))) + ((int)(*(ptrSrc + 5u)))) >> 1)' from 'int' to 'unsigned char' inside { } [-Werror=narrowing] (*(ptrSrc + 2) + *(ptrSrc + 5))>>1 }; // B ~~~~~~~~~~~~~~~~~~~~~~~~~~~~~~~^~~ domain/fwImage/include/colorModelConvSpecial.h: In instantiation of 'static void REFR::CMC_SS::Pixel<TS, TD, pfn, (REFR::CMC::ChCount)1u, (REFR::CMC::ChCount)8u, pxl>::Process(const TS*, void*, TD*, void*, Fw8u) [with TS = unsigned char; TD = unsigned char; void (* pfn)(const Fw8u*, REFR::CH, Fw8u*, REFR::CH) = REFR::RGBToYCbCr<unsigned char, unsigned char>; REFR::CMC_SS::CMCProcPxl pxl = (REFR::CMC_SS::CMCProcPxl)0u; Fw8u = unsigned char]': domain/fwImage/include/colorModelConvSpecial.h:1101:63: required from 'static void REFR::CMC_SS::Block<chSrc, chDst, TS, TD, pfn, (REFR::CMC_SS::CMCStep)0u, (REFR::CMC_SS::CMCStep)0u, pxl>::ProcessBlock(void*, void*, const Fw8u*, Fw8u*, Fw8u) [with REFR::CMC::ChCount chSrc = (REFR::CMC::ChCount)1u; REFR::CMC::ChCount chDst = (REFR::CMC::ChCount)8u; TS = unsigned char; TD = unsigned char; void (* pfn)(const Fw8u*, REFR::CH, Fw8u*, REFR::CH) = REFR::RGBToYCbCr<unsigned char, unsigned char>; REFR::CMC_SS::CMCProcPxl pxl = (REFR::CMC_SS::CMCProcPxl)0u; Fw8u = unsigned char]' domain/fwImage/include/colorModelConvSpecial.h:1228:100: required from 'FwStatus REFR::CMC_SS::Model::ConvertREF(const Fw8u*, int, Fw8u*, int, FwiSize, Fw8u) [with REFR::CMC_SS::CMCStep ChSrcStep = (REFR::CMC_SS::CMCStep)0u; REFR::CMC_SS::CMCStep ChDstStep = (REFR::CMC_SS::CMCStep)0u; unsigned int VertInterval = 1u; int SrcInterval = 6; int DstInterval = 4; REFR::CMC::ChCount chSrc = (REFR::CMC::ChCount)1u; REFR::CMC::ChCount chDst = (REFR::CMC::ChCount)8u; TS = unsigned char; TD = unsigned char; void (* pfn)(const Fw8u*, REFR::CH, Fw8u*, REFR::CH) = REFR::RGBToYCbCr<unsigned char, unsigned char>; Fw8u = unsigned char]' domain/fwImage/src/colorModelConversion_RGB_YCBCR.cpp:340:80: required from here domain/fwImage/include/colorModelConvSpecial.h:217:70: error: narrowing conversion of '((((int)(* ptrSrc)) + ((int)(*(ptrSrc + 3u)))) >> 1)' from 'int' to 'unsigned char' inside { } [-Werror=narrowing] TS srcData[3] = { (*ptrSrc + *(ptrSrc + 3))>>1, // R ~~~~~~~~~~~~~~~~~~~~~~~~~~~~~~~^~~ domain/fwImage/include/colorModelConvSpecial.h:218:70: error: narrowing conversion of '((((int)(*(ptrSrc + 1u))) + ((int)(*(ptrSrc + 4u)))) >> 1)' from 'int' to 'unsigned char' inside { } [-Werror=narrowing] (*(ptrSrc + 1) + *(ptrSrc + 4))>>1, // G ~~~~~~~~~~~~~~~~~~~~~~~~~~~~~~~^~~ domain/fwImage/include/colorModelConvSpecial.h:219:70: error: narrowing conversion of '((((int)(*(ptrSrc + 2u))) + ((int)(*(ptrSrc + 5u)))) >> 1)' from 'int' to 'unsigned char' inside { } [-Werror=narrowing] (*(ptrSrc + 2) + *(ptrSrc + 5))>>1 }; // B ~~~~~~~~~~~~~~~~~~~~~~~~~~~~~~~^~~ domain/fwImage/include/colorModelConvSpecial.h: In instantiation of 'static void REFR::CMC_SS::Pixel<TS, TD, pfn, (REFR::CMC::ChCount)1u, (REFR::CMC::ChCount)8u, pxl>::Process(const TS*, void*, TD*, void*, Fw8u) [with TS = unsigned char; TD = unsigned char; void (* pfn)(const Fw8u*, REFR::CH, Fw8u*, REFR::CH) = REFR::RGBToYCbCrGamma<unsigned char, unsigned char>; REFR::CMC_SS::CMCProcPxl pxl = (REFR::CMC_SS::CMCProcPxl)1u; Fw8u = unsigned char]': domain/fwImage/include/colorModelConvSpecial.h:1101:63: required from 'static void REFR::CMC_SS::Block<chSrc, chDst, TS, TD, pfn, (REFR::CMC_SS::CMCStep)0u, (REFR::CMC_SS::CMCStep)0u, pxl>::ProcessBlock(void*, void*, const Fw8u*, Fw8u*, Fw8u) [with REFR::CMC::ChCount chSrc = (REFR::CMC::ChCount)1u; REFR::CMC::ChCount chDst = (REFR::CMC::ChCount)8u; TS = unsigned char; TD = unsigned char; void (* pfn)(const Fw8u*, REFR::CH, Fw8u*, REFR::CH) = REFR::RGBToYCbCrGamma<unsigned char, unsigned char>; REFR::CMC_SS::CMCProcPxl pxl = (REFR::CMC_SS::CMCProcPxl)1u; Fw8u = unsigned char]' domain/fwImage/include/colorModelConvSpecial.h:1218:97: required from 'FwStatus REFR::CMC_SS::Model::ConvertREF(const Fw8u*, int, Fw8u*, int, FwiSize, Fw8u) [with REFR::CMC_SS::CMCStep ChSrcStep = (REFR::CMC_SS::CMCStep)0u; REFR::CMC_SS::CMCStep ChDstStep = (REFR::CMC_SS::CMCStep)0u; unsigned int VertInterval = 1u; int SrcInterval = 6; int DstInterval = 4; REFR::CMC::ChCount chSrc = (REFR::CMC::ChCount)1u; REFR::CMC::ChCount chDst = (REFR::CMC::ChCount)8u; TS = unsigned char; TD = unsigned char; void (* pfn)(const Fw8u*, REFR::CH, Fw8u*, REFR::CH) = REFR::RGBToYCbCrGamma<unsigned char, unsigned char>; Fw8u = unsigned char]' domain/fwImage/src/colorModelConversion_RGB_YCBCR.cpp:351:80: required from here domain/fwImage/include/colorModelConvSpecial.h:217:70: error: narrowing conversion of '((((int)(* ptrSrc)) + ((int)(*(ptrSrc + 3u)))) >> 1)' from 'int' to 'unsigned char' inside { } [-Werror=narrowing] TS srcData[3] = { (*ptrSrc + *(ptrSrc + 3))>>1, // R ~~~~~~~~~~~~~~~~~~~~~~~~~~~~~~~^~~ domain/fwImage/include/colorModelConvSpecial.h:218:70: error: narrowing conversion of '((((int)(*(ptrSrc + 1u))) + ((int)(*(ptrSrc + 4u)))) >> 1)' from 'int' to 'unsigned char' inside { } [-Werror=narrowing] (*(ptrSrc + 1) + *(ptrSrc + 4))>>1, // G ~~~~~~~~~~~~~~~~~~~~~~~~~~~~~~~^~~ domain/fwImage/include/colorModelConvSpecial.h:219:70: error: narrowing conversion of '((((int)(*(ptrSrc + 2u))) + ((int)(*(ptrSrc + 5u)))) >> 1)' from 'int' to 'unsigned char' inside { } [-Werror=narrowing] (*(ptrSrc + 2) + *(ptrSrc + 5))>>1 }; // B ~~~~~~~~~~~~~~~~~~~~~~~~~~~~~~~^~~ domain/fwImage/include/colorModelConvSpecial.h: In instantiation of 'static void REFR::CMC_SS::Pixel<TS, TD, pfn, (REFR::CMC::ChCount)1u, (REFR::CMC::ChCount)8u, pxl>::Process(const TS*, void*, TD*, void*, Fw8u) [with TS = unsigned char; TD = unsigned char; void (* pfn)(const Fw8u*, REFR::CH, Fw8u*, REFR::CH) = REFR::RGBToYCbCrGamma<unsigned char, unsigned char>; REFR::CMC_SS::CMCProcPxl pxl = (REFR::CMC_SS::CMCProcPxl)0u; Fw8u = unsigned char]': domain/fwImage/include/colorModelConvSpecial.h:1101:63: required from 'static void REFR::CMC_SS::Block<chSrc, chDst, TS, TD, pfn, (REFR::CMC_SS::CMCStep)0u, (REFR::CMC_SS::CMCStep)0u, pxl>::ProcessBlock(void*, void*, const Fw8u*, Fw8u*, Fw8u) [with REFR::CMC::ChCount chSrc = (REFR::CMC::ChCount)1u; REFR::CMC::ChCount chDst = (REFR::CMC::ChCount)8u; TS = unsigned char; TD = unsigned char; void (* pfn)(const Fw8u*, REFR::CH, Fw8u*, REFR::CH) = REFR::RGBToYCbCrGamma<unsigned char, unsigned char>; REFR::CMC_SS::CMCProcPxl pxl = (REFR::CMC_SS::CMCProcPxl)0u; Fw8u = unsigned char]' domain/fwImage/include/colorModelConvSpecial.h:1228:100: required from 'FwStatus REFR::CMC_SS::Model::ConvertREF(const Fw8u*, int, Fw8u*, int, FwiSize, Fw8u) [with REFR::CMC_SS::CMCStep ChSrcStep = (REFR::CMC_SS::CMCStep)0u; REFR::CMC_SS::CMCStep ChDstStep = (REFR::CMC_SS::CMCStep)0u; unsigned int VertInterval = 1u; int SrcInterval = 6; int DstInterval = 4; REFR::CMC::ChCount chSrc = (REFR::CMC::ChCount)1u; REFR::CMC::ChCount chDst = (REFR::CMC::ChCount)8u; TS = unsigned char; TD = unsigned char; void (* pfn)(const Fw8u*, REFR::CH, Fw8u*, REFR::CH) = REFR::RGBToYCbCrGamma<unsigned char, unsigned char>; Fw8u = unsigned char]' domain/fwImage/src/colorModelConversion_RGB_YCBCR.cpp:351:80: required from here domain/fwImage/include/colorModelConvSpecial.h:217:70: error: narrowing conversion of '((((int)(* ptrSrc)) + ((int)(*(ptrSrc + 3u)))) >> 1)' from 'int' to 'unsigned char' inside { } [-Werror=narrowing] TS srcData[3] = { (*ptrSrc + *(ptrSrc + 3))>>1, // R ~~~~~~~~~~~~~~~~~~~~~~~~~~~~~~~^~~ domain/fwImage/include/colorModelConvSpecial.h:218:70: error: narrowing conversion of '((((int)(*(ptrSrc + 1u))) + ((int)(*(ptrSrc + 4u)))) >> 1)' from 'int' to 'unsigned char' inside { } [-Werror=narrowing] (*(ptrSrc + 1) + *(ptrSrc + 4))>>1, // G ~~~~~~~~~~~~~~~~~~~~~~~~~~~~~~~^~~ domain/fwImage/include/colorModelConvSpecial.h:219:70: error: narrowing conversion of '((((int)(*(ptrSrc + 2u))) + ((int)(*(ptrSrc + 5u)))) >> 1)' from 'int' to 'unsigned char' inside { } [-Werror=narrowing] (*(ptrSrc + 2) + *(ptrSrc + 5))>>1 }; // B ~~~~~~~~~~~~~~~~~~~~~~~~~~~~~~~^~~ domain/fwImage/include/colorModelConvSpecial.h: In instantiation of 'static void REFR::CMC_SS::Pixel<TS, TD, pfn, (REFR::CMC::ChCount)2u, (REFR::CMC::ChCount)8u, pxl>::Process(const TS*, void*, TD*, void*, Fw8u) [with TS = unsigned char; TD = unsigned char; void (* pfn)(const Fw8u*, REFR::CH, Fw8u*, REFR::CH) = REFR::BGRToYCbCr<unsigned char, unsigned char>; REFR::CMC_SS::CMCProcPxl pxl = (REFR::CMC_SS::CMCProcPxl)1u; Fw8u = unsigned char]': domain/fwImage/include/colorModelConvSpecial.h:1101:63: required from 'static void REFR::CMC_SS::Block<chSrc, chDst, TS, TD, pfn, (REFR::CMC_SS::CMCStep)0u, (REFR::CMC_SS::CMCStep)0u, pxl>::ProcessBlock(void*, void*, const Fw8u*, Fw8u*, Fw8u) [with REFR::CMC::ChCount chSrc = (REFR::CMC::ChCount)2u; REFR::CMC::ChCount chDst = (REFR::CMC::ChCount)8u; TS = unsigned char; TD = unsigned char; void (* pfn)(const Fw8u*, REFR::CH, Fw8u*, REFR::CH) = REFR::BGRToYCbCr<unsigned char, unsigned char>; REFR::CMC_SS::CMCProcPxl pxl = (REFR::CMC_SS::CMCProcPxl)1u; Fw8u = unsigned char]' domain/fwImage/include/colorModelConvSpecial.h:1218:97: required from 'FwStatus REFR::CMC_SS::Model::ConvertREF(const Fw8u*, int, Fw8u*, int, FwiSize, Fw8u) [with REFR::CMC_SS::CMCStep ChSrcStep = (REFR::CMC_SS::CMCStep)0u; REFR::CMC_SS::CMCStep ChDstStep = (REFR::CMC_SS::CMCStep)0u; unsigned int VertInterval = 1u; int SrcInterval = 8; int DstInterval = 4; REFR::CMC::ChCount chSrc = (REFR::CMC::ChCount)2u; REFR::CMC::ChCount chDst = (REFR::CMC::ChCount)8u; TS = unsigned char; TD = unsigned char; void (* pfn)(const Fw8u*, REFR::CH, Fw8u*, REFR::CH) = REFR::BGRToYCbCr<unsigned char, unsigned char>; Fw8u = unsigned char]' domain/fwImage/src/colorModelConversion_RGB_YCBCR.cpp:384:80: required from here domain/fwImage/include/colorModelConvSpecial.h:283:68: error: narrowing conversion of '((((int)(* ptrSrc)) + ((int)(*(ptrSrc + 4u)))) >> 1)' from 'int' to 'unsigned char' inside { } [-Werror=narrowing] TS srcData[3] = { (*ptrSrc + *(ptrSrc + 4))>>1, // R ~~~~~~~~~~~~~~~~~~~~~~~~~~~~~^~~ domain/fwImage/include/colorModelConvSpecial.h:284:68: error: narrowing conversion of '((((int)(*(ptrSrc + 1u))) + ((int)(*(ptrSrc + 5u)))) >> 1)' from 'int' to 'unsigned char' inside { } [-Werror=narrowing] (*(ptrSrc+1) + *(ptrSrc + 5))>>1, // G ~~~~~~~~~~~~~~~~~~~~~~~~~~~~~^~~ domain/fwImage/include/colorModelConvSpecial.h:285:68: error: narrowing conversion of '((((int)(*(ptrSrc + 2u))) + ((int)(*(ptrSrc + 6u)))) >> 1)' from 'int' to 'unsigned char' inside { } [-Werror=narrowing] (*(ptrSrc+2) + *(ptrSrc + 6))>>1 }; // B ~~~~~~~~~~~~~~~~~~~~~~~~~~~~~^~~ domain/fwImage/include/colorModelConvSpecial.h: In instantiation of 'static void REFR::CMC_SS::Pixel<TS, TD, pfn, (REFR::CMC::ChCount)2u, (REFR::CMC::ChCount)8u, pxl>::Process(const TS*, void*, TD*, void*, Fw8u) [with TS = unsigned char; TD = unsigned char; void (* pfn)(const Fw8u*, REFR::CH, Fw8u*, REFR::CH) = REFR::BGRToYCbCr<unsigned char, unsigned char>; REFR::CMC_SS::CMCProcPxl pxl = (REFR::CMC_SS::CMCProcPxl)0u; Fw8u = unsigned char]': domain/fwImage/include/colorModelConvSpecial.h:1101:63: required from 'static void REFR::CMC_SS::Block<chSrc, chDst, TS, TD, pfn, (REFR::CMC_SS::CMCStep)0u, (REFR::CMC_SS::CMCStep)0u, pxl>::ProcessBlock(void*, void*, const Fw8u*, Fw8u*, Fw8u) [with REFR::CMC::ChCount chSrc = (REFR::CMC::ChCount)2u; REFR::CMC::ChCount chDst = (REFR::CMC::ChCount)8u; TS = unsigned char; TD = unsigned char; void (* pfn)(const Fw8u*, REFR::CH, Fw8u*, REFR::CH) = REFR::BGRToYCbCr<unsigned char, unsigned char>; REFR::CMC_SS::CMCProcPxl pxl = (REFR::CMC_SS::CMCProcPxl)0u; Fw8u = unsigned char]' domain/fwImage/include/colorModelConvSpecial.h:1228:100: required from 'FwStatus REFR::CMC_SS::Model::ConvertREF(const Fw8u*, int, Fw8u*, int, FwiSize, Fw8u) [with REFR::CMC_SS::CMCStep ChSrcStep = (REFR::CMC_SS::CMCStep)0u; REFR::CMC_SS::CMCStep ChDstStep = (REFR::CMC_SS::CMCStep)0u; unsigned int VertInterval = 1u; int SrcInterval = 8; int DstInterval = 4; REFR::CMC::ChCount chSrc = (REFR::CMC::ChCount)2u; REFR::CMC::ChCount chDst = (REFR::CMC::ChCount)8u; TS = unsigned char; TD = unsigned char; void (* pfn)(const Fw8u*, REFR::CH, Fw8u*, REFR::CH) = REFR::BGRToYCbCr<unsigned char, unsigned char>; Fw8u = unsigned char]' domain/fwImage/src/colorModelConversion_RGB_YCBCR.cpp:384:80: required from here domain/fwImage/include/colorModelConvSpecial.h:283:68: error: narrowing conversion of '((((int)(* ptrSrc)) + ((int)(*(ptrSrc + 4u)))) >> 1)' from 'int' to 'unsigned char' inside { } [-Werror=narrowing] TS srcData[3] = { (*ptrSrc + *(ptrSrc + 4))>>1, // R ~~~~~~~~~~~~~~~~~~~~~~~~~~~~~^~~ domain/fwImage/include/colorModelConvSpecial.h:284:68: error: narrowing conversion of '((((int)(*(ptrSrc + 1u))) + ((int)(*(ptrSrc + 5u)))) >> 1)' from 'int' to 'unsigned char' inside { } [-Werror=narrowing] (*(ptrSrc+1) + *(ptrSrc + 5))>>1, // G ~~~~~~~~~~~~~~~~~~~~~~~~~~~~~^~~ domain/fwImage/include/colorModelConvSpecial.h:285:68: error: narrowing conversion of '((((int)(*(ptrSrc + 2u))) + ((int)(*(ptrSrc + 6u)))) >> 1)' from 'int' to 'unsigned char' inside { } [-Werror=narrowing] (*(ptrSrc+2) + *(ptrSrc + 6))>>1 }; // B ~~~~~~~~~~~~~~~~~~~~~~~~~~~~~^~~ cc1plus: all warnings being treated as errors scons: *** [build/tmp/fwImage_release_shared_64/obj/_refr_colorModelConversion_RGB_YCBCR.obj] Error 1 scons: building terminated because of errors. error: Bad exit status from /tmp/B.3RZ7Ot/BUILD/tmp/rpm-tmp.74117 (%build) RPM build errors: Bad exit status from /tmp/B.3RZ7Ot/BUILD/tmp/rpm-tmp.74117 (%build) ended at: Sat Apr 15 08:09:47 2017, done in 0:00:06.832185 error: No files produced. mesg: ttyname failed: Inappropriate ioctl for device + chmod -R u+rwX /tmp/B.3RZ7Ot/BUILD + rm -rf /tmp/B.3RZ7Ot/tmp /tmp/B.3RZ7Ot/BUILD mesg: ttyname failed: Inappropriate ioctl for device + rm -rf /tmp/B.3RZ7Ot Begin-PLD-Builder-Info Build-Time: user:9.82s sys:0.87s real:10.68s (faults io:0 non-io:242627) End-PLD-Builder-Info
[Back to list of logs] [View rpm -qa of builder]