FailedOk

th/SRPMS[OK]
th/x32[OK]
th/i686[OK]
th/x86_64[OK]

ac/SRPMS[OK]
ac/i386[OK]
ac/i586[OK]
ac/i686[OK]
ac/alpha[OK]
ac/amd64[OK]
ac/athlon[OK]
ac/ppc[OK]
ac/sparc[OK]
ac/sparc64[OK]

Advanced Search
main()
Powered by PLD Linux
(c) 2002-2017 PLD Team
$Revision: 1.37 $
Powered by achelon.
Your IP: 54.163.209.109

gd 07fcfe38-5f01-4a21-9448-a0e17ab6ca9c

Status:Failed
Source URL:ftp://buildlogs.pld-linux.org/th/x86_64/FAIL/gd,07fcfe38-5f01-4a21-9448-a0e17ab6ca9c.bz2
text/plain URL:View!
full text:View!
rpm -qa of builder:View!
Date:2017/11/29 21:20:38
Runtime:0:01:28.784824

Toc:

Content:

PASS: gdimageline/bug00111
make[3]: Leaving directory '/tmp/B.9vqE8A/BUILD/libgd-2.2.5/tests'
make[3]: Entering directory '/tmp/B.9vqE8A/BUILD/libgd-2.2.5/tests'
PASS: gdimagefilter/gdCopyBlurred
make[3]: Leaving directory '/tmp/B.9vqE8A/BUILD/libgd-2.2.5/tests'
make[3]: Entering directory '/tmp/B.9vqE8A/BUILD/libgd-2.2.5/tests'
PASS: gdimageline/gdimageline_aa
make[3]: Leaving directory '/tmp/B.9vqE8A/BUILD/libgd-2.2.5/tests'
make[3]: Entering directory '/tmp/B.9vqE8A/BUILD/libgd-2.2.5/tests'
PASS: gdimageline/gdImageAALine_thickness
make[3]: Leaving directory '/tmp/B.9vqE8A/BUILD/libgd-2.2.5/tests'
make[3]: Entering directory '/tmp/B.9vqE8A/BUILD/libgd-2.2.5/tests'
PASS: gdimageopenpolygon/gdimageopenpolygon0
make[3]: Leaving directory '/tmp/B.9vqE8A/BUILD/libgd-2.2.5/tests'
make[3]: Entering directory '/tmp/B.9vqE8A/BUILD/libgd-2.2.5/tests'
PASS: gdimageline/github_bug_167
make[3]: Leaving directory '/tmp/B.9vqE8A/BUILD/libgd-2.2.5/tests'
make[3]: Entering directory '/tmp/B.9vqE8A/BUILD/libgd-2.2.5/tests'
PASS: gdimagenegate/basic
make[3]: Leaving directory '/tmp/B.9vqE8A/BUILD/libgd-2.2.5/tests'
make[3]: Entering directory '/tmp/B.9vqE8A/BUILD/libgd-2.2.5/tests'
PASS: gdimageopenpolygon/gdimageopenpolygon3
make[3]: Leaving directory '/tmp/B.9vqE8A/BUILD/libgd-2.2.5/tests'
make[3]: Entering directory '/tmp/B.9vqE8A/BUILD/libgd-2.2.5/tests'
PASS: gdimageopenpolygon/gdimageopenpolygon1
make[3]: Leaving directory '/tmp/B.9vqE8A/BUILD/libgd-2.2.5/tests'
make[3]: Entering directory '/tmp/B.9vqE8A/BUILD/libgd-2.2.5/tests'
PASS: gdimageopenpolygon/gdimageopenpolygon2
make[3]: Leaving directory '/tmp/B.9vqE8A/BUILD/libgd-2.2.5/tests'
make[3]: Entering directory '/tmp/B.9vqE8A/BUILD/libgd-2.2.5/tests'
PASS: gdimagepixelate/gdimagepixelate
make[3]: Leaving directory '/tmp/B.9vqE8A/BUILD/libgd-2.2.5/tests'
make[3]: Entering directory '/tmp/B.9vqE8A/BUILD/libgd-2.2.5/tests'
PASS: gdimagepolygon/gdimagepolygon0
make[3]: Leaving directory '/tmp/B.9vqE8A/BUILD/libgd-2.2.5/tests'
make[3]: Entering directory '/tmp/B.9vqE8A/BUILD/libgd-2.2.5/tests'
PASS: gdimagepolygon/gdimagepolygon1
make[3]: Leaving directory '/tmp/B.9vqE8A/BUILD/libgd-2.2.5/tests'
make[3]: Entering directory '/tmp/B.9vqE8A/BUILD/libgd-2.2.5/tests'
PASS: gdimagepolygon/gdimagepolygon2
make[3]: Leaving directory '/tmp/B.9vqE8A/BUILD/libgd-2.2.5/tests'
make[3]: Entering directory '/tmp/B.9vqE8A/BUILD/libgd-2.2.5/tests'
PASS: gdimagepolygon/gdimagepolygon3
make[3]: Leaving directory '/tmp/B.9vqE8A/BUILD/libgd-2.2.5/tests'
make[3]: Entering directory '/tmp/B.9vqE8A/BUILD/libgd-2.2.5/tests'
PASS: gdimagerectangle/bug00003
make[3]: Leaving directory '/tmp/B.9vqE8A/BUILD/libgd-2.2.5/tests'
make[3]: Entering directory '/tmp/B.9vqE8A/BUILD/libgd-2.2.5/tests'
PASS: gdimagerectangle/github_bug_00172
make[3]: Leaving directory '/tmp/B.9vqE8A/BUILD/libgd-2.2.5/tests'
make[3]: Entering directory '/tmp/B.9vqE8A/BUILD/libgd-2.2.5/tests'
PASS: gdimagerectangle/bug00106_gdimagerectangle
make[3]: Leaving directory '/tmp/B.9vqE8A/BUILD/libgd-2.2.5/tests'
make[3]: Entering directory '/tmp/B.9vqE8A/BUILD/libgd-2.2.5/tests'
PASS: gdimagerectangle/bug00299
make[3]: Leaving directory '/tmp/B.9vqE8A/BUILD/libgd-2.2.5/tests'
make[3]: Entering directory '/tmp/B.9vqE8A/BUILD/libgd-2.2.5/tests'
PASS: gdimagerectangle/point_ordering
make[3]: Leaving directory '/tmp/B.9vqE8A/BUILD/libgd-2.2.5/tests'
make[3]: Entering directory '/tmp/B.9vqE8A/BUILD/libgd-2.2.5/tests'
PASS: gdimagerotate/php_bug_65070
make[3]: Leaving directory '/tmp/B.9vqE8A/BUILD/libgd-2.2.5/tests'
make[3]: Entering directory '/tmp/B.9vqE8A/BUILD/libgd-2.2.5/tests'
PASS: gdimagerotate/php_bug_64898
make[3]: Leaving directory '/tmp/B.9vqE8A/BUILD/libgd-2.2.5/tests'
make[3]: Entering directory '/tmp/B.9vqE8A/BUILD/libgd-2.2.5/tests'
PASS: gdimagescale/bug00329
make[3]: Leaving directory '/tmp/B.9vqE8A/BUILD/libgd-2.2.5/tests'
make[3]: Entering directory '/tmp/B.9vqE8A/BUILD/libgd-2.2.5/tests'
PASS: gdimagerotate/bug00067
make[3]: Leaving directory '/tmp/B.9vqE8A/BUILD/libgd-2.2.5/tests'
make[3]: Entering directory '/tmp/B.9vqE8A/BUILD/libgd-2.2.5/tests'
PASS: gdimagescale/github_bug_00218
make[3]: Leaving directory '/tmp/B.9vqE8A/BUILD/libgd-2.2.5/tests'
make[3]: Entering directory '/tmp/B.9vqE8A/BUILD/libgd-2.2.5/tests'
PASS: gdimagescale/bug00330
make[3]: Leaving directory '/tmp/B.9vqE8A/BUILD/libgd-2.2.5/tests'
make[3]: Entering directory '/tmp/B.9vqE8A/BUILD/libgd-2.2.5/tests'
PASS: gdimagescale/bug_overflow_large_new_size
make[3]: Leaving directory '/tmp/B.9vqE8A/BUILD/libgd-2.2.5/tests'
make[3]: Entering directory '/tmp/B.9vqE8A/BUILD/libgd-2.2.5/tests'
PASS: gdimagesetpixel/bug00186
make[3]: Leaving directory '/tmp/B.9vqE8A/BUILD/libgd-2.2.5/tests'
make[3]: Entering directory '/tmp/B.9vqE8A/BUILD/libgd-2.2.5/tests'
PASS: gdimagescatterex/bug00208_1
make[3]: Leaving directory '/tmp/B.9vqE8A/BUILD/libgd-2.2.5/tests'
make[3]: Entering directory '/tmp/B.9vqE8A/BUILD/libgd-2.2.5/tests'
PASS: gdimagescatterex/bug00208_2
make[3]: Leaving directory '/tmp/B.9vqE8A/BUILD/libgd-2.2.5/tests'
make[3]: Entering directory '/tmp/B.9vqE8A/BUILD/libgd-2.2.5/tests'
PASS: gdimagesetpixel/gdeffectmultiply
make[3]: Leaving directory '/tmp/B.9vqE8A/BUILD/libgd-2.2.5/tests'
make[3]: Entering directory '/tmp/B.9vqE8A/BUILD/libgd-2.2.5/tests'
PASS: gdimagesetpixel/gdeffectoverlay
make[3]: Leaving directory '/tmp/B.9vqE8A/BUILD/libgd-2.2.5/tests'
make[3]: Entering directory '/tmp/B.9vqE8A/BUILD/libgd-2.2.5/tests'
PASS: gdimagesetpixel/alpha_blending
make[3]: Leaving directory '/tmp/B.9vqE8A/BUILD/libgd-2.2.5/tests'
make[3]: Entering directory '/tmp/B.9vqE8A/BUILD/libgd-2.2.5/tests'
XFAIL: gdimagestringft/gdimagestringft_bbox
make[3]: Leaving directory '/tmp/B.9vqE8A/BUILD/libgd-2.2.5/tests'
make[3]: Entering directory '/tmp/B.9vqE8A/BUILD/libgd-2.2.5/tests'
PASS: gdimagestringftex/gdimagestringftex_returnfontpathname
make[3]: Leaving directory '/tmp/B.9vqE8A/BUILD/libgd-2.2.5/tests'
make[3]: Entering directory '/tmp/B.9vqE8A/BUILD/libgd-2.2.5/tests'
PASS: gdimagetruecolortopalette/bug00307
make[3]: Leaving directory '/tmp/B.9vqE8A/BUILD/libgd-2.2.5/tests'
make[3]: Entering directory '/tmp/B.9vqE8A/BUILD/libgd-2.2.5/tests'
PASS: gdimagetruecolortopalette/php_bug_72512
make[3]: Leaving directory '/tmp/B.9vqE8A/BUILD/libgd-2.2.5/tests'
make[3]: Entering directory '/tmp/B.9vqE8A/BUILD/libgd-2.2.5/tests'
PASS: gdimagetruecolortopalette/php_bug_67325
make[3]: Leaving directory '/tmp/B.9vqE8A/BUILD/libgd-2.2.5/tests'
make[3]: Entering directory '/tmp/B.9vqE8A/BUILD/libgd-2.2.5/tests'
PASS: gdinterpolatedscale/gdModesAndPalettes
make[3]: Leaving directory '/tmp/B.9vqE8A/BUILD/libgd-2.2.5/tests'
make[3]: Entering directory '/tmp/B.9vqE8A/BUILD/libgd-2.2.5/tests'
PASS: gdtiled/bug00032
make[3]: Leaving directory '/tmp/B.9vqE8A/BUILD/libgd-2.2.5/tests'
make[3]: Entering directory '/tmp/B.9vqE8A/BUILD/libgd-2.2.5/tests'
PASS: gdnewfilectx/gdnewfilectx_null
make[3]: Leaving directory '/tmp/B.9vqE8A/BUILD/libgd-2.2.5/tests'
make[3]: Entering directory '/tmp/B.9vqE8A/BUILD/libgd-2.2.5/tests'
PASS: gdtransformaffineboundingbox/github_bug_00221
make[3]: Leaving directory '/tmp/B.9vqE8A/BUILD/libgd-2.2.5/tests'
make[3]: Entering directory '/tmp/B.9vqE8A/BUILD/libgd-2.2.5/tests'
PASS: gif/bug00181
make[3]: Leaving directory '/tmp/B.9vqE8A/BUILD/libgd-2.2.5/tests'
make[3]: Entering directory '/tmp/B.9vqE8A/BUILD/libgd-2.2.5/tests'
PASS: gif/bug00005_2
make[3]: Leaving directory '/tmp/B.9vqE8A/BUILD/libgd-2.2.5/tests'
make[3]: Entering directory '/tmp/B.9vqE8A/BUILD/libgd-2.2.5/tests'
PASS: gif/bug00227
make[3]: Leaving directory '/tmp/B.9vqE8A/BUILD/libgd-2.2.5/tests'
make[3]: Entering directory '/tmp/B.9vqE8A/BUILD/libgd-2.2.5/tests'
PASS: gif/gif_null
make[3]: Leaving directory '/tmp/B.9vqE8A/BUILD/libgd-2.2.5/tests'
make[3]: Entering directory '/tmp/B.9vqE8A/BUILD/libgd-2.2.5/tests'
PASS: gif/uninitialized_memory_read
make[3]: Leaving directory '/tmp/B.9vqE8A/BUILD/libgd-2.2.5/tests'
make[3]: Entering directory '/tmp/B.9vqE8A/BUILD/libgd-2.2.5/tests'
PASS: gif/bug00006
make[3]: Leaving directory '/tmp/B.9vqE8A/BUILD/libgd-2.2.5/tests'
make[3]: Entering directory '/tmp/B.9vqE8A/BUILD/libgd-2.2.5/tests'
PASS: gif/bug00005
make[3]: Leaving directory '/tmp/B.9vqE8A/BUILD/libgd-2.2.5/tests'
make[3]: Entering directory '/tmp/B.9vqE8A/BUILD/libgd-2.2.5/tests'
PASS: gif/bug00060
make[3]: Leaving directory '/tmp/B.9vqE8A/BUILD/libgd-2.2.5/tests'
make[3]: Entering directory '/tmp/B.9vqE8A/BUILD/libgd-2.2.5/tests'
PASS: gif/bug00066
make[3]: Leaving directory '/tmp/B.9vqE8A/BUILD/libgd-2.2.5/tests'
make[3]: Entering directory '/tmp/B.9vqE8A/BUILD/libgd-2.2.5/tests'
PASS: gif/gif_im2im
make[3]: Leaving directory '/tmp/B.9vqE8A/BUILD/libgd-2.2.5/tests'
make[3]: Entering directory '/tmp/B.9vqE8A/BUILD/libgd-2.2.5/tests'
PASS: jpeg/jpeg_empty_file
make[3]: Leaving directory '/tmp/B.9vqE8A/BUILD/libgd-2.2.5/tests'
make[3]: Entering directory '/tmp/B.9vqE8A/BUILD/libgd-2.2.5/tests'
PASS: jpeg/jpeg_im2im
make[3]: Leaving directory '/tmp/B.9vqE8A/BUILD/libgd-2.2.5/tests'
make[3]: Entering directory '/tmp/B.9vqE8A/BUILD/libgd-2.2.5/tests'
PASS: jpeg/bug_github_18
make[3]: Leaving directory '/tmp/B.9vqE8A/BUILD/libgd-2.2.5/tests'
make[3]: Entering directory '/tmp/B.9vqE8A/BUILD/libgd-2.2.5/tests'
PASS: jpeg/jpeg_null
make[3]: Leaving directory '/tmp/B.9vqE8A/BUILD/libgd-2.2.5/tests'
make[3]: Entering directory '/tmp/B.9vqE8A/BUILD/libgd-2.2.5/tests'
PASS: jpeg/jpeg_read
make[3]: Leaving directory '/tmp/B.9vqE8A/BUILD/libgd-2.2.5/tests'
make[3]: Entering directory '/tmp/B.9vqE8A/BUILD/libgd-2.2.5/tests'
PASS: jpeg/bug00338
make[3]: Leaving directory '/tmp/B.9vqE8A/BUILD/libgd-2.2.5/tests'
make[3]: Entering directory '/tmp/B.9vqE8A/BUILD/libgd-2.2.5/tests'
PASS: jpeg/jpeg_resolution
make[3]: Leaving directory '/tmp/B.9vqE8A/BUILD/libgd-2.2.5/tests'
make[3]: Entering directory '/tmp/B.9vqE8A/BUILD/libgd-2.2.5/tests'
PASS: png/bug00033
make[3]: Leaving directory '/tmp/B.9vqE8A/BUILD/libgd-2.2.5/tests'
make[3]: Entering directory '/tmp/B.9vqE8A/BUILD/libgd-2.2.5/tests'
PASS: png/bug00011
make[3]: Leaving directory '/tmp/B.9vqE8A/BUILD/libgd-2.2.5/tests'
make[3]: Entering directory '/tmp/B.9vqE8A/BUILD/libgd-2.2.5/tests'
PASS: gdinterpolatedscale/gdTrivialResize
make[3]: Leaving directory '/tmp/B.9vqE8A/BUILD/libgd-2.2.5/tests'
make[3]: Entering directory '/tmp/B.9vqE8A/BUILD/libgd-2.2.5/tests'
PASS: png/bug00086
make[3]: Leaving directory '/tmp/B.9vqE8A/BUILD/libgd-2.2.5/tests'
make[3]: Entering directory '/tmp/B.9vqE8A/BUILD/libgd-2.2.5/tests'
PASS: png/bug00088
make[3]: Leaving directory '/tmp/B.9vqE8A/BUILD/libgd-2.2.5/tests'
make[3]: Entering directory '/tmp/B.9vqE8A/BUILD/libgd-2.2.5/tests'
PASS: png/bug00338
make[3]: Leaving directory '/tmp/B.9vqE8A/BUILD/libgd-2.2.5/tests'
make[3]: Entering directory '/tmp/B.9vqE8A/BUILD/libgd-2.2.5/tests'
PASS: png/bug00193
make[3]: Leaving directory '/tmp/B.9vqE8A/BUILD/libgd-2.2.5/tests'
make[3]: Entering directory '/tmp/B.9vqE8A/BUILD/libgd-2.2.5/tests'
PASS: png/bug00381_1
make[3]: Leaving directory '/tmp/B.9vqE8A/BUILD/libgd-2.2.5/tests'
make[3]: Entering directory '/tmp/B.9vqE8A/BUILD/libgd-2.2.5/tests'
PASS: png/bug00381_2
make[3]: Leaving directory '/tmp/B.9vqE8A/BUILD/libgd-2.2.5/tests'
make[3]: Entering directory '/tmp/B.9vqE8A/BUILD/libgd-2.2.5/tests'
PASS: png/png_im2im
make[3]: Leaving directory '/tmp/B.9vqE8A/BUILD/libgd-2.2.5/tests'
make[3]: Entering directory '/tmp/B.9vqE8A/BUILD/libgd-2.2.5/tests'
PASS: png/png_null
make[3]: Leaving directory '/tmp/B.9vqE8A/BUILD/libgd-2.2.5/tests'
make[3]: Entering directory '/tmp/B.9vqE8A/BUILD/libgd-2.2.5/tests'
PASS: png/png_resolution
make[3]: Leaving directory '/tmp/B.9vqE8A/BUILD/libgd-2.2.5/tests'
make[3]: Entering directory '/tmp/B.9vqE8A/BUILD/libgd-2.2.5/tests'
PASS: tga/bug00084
make[3]: Leaving directory '/tmp/B.9vqE8A/BUILD/libgd-2.2.5/tests'
make[3]: Entering directory '/tmp/B.9vqE8A/BUILD/libgd-2.2.5/tests'
PASS: tga/bug00248
make[3]: Leaving directory '/tmp/B.9vqE8A/BUILD/libgd-2.2.5/tests'
make[3]: Entering directory '/tmp/B.9vqE8A/BUILD/libgd-2.2.5/tests'
PASS: tga/bug00247a
make[3]: Leaving directory '/tmp/B.9vqE8A/BUILD/libgd-2.2.5/tests'
make[3]: Entering directory '/tmp/B.9vqE8A/BUILD/libgd-2.2.5/tests'
PASS: tga/bug00247
make[3]: Leaving directory '/tmp/B.9vqE8A/BUILD/libgd-2.2.5/tests'
make[3]: Entering directory '/tmp/B.9vqE8A/BUILD/libgd-2.2.5/tests'
PASS: tga/bug00248a
make[3]: Leaving directory '/tmp/B.9vqE8A/BUILD/libgd-2.2.5/tests'
make[3]: Entering directory '/tmp/B.9vqE8A/BUILD/libgd-2.2.5/tests'
PASS: tga/heap_overflow
make[3]: Leaving directory '/tmp/B.9vqE8A/BUILD/libgd-2.2.5/tests'
make[3]: Entering directory '/tmp/B.9vqE8A/BUILD/libgd-2.2.5/tests'
PASS: tga/tga_read
make[3]: Leaving directory '/tmp/B.9vqE8A/BUILD/libgd-2.2.5/tests'
make[3]: Entering directory '/tmp/B.9vqE8A/BUILD/libgd-2.2.5/tests'
PASS: tga/tga_null
make[3]: Leaving directory '/tmp/B.9vqE8A/BUILD/libgd-2.2.5/tests'
make[3]: Entering directory '/tmp/B.9vqE8A/BUILD/libgd-2.2.5/tests'
PASS: tiff/tiff_null
make[3]: Leaving directory '/tmp/B.9vqE8A/BUILD/libgd-2.2.5/tests'
make[3]: Entering directory '/tmp/B.9vqE8A/BUILD/libgd-2.2.5/tests'
PASS: tiff/tiff_invalid_read
make[3]: Leaving directory '/tmp/B.9vqE8A/BUILD/libgd-2.2.5/tests'
make[3]: Entering directory '/tmp/B.9vqE8A/BUILD/libgd-2.2.5/tests'
PASS: tiff/tiff_dpi
make[3]: Leaving directory '/tmp/B.9vqE8A/BUILD/libgd-2.2.5/tests'
make[3]: Entering directory '/tmp/B.9vqE8A/BUILD/libgd-2.2.5/tests'
PASS: tiff/tiff_im2im
make[3]: Leaving directory '/tmp/B.9vqE8A/BUILD/libgd-2.2.5/tests'
make[3]: Entering directory '/tmp/B.9vqE8A/BUILD/libgd-2.2.5/tests'
PASS: wbmp/wbmp_null
make[3]: Leaving directory '/tmp/B.9vqE8A/BUILD/libgd-2.2.5/tests'
make[3]: Entering directory '/tmp/B.9vqE8A/BUILD/libgd-2.2.5/tests'
PASS: wbmp/wbmp_im2im
make[3]: Leaving directory '/tmp/B.9vqE8A/BUILD/libgd-2.2.5/tests'
make[3]: Entering directory '/tmp/B.9vqE8A/BUILD/libgd-2.2.5/tests'
PASS: webp/bug00111
make[3]: Leaving directory '/tmp/B.9vqE8A/BUILD/libgd-2.2.5/tests'
make[3]: Entering directory '/tmp/B.9vqE8A/BUILD/libgd-2.2.5/tests'
PASS: tiff/tiff_read_bw
make[3]: Leaving directory '/tmp/B.9vqE8A/BUILD/libgd-2.2.5/tests'
make[3]: Entering directory '/tmp/B.9vqE8A/BUILD/libgd-2.2.5/tests'
PASS: xbm/x10_basic_read
make[3]: Leaving directory '/tmp/B.9vqE8A/BUILD/libgd-2.2.5/tests'
make[3]: Entering directory '/tmp/B.9vqE8A/BUILD/libgd-2.2.5/tests'
PASS: xbm/github_bug_109
make[3]: Leaving directory '/tmp/B.9vqE8A/BUILD/libgd-2.2.5/tests'
make[3]: Entering directory '/tmp/B.9vqE8A/BUILD/libgd-2.2.5/tests'
PASS: xbm/github_bug_170
make[3]: Leaving directory '/tmp/B.9vqE8A/BUILD/libgd-2.2.5/tests'
make[3]: Entering directory '/tmp/B.9vqE8A/BUILD/libgd-2.2.5/tests'
PASS: xpm/bug00185
make[3]: Leaving directory '/tmp/B.9vqE8A/BUILD/libgd-2.2.5/tests'
make[3]: Entering directory '/tmp/B.9vqE8A/BUILD/libgd-2.2.5/tests'
PASS: xpm/bug00166
make[3]: Leaving directory '/tmp/B.9vqE8A/BUILD/libgd-2.2.5/tests'
make[3]: Entering directory '/tmp/B.9vqE8A/BUILD/libgd-2.2.5/tests'
PASS: xpm/color_name
make[3]: Leaving directory '/tmp/B.9vqE8A/BUILD/libgd-2.2.5/tests'
make[3]: Entering directory '/tmp/B.9vqE8A/BUILD/libgd-2.2.5/tests'
PASS: webp/bug_double_free
make[3]: Leaving directory '/tmp/B.9vqE8A/BUILD/libgd-2.2.5/tests'
make[3]: Entering directory '/tmp/B.9vqE8A/BUILD/libgd-2.2.5/tests'
PASS: gdimageline/gdimageline_bug5
make[3]: Leaving directory '/tmp/B.9vqE8A/BUILD/libgd-2.2.5/tests'
make[3]: Entering directory '/tmp/B.9vqE8A/BUILD/libgd-2.2.5/tests'
============================================================================
Testsuite summary for GD 2.2.5
============================================================================
# TOTAL: 166
# PASS:  164
# SKIP:  0
# XFAIL: 1
# FAIL:  0
# XPASS: 1
# ERROR: 0
============================================================================
See tests/test-suite.log
Please report to https://github.com/libgd/libgd/issues
============================================================================
make[3]: *** [Makefile:4022: test-suite.log] Error 1
make[3]: Leaving directory '/tmp/B.9vqE8A/BUILD/libgd-2.2.5/tests'
make[2]: *** [Makefile:4130: check-TESTS] Error 2
make[1]: *** [Makefile:5356: check-am] Error 2
make: *** [Makefile:418: check-recursive] Error 1
error: Bad exit status from /tmp/B.9vqE8A/BUILD/tmp/rpm-tmp.76513 (%build)


RPM build errors:
    Bad exit status from /tmp/B.9vqE8A/BUILD/tmp/rpm-tmp.76513 (%build)
ended at: Wed Nov 29 21:20:38 2017, done in 0:01:28.784824
error: No files produced.
mesg: ttyname failed: Inappropriate ioctl for device
+ chmod -R u+rwX /tmp/B.9vqE8A/BUILD
+ rm -rf /tmp/B.9vqE8A/tmp /tmp/B.9vqE8A/BUILD
mesg: ttyname failed: Inappropriate ioctl for device
+ rm -rf /tmp/B.9vqE8A
Begin-PLD-Builder-Info
Build-Time: user:106.58s sys:77.44s real:99.78s (faults io:0 non-io:30984232)

End-PLD-Builder-Info
[Back to list of logs] [View rpm -qa of builder]