FailedOk

th/SRPMS[OK]
th/x32[OK]
th/i686[OK]
th/x86_64[OK]

ac/SRPMS[OK]
ac/i386[OK]
ac/i586[OK]
ac/i686[OK]
ac/alpha[OK]
ac/amd64[OK]
ac/athlon[OK]
ac/ppc[OK]
ac/sparc[OK]
ac/sparc64[OK]

Advanced Search
main()
Powered by PLD Linux
(c) 2002-2018 PLD Team
$Revision: 1.37 $
Powered by power.
Your IP: 52.91.245.237

gd 2a467d79-d8e5-45b9-b24d-81facab48d5e

Status:Failed
Source URL:ftp://buildlogs.pld-linux.org/th/x86_64/FAIL/gd,2a467d79-d8e5-45b9-b24d-81facab48d5e.bz2
text/plain URL:View!
full text:View!
rpm -qa of builder:View!
Date:2017/12/26 01:42:25
Runtime:0:01:26.870382

Toc:

  • error 1
  • XFAIL: gdimagestringft/gdimagestringft_bbox
  • error 2
  • # XFAIL: 1
  • error 3
  • # FAIL: 0
  • error 4
  • # ERROR: 0
  • error 5
  • make[3]: *** [Makefile:4022: test-suite.log] Error 1
  • error 6
  • make[2]: *** [Makefile:4130: check-TESTS] Error 2
  • error 7
  • make[1]: *** [Makefile:5356: check-am] Error 2
  • error 8
  • error: Bad exit status from /tmp/B._XMM9X/BUILD/tmp/rpm-tmp.32105 (%build)
  • error 9
  • RPM build errors:
  • error 10
  • error: No files produced.

Content:

PASS: gdimageline/bug00072
make[3]: Leaving directory '/tmp/B._XMM9X/BUILD/libgd-2.2.5/tests'
make[3]: Entering directory '/tmp/B._XMM9X/BUILD/libgd-2.2.5/tests'
PASS: gdimagefilter/gdCopyBlurred
make[3]: Leaving directory '/tmp/B._XMM9X/BUILD/libgd-2.2.5/tests'
make[3]: Entering directory '/tmp/B._XMM9X/BUILD/libgd-2.2.5/tests'
PASS: gdimageline/gdimageline_aa
make[3]: Leaving directory '/tmp/B._XMM9X/BUILD/libgd-2.2.5/tests'
make[3]: Entering directory '/tmp/B._XMM9X/BUILD/libgd-2.2.5/tests'
PASS: gdimageline/gdImageAALine_thickness
make[3]: Leaving directory '/tmp/B._XMM9X/BUILD/libgd-2.2.5/tests'
make[3]: Entering directory '/tmp/B._XMM9X/BUILD/libgd-2.2.5/tests'
PASS: gdimageline/github_bug_167
make[3]: Leaving directory '/tmp/B._XMM9X/BUILD/libgd-2.2.5/tests'
make[3]: Entering directory '/tmp/B._XMM9X/BUILD/libgd-2.2.5/tests'
PASS: gdimagenegate/basic
make[3]: Leaving directory '/tmp/B._XMM9X/BUILD/libgd-2.2.5/tests'
make[3]: Entering directory '/tmp/B._XMM9X/BUILD/libgd-2.2.5/tests'
PASS: gdimageopenpolygon/gdimageopenpolygon2
make[3]: Leaving directory '/tmp/B._XMM9X/BUILD/libgd-2.2.5/tests'
make[3]: Entering directory '/tmp/B._XMM9X/BUILD/libgd-2.2.5/tests'
PASS: gdimageopenpolygon/gdimageopenpolygon1
make[3]: Leaving directory '/tmp/B._XMM9X/BUILD/libgd-2.2.5/tests'
make[3]: Entering directory '/tmp/B._XMM9X/BUILD/libgd-2.2.5/tests'
PASS: gdimageopenpolygon/gdimageopenpolygon0
make[3]: Leaving directory '/tmp/B._XMM9X/BUILD/libgd-2.2.5/tests'
make[3]: Entering directory '/tmp/B._XMM9X/BUILD/libgd-2.2.5/tests'
PASS: gdimageopenpolygon/gdimageopenpolygon3
make[3]: Leaving directory '/tmp/B._XMM9X/BUILD/libgd-2.2.5/tests'
make[3]: Entering directory '/tmp/B._XMM9X/BUILD/libgd-2.2.5/tests'
PASS: gdimagepixelate/gdimagepixelate
make[3]: Leaving directory '/tmp/B._XMM9X/BUILD/libgd-2.2.5/tests'
make[3]: Entering directory '/tmp/B._XMM9X/BUILD/libgd-2.2.5/tests'
PASS: gdimagepolygon/gdimagepolygon0
make[3]: Leaving directory '/tmp/B._XMM9X/BUILD/libgd-2.2.5/tests'
make[3]: Entering directory '/tmp/B._XMM9X/BUILD/libgd-2.2.5/tests'
PASS: gdimagepolygon/gdimagepolygon1
make[3]: Leaving directory '/tmp/B._XMM9X/BUILD/libgd-2.2.5/tests'
make[3]: Entering directory '/tmp/B._XMM9X/BUILD/libgd-2.2.5/tests'
PASS: gdimagepolygon/gdimagepolygon2
make[3]: Leaving directory '/tmp/B._XMM9X/BUILD/libgd-2.2.5/tests'
make[3]: Entering directory '/tmp/B._XMM9X/BUILD/libgd-2.2.5/tests'
PASS: gdimagepolygon/gdimagepolygon3
make[3]: Leaving directory '/tmp/B._XMM9X/BUILD/libgd-2.2.5/tests'
make[3]: Entering directory '/tmp/B._XMM9X/BUILD/libgd-2.2.5/tests'
PASS: gdimagerectangle/bug00003
make[3]: Leaving directory '/tmp/B._XMM9X/BUILD/libgd-2.2.5/tests'
make[3]: Entering directory '/tmp/B._XMM9X/BUILD/libgd-2.2.5/tests'
PASS: gdimagerectangle/bug00106_gdimagerectangle
make[3]: Leaving directory '/tmp/B._XMM9X/BUILD/libgd-2.2.5/tests'
make[3]: Entering directory '/tmp/B._XMM9X/BUILD/libgd-2.2.5/tests'
PASS: gdimagerectangle/github_bug_00172
make[3]: Leaving directory '/tmp/B._XMM9X/BUILD/libgd-2.2.5/tests'
make[3]: Entering directory '/tmp/B._XMM9X/BUILD/libgd-2.2.5/tests'
PASS: gdimagerectangle/point_ordering
make[3]: Leaving directory '/tmp/B._XMM9X/BUILD/libgd-2.2.5/tests'
make[3]: Entering directory '/tmp/B._XMM9X/BUILD/libgd-2.2.5/tests'
PASS: gdimagerectangle/bug00299
make[3]: Leaving directory '/tmp/B._XMM9X/BUILD/libgd-2.2.5/tests'
make[3]: Entering directory '/tmp/B._XMM9X/BUILD/libgd-2.2.5/tests'
PASS: gdimagerotate/php_bug_65070
make[3]: Leaving directory '/tmp/B._XMM9X/BUILD/libgd-2.2.5/tests'
make[3]: Entering directory '/tmp/B._XMM9X/BUILD/libgd-2.2.5/tests'
PASS: gdimagerotate/php_bug_64898
make[3]: Leaving directory '/tmp/B._XMM9X/BUILD/libgd-2.2.5/tests'
make[3]: Entering directory '/tmp/B._XMM9X/BUILD/libgd-2.2.5/tests'
PASS: gdimagerotate/bug00067
make[3]: Leaving directory '/tmp/B._XMM9X/BUILD/libgd-2.2.5/tests'
make[3]: Entering directory '/tmp/B._XMM9X/BUILD/libgd-2.2.5/tests'
PASS: gdimagescale/bug00329
make[3]: Leaving directory '/tmp/B._XMM9X/BUILD/libgd-2.2.5/tests'
make[3]: Entering directory '/tmp/B._XMM9X/BUILD/libgd-2.2.5/tests'
PASS: gdimagescale/bug00330
make[3]: Leaving directory '/tmp/B._XMM9X/BUILD/libgd-2.2.5/tests'
make[3]: Entering directory '/tmp/B._XMM9X/BUILD/libgd-2.2.5/tests'
PASS: gdimagescale/github_bug_00218
make[3]: Leaving directory '/tmp/B._XMM9X/BUILD/libgd-2.2.5/tests'
make[3]: Entering directory '/tmp/B._XMM9X/BUILD/libgd-2.2.5/tests'
PASS: gdimagescale/bug_overflow_large_new_size
make[3]: Leaving directory '/tmp/B._XMM9X/BUILD/libgd-2.2.5/tests'
make[3]: Entering directory '/tmp/B._XMM9X/BUILD/libgd-2.2.5/tests'
PASS: gdimagescatterex/bug00208_1
make[3]: Leaving directory '/tmp/B._XMM9X/BUILD/libgd-2.2.5/tests'
make[3]: Entering directory '/tmp/B._XMM9X/BUILD/libgd-2.2.5/tests'
PASS: gdimagescatterex/bug00208_2
make[3]: Leaving directory '/tmp/B._XMM9X/BUILD/libgd-2.2.5/tests'
make[3]: Entering directory '/tmp/B._XMM9X/BUILD/libgd-2.2.5/tests'
PASS: gdimagesetpixel/bug00186
make[3]: Leaving directory '/tmp/B._XMM9X/BUILD/libgd-2.2.5/tests'
make[3]: Entering directory '/tmp/B._XMM9X/BUILD/libgd-2.2.5/tests'
PASS: gdimagesetpixel/gdeffectoverlay
make[3]: Leaving directory '/tmp/B._XMM9X/BUILD/libgd-2.2.5/tests'
make[3]: Entering directory '/tmp/B._XMM9X/BUILD/libgd-2.2.5/tests'
PASS: gdimagesetpixel/gdeffectmultiply
make[3]: Leaving directory '/tmp/B._XMM9X/BUILD/libgd-2.2.5/tests'
make[3]: Entering directory '/tmp/B._XMM9X/BUILD/libgd-2.2.5/tests'
PASS: gdimagesetpixel/alpha_blending
make[3]: Leaving directory '/tmp/B._XMM9X/BUILD/libgd-2.2.5/tests'
make[3]: Entering directory '/tmp/B._XMM9X/BUILD/libgd-2.2.5/tests'
XFAIL: gdimagestringft/gdimagestringft_bbox
make[3]: Leaving directory '/tmp/B._XMM9X/BUILD/libgd-2.2.5/tests'
make[3]: Entering directory '/tmp/B._XMM9X/BUILD/libgd-2.2.5/tests'
PASS: gdimagestringftex/gdimagestringftex_returnfontpathname
make[3]: Leaving directory '/tmp/B._XMM9X/BUILD/libgd-2.2.5/tests'
make[3]: Entering directory '/tmp/B._XMM9X/BUILD/libgd-2.2.5/tests'
PASS: gdimagetruecolortopalette/bug00307
make[3]: Leaving directory '/tmp/B._XMM9X/BUILD/libgd-2.2.5/tests'
make[3]: Entering directory '/tmp/B._XMM9X/BUILD/libgd-2.2.5/tests'
PASS: gdimagetruecolortopalette/php_bug_72512
make[3]: Leaving directory '/tmp/B._XMM9X/BUILD/libgd-2.2.5/tests'
make[3]: Entering directory '/tmp/B._XMM9X/BUILD/libgd-2.2.5/tests'
PASS: gdimagetruecolortopalette/php_bug_67325
make[3]: Leaving directory '/tmp/B._XMM9X/BUILD/libgd-2.2.5/tests'
make[3]: Entering directory '/tmp/B._XMM9X/BUILD/libgd-2.2.5/tests'
PASS: gdinterpolatedscale/gdModesAndPalettes
make[3]: Leaving directory '/tmp/B._XMM9X/BUILD/libgd-2.2.5/tests'
make[3]: Entering directory '/tmp/B._XMM9X/BUILD/libgd-2.2.5/tests'
PASS: gdnewfilectx/gdnewfilectx_null
make[3]: Leaving directory '/tmp/B._XMM9X/BUILD/libgd-2.2.5/tests'
make[3]: Entering directory '/tmp/B._XMM9X/BUILD/libgd-2.2.5/tests'
PASS: gdtransformaffineboundingbox/github_bug_00221
make[3]: Leaving directory '/tmp/B._XMM9X/BUILD/libgd-2.2.5/tests'
make[3]: Entering directory '/tmp/B._XMM9X/BUILD/libgd-2.2.5/tests'
PASS: gdtiled/bug00032
make[3]: Leaving directory '/tmp/B._XMM9X/BUILD/libgd-2.2.5/tests'
make[3]: Entering directory '/tmp/B._XMM9X/BUILD/libgd-2.2.5/tests'
PASS: gif/bug00005_2
make[3]: Leaving directory '/tmp/B._XMM9X/BUILD/libgd-2.2.5/tests'
make[3]: Entering directory '/tmp/B._XMM9X/BUILD/libgd-2.2.5/tests'
PASS: gif/bug00227
make[3]: Leaving directory '/tmp/B._XMM9X/BUILD/libgd-2.2.5/tests'
make[3]: Entering directory '/tmp/B._XMM9X/BUILD/libgd-2.2.5/tests'
PASS: gif/bug00181
make[3]: Leaving directory '/tmp/B._XMM9X/BUILD/libgd-2.2.5/tests'
make[3]: Entering directory '/tmp/B._XMM9X/BUILD/libgd-2.2.5/tests'
PASS: gif/gif_null
make[3]: Leaving directory '/tmp/B._XMM9X/BUILD/libgd-2.2.5/tests'
make[3]: Entering directory '/tmp/B._XMM9X/BUILD/libgd-2.2.5/tests'
PASS: gif/bug00005
make[3]: Leaving directory '/tmp/B._XMM9X/BUILD/libgd-2.2.5/tests'
make[3]: Entering directory '/tmp/B._XMM9X/BUILD/libgd-2.2.5/tests'
PASS: gif/uninitialized_memory_read
make[3]: Leaving directory '/tmp/B._XMM9X/BUILD/libgd-2.2.5/tests'
make[3]: Entering directory '/tmp/B._XMM9X/BUILD/libgd-2.2.5/tests'
PASS: gif/bug00006
make[3]: Leaving directory '/tmp/B._XMM9X/BUILD/libgd-2.2.5/tests'
make[3]: Entering directory '/tmp/B._XMM9X/BUILD/libgd-2.2.5/tests'
PASS: gif/bug00060
make[3]: Leaving directory '/tmp/B._XMM9X/BUILD/libgd-2.2.5/tests'
make[3]: Entering directory '/tmp/B._XMM9X/BUILD/libgd-2.2.5/tests'
PASS: gif/bug00066
make[3]: Leaving directory '/tmp/B._XMM9X/BUILD/libgd-2.2.5/tests'
make[3]: Entering directory '/tmp/B._XMM9X/BUILD/libgd-2.2.5/tests'
PASS: gif/gif_im2im
make[3]: Leaving directory '/tmp/B._XMM9X/BUILD/libgd-2.2.5/tests'
make[3]: Entering directory '/tmp/B._XMM9X/BUILD/libgd-2.2.5/tests'
PASS: jpeg/jpeg_empty_file
make[3]: Leaving directory '/tmp/B._XMM9X/BUILD/libgd-2.2.5/tests'
make[3]: Entering directory '/tmp/B._XMM9X/BUILD/libgd-2.2.5/tests'
PASS: jpeg/jpeg_null
make[3]: Leaving directory '/tmp/B._XMM9X/BUILD/libgd-2.2.5/tests'
make[3]: Entering directory '/tmp/B._XMM9X/BUILD/libgd-2.2.5/tests'
PASS: jpeg/jpeg_im2im
make[3]: Leaving directory '/tmp/B._XMM9X/BUILD/libgd-2.2.5/tests'
make[3]: Entering directory '/tmp/B._XMM9X/BUILD/libgd-2.2.5/tests'
PASS: jpeg/bug_github_18
make[3]: Leaving directory '/tmp/B._XMM9X/BUILD/libgd-2.2.5/tests'
make[3]: Entering directory '/tmp/B._XMM9X/BUILD/libgd-2.2.5/tests'
PASS: jpeg/bug00338
make[3]: Leaving directory '/tmp/B._XMM9X/BUILD/libgd-2.2.5/tests'
make[3]: Entering directory '/tmp/B._XMM9X/BUILD/libgd-2.2.5/tests'
PASS: jpeg/jpeg_read
make[3]: Leaving directory '/tmp/B._XMM9X/BUILD/libgd-2.2.5/tests'
make[3]: Entering directory '/tmp/B._XMM9X/BUILD/libgd-2.2.5/tests'
PASS: jpeg/jpeg_resolution
make[3]: Leaving directory '/tmp/B._XMM9X/BUILD/libgd-2.2.5/tests'
make[3]: Entering directory '/tmp/B._XMM9X/BUILD/libgd-2.2.5/tests'
PASS: gdinterpolatedscale/gdTrivialResize
make[3]: Leaving directory '/tmp/B._XMM9X/BUILD/libgd-2.2.5/tests'
make[3]: Entering directory '/tmp/B._XMM9X/BUILD/libgd-2.2.5/tests'
PASS: png/bug00086
make[3]: Leaving directory '/tmp/B._XMM9X/BUILD/libgd-2.2.5/tests'
make[3]: Entering directory '/tmp/B._XMM9X/BUILD/libgd-2.2.5/tests'
PASS: png/bug00033
make[3]: Leaving directory '/tmp/B._XMM9X/BUILD/libgd-2.2.5/tests'
make[3]: Entering directory '/tmp/B._XMM9X/BUILD/libgd-2.2.5/tests'
PASS: png/bug00011
make[3]: Leaving directory '/tmp/B._XMM9X/BUILD/libgd-2.2.5/tests'
make[3]: Entering directory '/tmp/B._XMM9X/BUILD/libgd-2.2.5/tests'
PASS: png/bug00338
make[3]: Leaving directory '/tmp/B._XMM9X/BUILD/libgd-2.2.5/tests'
make[3]: Entering directory '/tmp/B._XMM9X/BUILD/libgd-2.2.5/tests'
PASS: png/bug00193
make[3]: Leaving directory '/tmp/B._XMM9X/BUILD/libgd-2.2.5/tests'
make[3]: Entering directory '/tmp/B._XMM9X/BUILD/libgd-2.2.5/tests'
PASS: png/bug00088
make[3]: Leaving directory '/tmp/B._XMM9X/BUILD/libgd-2.2.5/tests'
make[3]: Entering directory '/tmp/B._XMM9X/BUILD/libgd-2.2.5/tests'
PASS: png/bug00381_1
make[3]: Leaving directory '/tmp/B._XMM9X/BUILD/libgd-2.2.5/tests'
make[3]: Entering directory '/tmp/B._XMM9X/BUILD/libgd-2.2.5/tests'
PASS: png/bug00381_2
make[3]: Leaving directory '/tmp/B._XMM9X/BUILD/libgd-2.2.5/tests'
make[3]: Entering directory '/tmp/B._XMM9X/BUILD/libgd-2.2.5/tests'
PASS: png/png_im2im
make[3]: Leaving directory '/tmp/B._XMM9X/BUILD/libgd-2.2.5/tests'
make[3]: Entering directory '/tmp/B._XMM9X/BUILD/libgd-2.2.5/tests'
PASS: png/png_null
make[3]: Leaving directory '/tmp/B._XMM9X/BUILD/libgd-2.2.5/tests'
make[3]: Entering directory '/tmp/B._XMM9X/BUILD/libgd-2.2.5/tests'
PASS: tga/bug00247a
make[3]: Leaving directory '/tmp/B._XMM9X/BUILD/libgd-2.2.5/tests'
make[3]: Entering directory '/tmp/B._XMM9X/BUILD/libgd-2.2.5/tests'
PASS: png/png_resolution
make[3]: Leaving directory '/tmp/B._XMM9X/BUILD/libgd-2.2.5/tests'
make[3]: Entering directory '/tmp/B._XMM9X/BUILD/libgd-2.2.5/tests'
PASS: tga/bug00084
make[3]: Leaving directory '/tmp/B._XMM9X/BUILD/libgd-2.2.5/tests'
make[3]: Entering directory '/tmp/B._XMM9X/BUILD/libgd-2.2.5/tests'
PASS: tga/bug00247
make[3]: Leaving directory '/tmp/B._XMM9X/BUILD/libgd-2.2.5/tests'
make[3]: Entering directory '/tmp/B._XMM9X/BUILD/libgd-2.2.5/tests'
PASS: tga/bug00248a
make[3]: Leaving directory '/tmp/B._XMM9X/BUILD/libgd-2.2.5/tests'
make[3]: Entering directory '/tmp/B._XMM9X/BUILD/libgd-2.2.5/tests'
PASS: tga/bug00248
make[3]: Leaving directory '/tmp/B._XMM9X/BUILD/libgd-2.2.5/tests'
make[3]: Entering directory '/tmp/B._XMM9X/BUILD/libgd-2.2.5/tests'
PASS: tga/heap_overflow
make[3]: Leaving directory '/tmp/B._XMM9X/BUILD/libgd-2.2.5/tests'
make[3]: Entering directory '/tmp/B._XMM9X/BUILD/libgd-2.2.5/tests'
PASS: tga/tga_null
make[3]: Leaving directory '/tmp/B._XMM9X/BUILD/libgd-2.2.5/tests'
make[3]: Entering directory '/tmp/B._XMM9X/BUILD/libgd-2.2.5/tests'
PASS: tga/tga_read
make[3]: Leaving directory '/tmp/B._XMM9X/BUILD/libgd-2.2.5/tests'
make[3]: Entering directory '/tmp/B._XMM9X/BUILD/libgd-2.2.5/tests'
PASS: tiff/tiff_null
make[3]: Leaving directory '/tmp/B._XMM9X/BUILD/libgd-2.2.5/tests'
make[3]: Entering directory '/tmp/B._XMM9X/BUILD/libgd-2.2.5/tests'
PASS: tiff/tiff_dpi
make[3]: Leaving directory '/tmp/B._XMM9X/BUILD/libgd-2.2.5/tests'
make[3]: Entering directory '/tmp/B._XMM9X/BUILD/libgd-2.2.5/tests'
PASS: tiff/tiff_im2im
make[3]: Leaving directory '/tmp/B._XMM9X/BUILD/libgd-2.2.5/tests'
make[3]: Entering directory '/tmp/B._XMM9X/BUILD/libgd-2.2.5/tests'
PASS: tiff/tiff_invalid_read
make[3]: Leaving directory '/tmp/B._XMM9X/BUILD/libgd-2.2.5/tests'
make[3]: Entering directory '/tmp/B._XMM9X/BUILD/libgd-2.2.5/tests'
PASS: wbmp/wbmp_null
make[3]: Leaving directory '/tmp/B._XMM9X/BUILD/libgd-2.2.5/tests'
make[3]: Entering directory '/tmp/B._XMM9X/BUILD/libgd-2.2.5/tests'
PASS: tiff/tiff_read_bw
make[3]: Leaving directory '/tmp/B._XMM9X/BUILD/libgd-2.2.5/tests'
make[3]: Entering directory '/tmp/B._XMM9X/BUILD/libgd-2.2.5/tests'
PASS: wbmp/wbmp_im2im
make[3]: Leaving directory '/tmp/B._XMM9X/BUILD/libgd-2.2.5/tests'
make[3]: Entering directory '/tmp/B._XMM9X/BUILD/libgd-2.2.5/tests'
PASS: webp/bug00111
make[3]: Leaving directory '/tmp/B._XMM9X/BUILD/libgd-2.2.5/tests'
make[3]: Entering directory '/tmp/B._XMM9X/BUILD/libgd-2.2.5/tests'
PASS: xbm/github_bug_109
make[3]: Leaving directory '/tmp/B._XMM9X/BUILD/libgd-2.2.5/tests'
make[3]: Entering directory '/tmp/B._XMM9X/BUILD/libgd-2.2.5/tests'
PASS: xbm/github_bug_170
make[3]: Leaving directory '/tmp/B._XMM9X/BUILD/libgd-2.2.5/tests'
make[3]: Entering directory '/tmp/B._XMM9X/BUILD/libgd-2.2.5/tests'
PASS: xpm/bug00166
make[3]: Leaving directory '/tmp/B._XMM9X/BUILD/libgd-2.2.5/tests'
make[3]: Entering directory '/tmp/B._XMM9X/BUILD/libgd-2.2.5/tests'
PASS: xbm/x10_basic_read
make[3]: Leaving directory '/tmp/B._XMM9X/BUILD/libgd-2.2.5/tests'
make[3]: Entering directory '/tmp/B._XMM9X/BUILD/libgd-2.2.5/tests'
PASS: xpm/bug00185
make[3]: Leaving directory '/tmp/B._XMM9X/BUILD/libgd-2.2.5/tests'
make[3]: Entering directory '/tmp/B._XMM9X/BUILD/libgd-2.2.5/tests'
PASS: xpm/color_name
make[3]: Leaving directory '/tmp/B._XMM9X/BUILD/libgd-2.2.5/tests'
make[3]: Entering directory '/tmp/B._XMM9X/BUILD/libgd-2.2.5/tests'
PASS: webp/bug_double_free
make[3]: Leaving directory '/tmp/B._XMM9X/BUILD/libgd-2.2.5/tests'
make[3]: Entering directory '/tmp/B._XMM9X/BUILD/libgd-2.2.5/tests'
PASS: gdimageline/gdimageline_bug5
make[3]: Leaving directory '/tmp/B._XMM9X/BUILD/libgd-2.2.5/tests'
make[3]: Entering directory '/tmp/B._XMM9X/BUILD/libgd-2.2.5/tests'
============================================================================
Testsuite summary for GD 2.2.5
============================================================================
# TOTAL: 166
# PASS:  164
# SKIP:  0
# XFAIL: 1
# FAIL:  0
# XPASS: 1
# ERROR: 0
============================================================================
See tests/test-suite.log
Please report to https://github.com/libgd/libgd/issues
============================================================================
make[3]: *** [Makefile:4022: test-suite.log] Error 1
make[3]: Leaving directory '/tmp/B._XMM9X/BUILD/libgd-2.2.5/tests'
make[2]: *** [Makefile:4130: check-TESTS] Error 2
make[1]: *** [Makefile:5356: check-am] Error 2
make: *** [Makefile:418: check-recursive] Error 1
error: Bad exit status from /tmp/B._XMM9X/BUILD/tmp/rpm-tmp.32105 (%build)


RPM build errors:
    Bad exit status from /tmp/B._XMM9X/BUILD/tmp/rpm-tmp.32105 (%build)
ended at: Tue Dec 26 01:42:24 2017, done in 0:01:26.870382
error: No files produced.
mesg: ttyname failed: Inappropriate ioctl for device
+ chmod -R u+rwX /tmp/B._XMM9X/BUILD
+ rm -rf /tmp/B._XMM9X/tmp /tmp/B._XMM9X/BUILD
mesg: ttyname failed: Inappropriate ioctl for device
+ rm -rf /tmp/B._XMM9X
Begin-PLD-Builder-Info
Build-Time: user:104.03s sys:77.17s real:91.68s (faults io:1 non-io:30972768)

End-PLD-Builder-Info
[Back to list of logs] [View rpm -qa of builder]