FailedOk

th/SRPMS[OK]
th/x32[OK]
th/i686[OK]
th/x86_64[OK]

ac/SRPMS[OK]
ac/i386[OK]
ac/i586[OK]
ac/i686[OK]
ac/alpha[OK]
ac/amd64[OK]
ac/athlon[OK]
ac/ppc[OK]
ac/sparc[OK]
ac/sparc64[OK]

Advanced Search
main()
Powered by PLD Linux
(c) 2002-2020 PLD Team
$Revision: 1.37 $
Powered by BOFH.
Your IP: 3.237.66.86

gdal 8a3fc358-957a-4be0-9cc5-812e54e1359b

Status:Failed
Source URL:https://buildlogs.pld-linux.org/pld/th/x86_64/FAIL/gdal,8a3fc358-957a-4be0-9cc5-812e54e1359b.bz2
text/plain URL:View!
full text:View!
rpm -qa of builder:View!
Date:2020/11/22 00:56:47
Runtime:0:11:55.505735

Toc:

  • error 1
  • jpeg2000dataset.cpp:611:46: error: invalid conversion from 'const char*' to 'char*' [-fpermissive]
  • error 2
  • make[2]: *** [../../GDALmake.opt:637: ../o/jpeg2000dataset.lo] Error 1
  • error 3
  • make[1]: *** [GNUmakefile:15: jpeg2000-install-obj] Error 2
  • error 4
  • /usr/include/ecs.h:9:10: fatal error: rpc/rpc.h: No such file or directory
  • error 5
  • compilation terminated.
  • error 6
  • make[3]: *** [../../../GDALmake.opt:637: ../o/ogrogdidriver.lo] Error 1
  • error 7
  • make[2]: *** [../../GDALmake.opt:650: ogdi-target] Error 2
  • error 8
  • make[1]: *** [GNUmakefile:58: sublibs] Error 2
  • error 9
  • error: Bad exit status from /tmp/B.lZJ7wH/BUILD/tmp/rpm-tmp.95903 (%build)
  • error 10
  • RPM build errors:
  • error 11
  • error: No files produced.

Content:

make[3]: Leaving directory '/tmp/B.lZJ7wH/BUILD/gdal-3.0.4/ogr/ogrsf_frmts/carto'
make[3]: Entering directory '/tmp/B.lZJ7wH/BUILD/gdal-3.0.4/ogr/ogrsf_frmts/walk'
/bin/sh /tmp/B.lZJ7wH/BUILD/gdal-3.0.4/libtool --mode=compile --silent --tag=CXX x86_64-pld-linux-g++ -I/tmp/B.lZJ7wH/BUILD/gdal-3.0.4/port -I/tmp/B.lZJ7wH/BUILD/gdal-3.0.4/gcore -I/tmp/B.lZJ7wH/BUILD/gdal-3.0.4/alg -I/tmp/B.lZJ7wH/BUILD/gdal-3.0.4/ogr -I/tmp/B.lZJ7wH/BUILD/gdal-3.0.4/ogr/ogrsf_frmts -I/tmp/B.lZJ7wH/BUILD/gdal-3.0.4/gnm -I/tmp/B.lZJ7wH/BUILD/gdal-3.0.4/apps -DHAVE_AVX_AT_COMPILE_TIME -DHAVE_SSSE3_AT_COMPILE_TIME -DHAVE_SSE_AT_COMPILE_TIME -O2 -fwrapv -pipe -Wformat -Werror=format-security -gdwarf-4 -fno-debug-types-section -fvar-tracking-assignments -g2 -Wp,-D_FORTIFY_SOURCE=2 -fstack-protector-strong --param=ssp-buffer-size=4 -Werror=trampolines -fPIC -march=x86-64 -gdwarf-4 -fno-debug-types-section -fvar-tracking-assignments -g2  -fvisibility=hidden  -Wall -Wextra -Winit-self -Wunused-parameter -Wformat -Werror=format-security -Wno-format-nonliteral -Wlogical-op -Wshadow -Werror=vla -Wdate-time -Wnull-dereference -Wduplicated-cond -Wextra-semi -Wfloat-conversion -Wmissing-declarations -Wnon-virtual-dtor -Woverloaded-virtual -fno-operator-names -Wzero-as-null-pointer-constant -Wsuggest-override -Wimplicit-fallthrough  -I.. -I../.. -I../generic -I../pgeo  -DGNM_ENABLED -I/tmp/B.lZJ7wH/BUILD/gdal-3.0.4/port -I/usr/include/openjpeg-2.3 -I/usr/include  -DGDAL_COMPILATION -DHAVE_XERCES -I/usr/include -I/usr/include/xercesc -I/tmp/B.lZJ7wH/BUILD/gdal-3.0.4/port -I/usr/include/openjpeg-2.3 -I/usr/include  -DGDAL_COMPILATION -c -o ../o/ogrwalkselectlayer.lo ogrwalkselectlayer.cpp
make[3]: Leaving directory '/tmp/B.lZJ7wH/BUILD/gdal-3.0.4/ogr/ogrsf_frmts/walk'
make[3]: Entering directory '/tmp/B.lZJ7wH/BUILD/gdal-3.0.4/ogr/ogrsf_frmts/geomedia'
/bin/sh /tmp/B.lZJ7wH/BUILD/gdal-3.0.4/libtool --mode=compile --silent --tag=CXX x86_64-pld-linux-g++ -I/tmp/B.lZJ7wH/BUILD/gdal-3.0.4/port -I/tmp/B.lZJ7wH/BUILD/gdal-3.0.4/gcore -I/tmp/B.lZJ7wH/BUILD/gdal-3.0.4/alg -I/tmp/B.lZJ7wH/BUILD/gdal-3.0.4/ogr -I/tmp/B.lZJ7wH/BUILD/gdal-3.0.4/ogr/ogrsf_frmts -I/tmp/B.lZJ7wH/BUILD/gdal-3.0.4/gnm -I/tmp/B.lZJ7wH/BUILD/gdal-3.0.4/apps -DHAVE_AVX_AT_COMPILE_TIME -DHAVE_SSSE3_AT_COMPILE_TIME -DHAVE_SSE_AT_COMPILE_TIME -O2 -fwrapv -pipe -Wformat -Werror=format-security -gdwarf-4 -fno-debug-types-section -fvar-tracking-assignments -g2 -Wp,-D_FORTIFY_SOURCE=2 -fstack-protector-strong --param=ssp-buffer-size=4 -Werror=trampolines -fPIC -march=x86-64 -gdwarf-4 -fno-debug-types-section -fvar-tracking-assignments -g2  -fvisibility=hidden  -Wall -Wextra -Winit-self -Wunused-parameter -Wformat -Werror=format-security -Wno-format-nonliteral -Wlogical-op -Wshadow -Werror=vla -Wdate-time -Wnull-dereference -Wduplicated-cond -Wextra-semi -Wfloat-conversion -Wmissing-declarations -Wnon-virtual-dtor -Woverloaded-virtual -fno-operator-names -Wzero-as-null-pointer-constant -Wsuggest-override -Wimplicit-fallthrough  -I.. -I../.. -I../pgeo -DGNM_ENABLED -I/tmp/B.lZJ7wH/BUILD/gdal-3.0.4/port -I/usr/include/openjpeg-2.3 -I/usr/include  -DGDAL_COMPILATION -DHAVE_XERCES -I/usr/include -I/usr/include/xercesc -I/tmp/B.lZJ7wH/BUILD/gdal-3.0.4/port -I/usr/include/openjpeg-2.3 -I/usr/include  -DGDAL_COMPILATION -c -o ../o/ogrgeomediaselectlayer.lo ogrgeomediaselectlayer.cpp
make[3]: Leaving directory '/tmp/B.lZJ7wH/BUILD/gdal-3.0.4/ogr/ogrsf_frmts/geomedia'
/usr/bin/make -C cloudant
make[3]: Entering directory '/tmp/B.lZJ7wH/BUILD/gdal-3.0.4/ogr/ogrsf_frmts/mssqlspatial'
/bin/sh /tmp/B.lZJ7wH/BUILD/gdal-3.0.4/libtool --mode=compile --silent --tag=CXX x86_64-pld-linux-g++ -I/tmp/B.lZJ7wH/BUILD/gdal-3.0.4/port -I/tmp/B.lZJ7wH/BUILD/gdal-3.0.4/gcore -I/tmp/B.lZJ7wH/BUILD/gdal-3.0.4/alg -I/tmp/B.lZJ7wH/BUILD/gdal-3.0.4/ogr -I/tmp/B.lZJ7wH/BUILD/gdal-3.0.4/ogr/ogrsf_frmts -I/tmp/B.lZJ7wH/BUILD/gdal-3.0.4/gnm -I/tmp/B.lZJ7wH/BUILD/gdal-3.0.4/apps -DHAVE_AVX_AT_COMPILE_TIME -DHAVE_SSSE3_AT_COMPILE_TIME -DHAVE_SSE_AT_COMPILE_TIME -O2 -fwrapv -pipe -Wformat -Werror=format-security -gdwarf-4 -fno-debug-types-section -fvar-tracking-assignments -g2 -Wp,-D_FORTIFY_SOURCE=2 -fstack-protector-strong --param=ssp-buffer-size=4 -Werror=trampolines -fPIC -march=x86-64 -gdwarf-4 -fno-debug-types-section -fvar-tracking-assignments -g2  -fvisibility=hidden  -Wall -Wextra -Winit-self -Wunused-parameter -Wformat -Werror=format-security -Wno-format-nonliteral -Wlogical-op -Wshadow -Werror=vla -Wdate-time -Wnull-dereference -Wduplicated-cond -Wextra-semi -Wfloat-conversion -Wmissing-declarations -Wnon-virtual-dtor -Woverloaded-virtual -fno-operator-names -Wzero-as-null-pointer-constant -Wsuggest-override -Wimplicit-fallthrough  -I.. -I../.. -DGNM_ENABLED -I/tmp/B.lZJ7wH/BUILD/gdal-3.0.4/port -I/usr/include/openjpeg-2.3 -I/usr/include  -DGDAL_COMPILATION -DHAVE_XERCES -I/usr/include -I/usr/include/xercesc -I/tmp/B.lZJ7wH/BUILD/gdal-3.0.4/port -I/usr/include/openjpeg-2.3 -I/usr/include  -DGDAL_COMPILATION -c -o ../o/ogrmssqlgeometrywriter.lo ogrmssqlgeometrywriter.cpp
make[3]: Leaving directory '/tmp/B.lZJ7wH/BUILD/gdal-3.0.4/ogr/ogrsf_frmts/mssqlspatial'
make[2]: Entering directory '/tmp/B.lZJ7wH/BUILD/gdal-3.0.4/frmts/rasterlite'
/bin/sh /tmp/B.lZJ7wH/BUILD/gdal-3.0.4/libtool --mode=compile --silent --tag=CXX x86_64-pld-linux-g++ -I/tmp/B.lZJ7wH/BUILD/gdal-3.0.4/port -I/tmp/B.lZJ7wH/BUILD/gdal-3.0.4/gcore -I/tmp/B.lZJ7wH/BUILD/gdal-3.0.4/alg -I/tmp/B.lZJ7wH/BUILD/gdal-3.0.4/ogr -I/tmp/B.lZJ7wH/BUILD/gdal-3.0.4/ogr/ogrsf_frmts -I/tmp/B.lZJ7wH/BUILD/gdal-3.0.4/gnm -I/tmp/B.lZJ7wH/BUILD/gdal-3.0.4/apps -DHAVE_AVX_AT_COMPILE_TIME -DHAVE_SSSE3_AT_COMPILE_TIME -DHAVE_SSE_AT_COMPILE_TIME -O2 -fwrapv -pipe -Wformat -Werror=format-security -gdwarf-4 -fno-debug-types-section -fvar-tracking-assignments -g2 -Wp,-D_FORTIFY_SOURCE=2 -fstack-protector-strong --param=ssp-buffer-size=4 -Werror=trampolines -fPIC -march=x86-64 -gdwarf-4 -fno-debug-types-section -fvar-tracking-assignments -g2  -fvisibility=hidden  -Wall -Wextra -Winit-self -Wunused-parameter -Wformat -Werror=format-security -Wno-format-nonliteral -Wlogical-op -Wshadow -Werror=vla -Wdate-time -Wnull-dereference -Wduplicated-cond -Wextra-semi -Wfloat-conversion -Wmissing-declarations -Wnon-virtual-dtor -Woverloaded-virtual -fno-operator-names -Wzero-as-null-pointer-constant -Wsuggest-override -Wimplicit-fallthrough  -DGNM_ENABLED -I/tmp/B.lZJ7wH/BUILD/gdal-3.0.4/port -I/usr/include/openjpeg-2.3 -I/usr/include  -DGDAL_COMPILATION -DHAVE_XERCES -I/usr/include -I/usr/include/xercesc -I/tmp/B.lZJ7wH/BUILD/gdal-3.0.4/port -I/usr/include/openjpeg-2.3 -I/usr/include  -DGDAL_COMPILATION -I../../ogr -c -o ../o/rasterlitedataset.lo rasterlitedataset.cpp
make[2]: Leaving directory '/tmp/B.lZJ7wH/BUILD/gdal-3.0.4/frmts/rasterlite'
make[2]: Entering directory '/tmp/B.lZJ7wH/BUILD/gdal-3.0.4/frmts/rasterlite'
/bin/sh /tmp/B.lZJ7wH/BUILD/gdal-3.0.4/libtool --mode=compile --silent --tag=CXX x86_64-pld-linux-g++ -I/tmp/B.lZJ7wH/BUILD/gdal-3.0.4/port -I/tmp/B.lZJ7wH/BUILD/gdal-3.0.4/gcore -I/tmp/B.lZJ7wH/BUILD/gdal-3.0.4/alg -I/tmp/B.lZJ7wH/BUILD/gdal-3.0.4/ogr -I/tmp/B.lZJ7wH/BUILD/gdal-3.0.4/ogr/ogrsf_frmts -I/tmp/B.lZJ7wH/BUILD/gdal-3.0.4/gnm -I/tmp/B.lZJ7wH/BUILD/gdal-3.0.4/apps -DHAVE_AVX_AT_COMPILE_TIME -DHAVE_SSSE3_AT_COMPILE_TIME -DHAVE_SSE_AT_COMPILE_TIME -O2 -fwrapv -pipe -Wformat -Werror=format-security -gdwarf-4 -fno-debug-types-section -fvar-tracking-assignments -g2 -Wp,-D_FORTIFY_SOURCE=2 -fstack-protector-strong --param=ssp-buffer-size=4 -Werror=trampolines -fPIC -march=x86-64 -gdwarf-4 -fno-debug-types-section -fvar-tracking-assignments -g2  -fvisibility=hidden  -Wall -Wextra -Winit-self -Wunused-parameter -Wformat -Werror=format-security -Wno-format-nonliteral -Wlogical-op -Wshadow -Werror=vla -Wdate-time -Wnull-dereference -Wduplicated-cond -Wextra-semi -Wfloat-conversion -Wmissing-declarations -Wnon-virtual-dtor -Woverloaded-virtual -fno-operator-names -Wzero-as-null-pointer-constant -Wsuggest-override -Wimplicit-fallthrough  -DGNM_ENABLED -I/tmp/B.lZJ7wH/BUILD/gdal-3.0.4/port -I/usr/include/openjpeg-2.3 -I/usr/include  -DGDAL_COMPILATION -DHAVE_XERCES -I/usr/include -I/usr/include/xercesc -I/tmp/B.lZJ7wH/BUILD/gdal-3.0.4/port -I/usr/include/openjpeg-2.3 -I/usr/include  -DGDAL_COMPILATION -I../../ogr -c -o ../o/rasterlitecreatecopy.lo rasterlitecreatecopy.cpp
make[2]: Leaving directory '/tmp/B.lZJ7wH/BUILD/gdal-3.0.4/frmts/rasterlite'
make[3]: Entering directory '/tmp/B.lZJ7wH/BUILD/gdal-3.0.4/ogr/ogrsf_frmts/carto'
/bin/sh /tmp/B.lZJ7wH/BUILD/gdal-3.0.4/libtool --mode=compile --silent --tag=CXX x86_64-pld-linux-g++ -I/tmp/B.lZJ7wH/BUILD/gdal-3.0.4/port -I/tmp/B.lZJ7wH/BUILD/gdal-3.0.4/gcore -I/tmp/B.lZJ7wH/BUILD/gdal-3.0.4/alg -I/tmp/B.lZJ7wH/BUILD/gdal-3.0.4/ogr -I/tmp/B.lZJ7wH/BUILD/gdal-3.0.4/ogr/ogrsf_frmts -I/tmp/B.lZJ7wH/BUILD/gdal-3.0.4/gnm -I/tmp/B.lZJ7wH/BUILD/gdal-3.0.4/apps -DHAVE_AVX_AT_COMPILE_TIME -DHAVE_SSSE3_AT_COMPILE_TIME -DHAVE_SSE_AT_COMPILE_TIME -O2 -fwrapv -pipe -Wformat -Werror=format-security -gdwarf-4 -fno-debug-types-section -fvar-tracking-assignments -g2 -Wp,-D_FORTIFY_SOURCE=2 -fstack-protector-strong --param=ssp-buffer-size=4 -Werror=trampolines -fPIC -march=x86-64 -gdwarf-4 -fno-debug-types-section -fvar-tracking-assignments -g2  -fvisibility=hidden  -Wall -Wextra -Winit-self -Wunused-parameter -Wformat -Werror=format-security -Wno-format-nonliteral -Wlogical-op -Wshadow -Werror=vla -Wdate-time -Wnull-dereference -Wduplicated-cond -Wextra-semi -Wfloat-conversion -Wmissing-declarations -Wnon-virtual-dtor -Woverloaded-virtual -fno-operator-names -Wzero-as-null-pointer-constant -Wsuggest-override -Wimplicit-fallthrough  -I../geojson -I/usr/include/json-c -I.. -I../.. -I../pgdump -DGNM_ENABLED -I/tmp/B.lZJ7wH/BUILD/gdal-3.0.4/port -I/usr/include/openjpeg-2.3 -I/usr/include  -DGDAL_COMPILATION -DHAVE_XERCES -I/usr/include -I/usr/include/xercesc -I/tmp/B.lZJ7wH/BUILD/gdal-3.0.4/port -I/usr/include/openjpeg-2.3 -I/usr/include  -DGDAL_COMPILATION -c -o ../o/ogrcartoresultlayer.lo ogrcartoresultlayer.cpp
make[3]: Leaving directory '/tmp/B.lZJ7wH/BUILD/gdal-3.0.4/ogr/ogrsf_frmts/carto'
/usr/bin/make -C couchdb
make[3]: Entering directory '/tmp/B.lZJ7wH/BUILD/gdal-3.0.4/ogr/ogrsf_frmts/amigocloud'
/bin/sh /tmp/B.lZJ7wH/BUILD/gdal-3.0.4/libtool --mode=compile --silent --tag=CXX x86_64-pld-linux-g++ -I/tmp/B.lZJ7wH/BUILD/gdal-3.0.4/port -I/tmp/B.lZJ7wH/BUILD/gdal-3.0.4/gcore -I/tmp/B.lZJ7wH/BUILD/gdal-3.0.4/alg -I/tmp/B.lZJ7wH/BUILD/gdal-3.0.4/ogr -I/tmp/B.lZJ7wH/BUILD/gdal-3.0.4/ogr/ogrsf_frmts -I/tmp/B.lZJ7wH/BUILD/gdal-3.0.4/gnm -I/tmp/B.lZJ7wH/BUILD/gdal-3.0.4/apps -DHAVE_AVX_AT_COMPILE_TIME -DHAVE_SSSE3_AT_COMPILE_TIME -DHAVE_SSE_AT_COMPILE_TIME -O2 -fwrapv -pipe -Wformat -Werror=format-security -gdwarf-4 -fno-debug-types-section -fvar-tracking-assignments -g2 -Wp,-D_FORTIFY_SOURCE=2 -fstack-protector-strong --param=ssp-buffer-size=4 -Werror=trampolines -fPIC -march=x86-64 -gdwarf-4 -fno-debug-types-section -fvar-tracking-assignments -g2  -fvisibility=hidden  -Wall -Wextra -Winit-self -Wunused-parameter -Wformat -Werror=format-security -Wno-format-nonliteral -Wlogical-op -Wshadow -Werror=vla -Wdate-time -Wnull-dereference -Wduplicated-cond -Wextra-semi -Wfloat-conversion -Wmissing-declarations -Wnon-virtual-dtor -Woverloaded-virtual -fno-operator-names -Wzero-as-null-pointer-constant -Wsuggest-override -Wimplicit-fallthrough  -I../geojson -I/usr/include/json-c -I.. -I../.. -I../pgdump -DGNM_ENABLED -I/tmp/B.lZJ7wH/BUILD/gdal-3.0.4/port -I/usr/include/openjpeg-2.3 -I/usr/include  -DGDAL_COMPILATION -DHAVE_XERCES -I/usr/include -I/usr/include/xercesc -I/tmp/B.lZJ7wH/BUILD/gdal-3.0.4/port -I/usr/include/openjpeg-2.3 -I/usr/include  -DGDAL_COMPILATION -c -o ../o/ogramigocloudtablelayer.lo ogramigocloudtablelayer.cpp
make[3]: Leaving directory '/tmp/B.lZJ7wH/BUILD/gdal-3.0.4/ogr/ogrsf_frmts/amigocloud'
make[3]: Entering directory '/tmp/B.lZJ7wH/BUILD/gdal-3.0.4/ogr/ogrsf_frmts/cloudant'
/bin/sh /tmp/B.lZJ7wH/BUILD/gdal-3.0.4/libtool --mode=compile --silent --tag=CXX x86_64-pld-linux-g++ -I/tmp/B.lZJ7wH/BUILD/gdal-3.0.4/port -I/tmp/B.lZJ7wH/BUILD/gdal-3.0.4/gcore -I/tmp/B.lZJ7wH/BUILD/gdal-3.0.4/alg -I/tmp/B.lZJ7wH/BUILD/gdal-3.0.4/ogr -I/tmp/B.lZJ7wH/BUILD/gdal-3.0.4/ogr/ogrsf_frmts -I/tmp/B.lZJ7wH/BUILD/gdal-3.0.4/gnm -I/tmp/B.lZJ7wH/BUILD/gdal-3.0.4/apps -DHAVE_AVX_AT_COMPILE_TIME -DHAVE_SSSE3_AT_COMPILE_TIME -DHAVE_SSE_AT_COMPILE_TIME -O2 -fwrapv -pipe -Wformat -Werror=format-security -gdwarf-4 -fno-debug-types-section -fvar-tracking-assignments -g2 -Wp,-D_FORTIFY_SOURCE=2 -fstack-protector-strong --param=ssp-buffer-size=4 -Werror=trampolines -fPIC -march=x86-64 -gdwarf-4 -fno-debug-types-section -fvar-tracking-assignments -g2  -fvisibility=hidden  -Wall -Wextra -Winit-self -Wunused-parameter -Wformat -Werror=format-security -Wno-format-nonliteral -Wlogical-op -Wshadow -Werror=vla -Wdate-time -Wnull-dereference -Wduplicated-cond -Wextra-semi -Wfloat-conversion -Wmissing-declarations -Wnon-virtual-dtor -Woverloaded-virtual -fno-operator-names -Wzero-as-null-pointer-constant -Wsuggest-override -Wimplicit-fallthrough  -I/usr/include/json-c -I.. -I../.. -I../geojson -I../couchdb -I/tmp/B.lZJ7wH/BUILD/gdal-3.0.4/port -I/tmp/B.lZJ7wH/BUILD/gdal-3.0.4/gcore -I/tmp/B.lZJ7wH/BUILD/gdal-3.0.4/alg -I/tmp/B.lZJ7wH/BUILD/gdal-3.0.4/ogr -I/tmp/B.lZJ7wH/BUILD/gdal-3.0.4/ogr/ogrsf_frmts -I/tmp/B.lZJ7wH/BUILD/gdal-3.0.4/gnm -I/tmp/B.lZJ7wH/BUILD/gdal-3.0.4/apps -DGNM_ENABLED -I/tmp/B.lZJ7wH/BUILD/gdal-3.0.4/port -I/usr/include/openjpeg-2.3 -I/usr/include  -DGDAL_COMPILATION -DHAVE_XERCES -I/usr/include -I/usr/include/xercesc -I/tmp/B.lZJ7wH/BUILD/gdal-3.0.4/port -I/usr/include/openjpeg-2.3 -I/usr/include  -DGDAL_COMPILATION -c -o ../o/ogrcloudantdriver.lo ogrcloudantdriver.cpp
make[3]: Leaving directory '/tmp/B.lZJ7wH/BUILD/gdal-3.0.4/ogr/ogrsf_frmts/cloudant'
make[3]: Entering directory '/tmp/B.lZJ7wH/BUILD/gdal-3.0.4/ogr/ogrsf_frmts/walk'
/bin/sh /tmp/B.lZJ7wH/BUILD/gdal-3.0.4/libtool --mode=compile --silent --tag=CXX x86_64-pld-linux-g++ -I/tmp/B.lZJ7wH/BUILD/gdal-3.0.4/port -I/tmp/B.lZJ7wH/BUILD/gdal-3.0.4/gcore -I/tmp/B.lZJ7wH/BUILD/gdal-3.0.4/alg -I/tmp/B.lZJ7wH/BUILD/gdal-3.0.4/ogr -I/tmp/B.lZJ7wH/BUILD/gdal-3.0.4/ogr/ogrsf_frmts -I/tmp/B.lZJ7wH/BUILD/gdal-3.0.4/gnm -I/tmp/B.lZJ7wH/BUILD/gdal-3.0.4/apps -DHAVE_AVX_AT_COMPILE_TIME -DHAVE_SSSE3_AT_COMPILE_TIME -DHAVE_SSE_AT_COMPILE_TIME -O2 -fwrapv -pipe -Wformat -Werror=format-security -gdwarf-4 -fno-debug-types-section -fvar-tracking-assignments -g2 -Wp,-D_FORTIFY_SOURCE=2 -fstack-protector-strong --param=ssp-buffer-size=4 -Werror=trampolines -fPIC -march=x86-64 -gdwarf-4 -fno-debug-types-section -fvar-tracking-assignments -g2  -fvisibility=hidden  -Wall -Wextra -Winit-self -Wunused-parameter -Wformat -Werror=format-security -Wno-format-nonliteral -Wlogical-op -Wshadow -Werror=vla -Wdate-time -Wnull-dereference -Wduplicated-cond -Wextra-semi -Wfloat-conversion -Wmissing-declarations -Wnon-virtual-dtor -Woverloaded-virtual -fno-operator-names -Wzero-as-null-pointer-constant -Wsuggest-override -Wimplicit-fallthrough  -I.. -I../.. -I../generic -I../pgeo  -DGNM_ENABLED -I/tmp/B.lZJ7wH/BUILD/gdal-3.0.4/port -I/usr/include/openjpeg-2.3 -I/usr/include  -DGDAL_COMPILATION -DHAVE_XERCES -I/usr/include -I/usr/include/xercesc -I/tmp/B.lZJ7wH/BUILD/gdal-3.0.4/port -I/usr/include/openjpeg-2.3 -I/usr/include  -DGDAL_COMPILATION -c -o ../o/ogrwalktool.lo ogrwalktool.cpp
make[3]: Leaving directory '/tmp/B.lZJ7wH/BUILD/gdal-3.0.4/ogr/ogrsf_frmts/walk'
/usr/bin/make -C csw
make[2]: Entering directory '/tmp/B.lZJ7wH/BUILD/gdal-3.0.4/frmts/wms'
/bin/sh /tmp/B.lZJ7wH/BUILD/gdal-3.0.4/libtool --mode=compile --silent --tag=CXX x86_64-pld-linux-g++ -I/tmp/B.lZJ7wH/BUILD/gdal-3.0.4/port -I/tmp/B.lZJ7wH/BUILD/gdal-3.0.4/gcore -I/tmp/B.lZJ7wH/BUILD/gdal-3.0.4/alg -I/tmp/B.lZJ7wH/BUILD/gdal-3.0.4/ogr -I/tmp/B.lZJ7wH/BUILD/gdal-3.0.4/ogr/ogrsf_frmts -I/tmp/B.lZJ7wH/BUILD/gdal-3.0.4/gnm -I/tmp/B.lZJ7wH/BUILD/gdal-3.0.4/apps -DHAVE_AVX_AT_COMPILE_TIME -DHAVE_SSSE3_AT_COMPILE_TIME -DHAVE_SSE_AT_COMPILE_TIME -O2 -fwrapv -pipe -Wformat -Werror=format-security -gdwarf-4 -fno-debug-types-section -fvar-tracking-assignments -g2 -Wp,-D_FORTIFY_SOURCE=2 -fstack-protector-strong --param=ssp-buffer-size=4 -Werror=trampolines -fPIC -march=x86-64 -gdwarf-4 -fno-debug-types-section -fvar-tracking-assignments -g2  -fvisibility=hidden  -Wall -Wextra -Winit-self -Wunused-parameter -Wformat -Werror=format-security -Wno-format-nonliteral -Wlogical-op -Wshadow -Werror=vla -Wdate-time -Wnull-dereference -Wduplicated-cond -Wextra-semi -Wfloat-conversion -Wmissing-declarations -Wnon-virtual-dtor -Woverloaded-virtual -fno-operator-names -Wzero-as-null-pointer-constant -Wsuggest-override -Wimplicit-fallthrough  -DGNM_ENABLED -I/tmp/B.lZJ7wH/BUILD/gdal-3.0.4/port -I/usr/include/openjpeg-2.3 -I/usr/include  -DGDAL_COMPILATION -DHAVE_XERCES -I/usr/include -I/usr/include/xercesc -I/tmp/B.lZJ7wH/BUILD/gdal-3.0.4/port -I/usr/include/openjpeg-2.3 -I/usr/include  -DGDAL_COMPILATION -DHAVE_CURL  -c -o ../o/wmsmetadataset.lo wmsmetadataset.cpp
make[2]: Leaving directory '/tmp/B.lZJ7wH/BUILD/gdal-3.0.4/frmts/wms'
make[3]: Entering directory '/tmp/B.lZJ7wH/BUILD/gdal-3.0.4/ogr/ogrsf_frmts/cloudant'
/bin/sh /tmp/B.lZJ7wH/BUILD/gdal-3.0.4/libtool --mode=compile --silent --tag=CXX x86_64-pld-linux-g++ -I/tmp/B.lZJ7wH/BUILD/gdal-3.0.4/port -I/tmp/B.lZJ7wH/BUILD/gdal-3.0.4/gcore -I/tmp/B.lZJ7wH/BUILD/gdal-3.0.4/alg -I/tmp/B.lZJ7wH/BUILD/gdal-3.0.4/ogr -I/tmp/B.lZJ7wH/BUILD/gdal-3.0.4/ogr/ogrsf_frmts -I/tmp/B.lZJ7wH/BUILD/gdal-3.0.4/gnm -I/tmp/B.lZJ7wH/BUILD/gdal-3.0.4/apps -DHAVE_AVX_AT_COMPILE_TIME -DHAVE_SSSE3_AT_COMPILE_TIME -DHAVE_SSE_AT_COMPILE_TIME -O2 -fwrapv -pipe -Wformat -Werror=format-security -gdwarf-4 -fno-debug-types-section -fvar-tracking-assignments -g2 -Wp,-D_FORTIFY_SOURCE=2 -fstack-protector-strong --param=ssp-buffer-size=4 -Werror=trampolines -fPIC -march=x86-64 -gdwarf-4 -fno-debug-types-section -fvar-tracking-assignments -g2  -fvisibility=hidden  -Wall -Wextra -Winit-self -Wunused-parameter -Wformat -Werror=format-security -Wno-format-nonliteral -Wlogical-op -Wshadow -Werror=vla -Wdate-time -Wnull-dereference -Wduplicated-cond -Wextra-semi -Wfloat-conversion -Wmissing-declarations -Wnon-virtual-dtor -Woverloaded-virtual -fno-operator-names -Wzero-as-null-pointer-constant -Wsuggest-override -Wimplicit-fallthrough  -I/usr/include/json-c -I.. -I../.. -I../geojson -I../couchdb -I/tmp/B.lZJ7wH/BUILD/gdal-3.0.4/port -I/tmp/B.lZJ7wH/BUILD/gdal-3.0.4/gcore -I/tmp/B.lZJ7wH/BUILD/gdal-3.0.4/alg -I/tmp/B.lZJ7wH/BUILD/gdal-3.0.4/ogr -I/tmp/B.lZJ7wH/BUILD/gdal-3.0.4/ogr/ogrsf_frmts -I/tmp/B.lZJ7wH/BUILD/gdal-3.0.4/gnm -I/tmp/B.lZJ7wH/BUILD/gdal-3.0.4/apps -DGNM_ENABLED -I/tmp/B.lZJ7wH/BUILD/gdal-3.0.4/port -I/usr/include/openjpeg-2.3 -I/usr/include  -DGDAL_COMPILATION -DHAVE_XERCES -I/usr/include -I/usr/include/xercesc -I/tmp/B.lZJ7wH/BUILD/gdal-3.0.4/port -I/usr/include/openjpeg-2.3 -I/usr/include  -DGDAL_COMPILATION -c -o ../o/ogrcloudantdatasource.lo ogrcloudantdatasource.cpp
make[3]: Leaving directory '/tmp/B.lZJ7wH/BUILD/gdal-3.0.4/ogr/ogrsf_frmts/cloudant'
make[2]: Entering directory '/tmp/B.lZJ7wH/BUILD/gdal-3.0.4/frmts/rasterlite'
/bin/sh /tmp/B.lZJ7wH/BUILD/gdal-3.0.4/libtool --mode=compile --silent --tag=CXX x86_64-pld-linux-g++ -I/tmp/B.lZJ7wH/BUILD/gdal-3.0.4/port -I/tmp/B.lZJ7wH/BUILD/gdal-3.0.4/gcore -I/tmp/B.lZJ7wH/BUILD/gdal-3.0.4/alg -I/tmp/B.lZJ7wH/BUILD/gdal-3.0.4/ogr -I/tmp/B.lZJ7wH/BUILD/gdal-3.0.4/ogr/ogrsf_frmts -I/tmp/B.lZJ7wH/BUILD/gdal-3.0.4/gnm -I/tmp/B.lZJ7wH/BUILD/gdal-3.0.4/apps -DHAVE_AVX_AT_COMPILE_TIME -DHAVE_SSSE3_AT_COMPILE_TIME -DHAVE_SSE_AT_COMPILE_TIME -O2 -fwrapv -pipe -Wformat -Werror=format-security -gdwarf-4 -fno-debug-types-section -fvar-tracking-assignments -g2 -Wp,-D_FORTIFY_SOURCE=2 -fstack-protector-strong --param=ssp-buffer-size=4 -Werror=trampolines -fPIC -march=x86-64 -gdwarf-4 -fno-debug-types-section -fvar-tracking-assignments -g2  -fvisibility=hidden  -Wall -Wextra -Winit-self -Wunused-parameter -Wformat -Werror=format-security -Wno-format-nonliteral -Wlogical-op -Wshadow -Werror=vla -Wdate-time -Wnull-dereference -Wduplicated-cond -Wextra-semi -Wfloat-conversion -Wmissing-declarations -Wnon-virtual-dtor -Woverloaded-virtual -fno-operator-names -Wzero-as-null-pointer-constant -Wsuggest-override -Wimplicit-fallthrough  -DGNM_ENABLED -I/tmp/B.lZJ7wH/BUILD/gdal-3.0.4/port -I/usr/include/openjpeg-2.3 -I/usr/include  -DGDAL_COMPILATION -DHAVE_XERCES -I/usr/include -I/usr/include/xercesc -I/tmp/B.lZJ7wH/BUILD/gdal-3.0.4/port -I/usr/include/openjpeg-2.3 -I/usr/include  -DGDAL_COMPILATION -I../../ogr -c -o ../o/rasterliteoverviews.lo rasterliteoverviews.cpp
make[2]: Leaving directory '/tmp/B.lZJ7wH/BUILD/gdal-3.0.4/frmts/rasterlite'
/usr/bin/make -C mbtiles install-obj
make[2]: Entering directory '/tmp/B.lZJ7wH/BUILD/gdal-3.0.4/frmts/daas'
/bin/sh /tmp/B.lZJ7wH/BUILD/gdal-3.0.4/libtool --mode=compile --silent --tag=CXX x86_64-pld-linux-g++ -I/tmp/B.lZJ7wH/BUILD/gdal-3.0.4/port -I/tmp/B.lZJ7wH/BUILD/gdal-3.0.4/gcore -I/tmp/B.lZJ7wH/BUILD/gdal-3.0.4/alg -I/tmp/B.lZJ7wH/BUILD/gdal-3.0.4/ogr -I/tmp/B.lZJ7wH/BUILD/gdal-3.0.4/ogr/ogrsf_frmts -I/tmp/B.lZJ7wH/BUILD/gdal-3.0.4/gnm -I/tmp/B.lZJ7wH/BUILD/gdal-3.0.4/apps -DHAVE_AVX_AT_COMPILE_TIME -DHAVE_SSSE3_AT_COMPILE_TIME -DHAVE_SSE_AT_COMPILE_TIME -O2 -fwrapv -pipe -Wformat -Werror=format-security -gdwarf-4 -fno-debug-types-section -fvar-tracking-assignments -g2 -Wp,-D_FORTIFY_SOURCE=2 -fstack-protector-strong --param=ssp-buffer-size=4 -Werror=trampolines -fPIC -march=x86-64 -gdwarf-4 -fno-debug-types-section -fvar-tracking-assignments -g2  -fvisibility=hidden  -Wall -Wextra -Winit-self -Wunused-parameter -Wformat -Werror=format-security -Wno-format-nonliteral -Wlogical-op -Wshadow -Werror=vla -Wdate-time -Wnull-dereference -Wduplicated-cond -Wextra-semi -Wfloat-conversion -Wmissing-declarations -Wnon-virtual-dtor -Woverloaded-virtual -fno-operator-names -Wzero-as-null-pointer-constant -Wsuggest-override -Wimplicit-fallthrough  -I../../ogr/ogrsf_frmts/geojson -I/usr/include/json-c -DGNM_ENABLED -I/tmp/B.lZJ7wH/BUILD/gdal-3.0.4/port -I/usr/include/openjpeg-2.3 -I/usr/include  -DGDAL_COMPILATION -DHAVE_XERCES -I/usr/include -I/usr/include/xercesc -I/tmp/B.lZJ7wH/BUILD/gdal-3.0.4/port -I/usr/include/openjpeg-2.3 -I/usr/include  -DGDAL_COMPILATION -c -o ../o/daasdataset.lo daasdataset.cpp
make[2]: Leaving directory '/tmp/B.lZJ7wH/BUILD/gdal-3.0.4/frmts/daas'
/usr/bin/make -C pdf install-obj
make[3]: Entering directory '/tmp/B.lZJ7wH/BUILD/gdal-3.0.4/ogr/ogrsf_frmts/couchdb'
/bin/sh /tmp/B.lZJ7wH/BUILD/gdal-3.0.4/libtool --mode=compile --silent --tag=CXX x86_64-pld-linux-g++ -I/tmp/B.lZJ7wH/BUILD/gdal-3.0.4/port -I/tmp/B.lZJ7wH/BUILD/gdal-3.0.4/gcore -I/tmp/B.lZJ7wH/BUILD/gdal-3.0.4/alg -I/tmp/B.lZJ7wH/BUILD/gdal-3.0.4/ogr -I/tmp/B.lZJ7wH/BUILD/gdal-3.0.4/ogr/ogrsf_frmts -I/tmp/B.lZJ7wH/BUILD/gdal-3.0.4/gnm -I/tmp/B.lZJ7wH/BUILD/gdal-3.0.4/apps -DHAVE_AVX_AT_COMPILE_TIME -DHAVE_SSSE3_AT_COMPILE_TIME -DHAVE_SSE_AT_COMPILE_TIME -O2 -fwrapv -pipe -Wformat -Werror=format-security -gdwarf-4 -fno-debug-types-section -fvar-tracking-assignments -g2 -Wp,-D_FORTIFY_SOURCE=2 -fstack-protector-strong --param=ssp-buffer-size=4 -Werror=trampolines -fPIC -march=x86-64 -gdwarf-4 -fno-debug-types-section -fvar-tracking-assignments -g2  -fvisibility=hidden  -Wall -Wextra -Winit-self -Wunused-parameter -Wformat -Werror=format-security -Wno-format-nonliteral -Wlogical-op -Wshadow -Werror=vla -Wdate-time -Wnull-dereference -Wduplicated-cond -Wextra-semi -Wfloat-conversion -Wmissing-declarations -Wnon-virtual-dtor -Woverloaded-virtual -fno-operator-names -Wzero-as-null-pointer-constant -Wsuggest-override -Wimplicit-fallthrough  -I/usr/include/json-c -I.. -I../.. -I../geojson  -DGNM_ENABLED -I/tmp/B.lZJ7wH/BUILD/gdal-3.0.4/port -I/usr/include/openjpeg-2.3 -I/usr/include  -DGDAL_COMPILATION -DHAVE_XERCES -I/usr/include -I/usr/include/xercesc -I/tmp/B.lZJ7wH/BUILD/gdal-3.0.4/port -I/usr/include/openjpeg-2.3 -I/usr/include  -DGDAL_COMPILATION -c -o ../o/ogrcouchdbdriver.lo ogrcouchdbdriver.cpp
make[3]: Leaving directory '/tmp/B.lZJ7wH/BUILD/gdal-3.0.4/ogr/ogrsf_frmts/couchdb'
/usr/bin/make -C webp install-obj
make[3]: Entering directory '/tmp/B.lZJ7wH/BUILD/gdal-3.0.4/ogr/ogrsf_frmts/cloudant'
/bin/sh /tmp/B.lZJ7wH/BUILD/gdal-3.0.4/libtool --mode=compile --silent --tag=CXX x86_64-pld-linux-g++ -I/tmp/B.lZJ7wH/BUILD/gdal-3.0.4/port -I/tmp/B.lZJ7wH/BUILD/gdal-3.0.4/gcore -I/tmp/B.lZJ7wH/BUILD/gdal-3.0.4/alg -I/tmp/B.lZJ7wH/BUILD/gdal-3.0.4/ogr -I/tmp/B.lZJ7wH/BUILD/gdal-3.0.4/ogr/ogrsf_frmts -I/tmp/B.lZJ7wH/BUILD/gdal-3.0.4/gnm -I/tmp/B.lZJ7wH/BUILD/gdal-3.0.4/apps -DHAVE_AVX_AT_COMPILE_TIME -DHAVE_SSSE3_AT_COMPILE_TIME -DHAVE_SSE_AT_COMPILE_TIME -O2 -fwrapv -pipe -Wformat -Werror=format-security -gdwarf-4 -fno-debug-types-section -fvar-tracking-assignments -g2 -Wp,-D_FORTIFY_SOURCE=2 -fstack-protector-strong --param=ssp-buffer-size=4 -Werror=trampolines -fPIC -march=x86-64 -gdwarf-4 -fno-debug-types-section -fvar-tracking-assignments -g2  -fvisibility=hidden  -Wall -Wextra -Winit-self -Wunused-parameter -Wformat -Werror=format-security -Wno-format-nonliteral -Wlogical-op -Wshadow -Werror=vla -Wdate-time -Wnull-dereference -Wduplicated-cond -Wextra-semi -Wfloat-conversion -Wmissing-declarations -Wnon-virtual-dtor -Woverloaded-virtual -fno-operator-names -Wzero-as-null-pointer-constant -Wsuggest-override -Wimplicit-fallthrough  -I/usr/include/json-c -I.. -I../.. -I../geojson -I../couchdb -I/tmp/B.lZJ7wH/BUILD/gdal-3.0.4/port -I/tmp/B.lZJ7wH/BUILD/gdal-3.0.4/gcore -I/tmp/B.lZJ7wH/BUILD/gdal-3.0.4/alg -I/tmp/B.lZJ7wH/BUILD/gdal-3.0.4/ogr -I/tmp/B.lZJ7wH/BUILD/gdal-3.0.4/ogr/ogrsf_frmts -I/tmp/B.lZJ7wH/BUILD/gdal-3.0.4/gnm -I/tmp/B.lZJ7wH/BUILD/gdal-3.0.4/apps -DGNM_ENABLED -I/tmp/B.lZJ7wH/BUILD/gdal-3.0.4/port -I/usr/include/openjpeg-2.3 -I/usr/include  -DGDAL_COMPILATION -DHAVE_XERCES -I/usr/include -I/usr/include/xercesc -I/tmp/B.lZJ7wH/BUILD/gdal-3.0.4/port -I/usr/include/openjpeg-2.3 -I/usr/include  -DGDAL_COMPILATION -c -o ../o/ogrcloudanttablelayer.lo ogrcloudanttablelayer.cpp
make[3]: Leaving directory '/tmp/B.lZJ7wH/BUILD/gdal-3.0.4/ogr/ogrsf_frmts/cloudant'
/usr/bin/make -C epsilon install-obj
make[3]: Entering directory '/tmp/B.lZJ7wH/BUILD/gdal-3.0.4/ogr/ogrsf_frmts/amigocloud'
/bin/sh /tmp/B.lZJ7wH/BUILD/gdal-3.0.4/libtool --mode=compile --silent --tag=CXX x86_64-pld-linux-g++ -I/tmp/B.lZJ7wH/BUILD/gdal-3.0.4/port -I/tmp/B.lZJ7wH/BUILD/gdal-3.0.4/gcore -I/tmp/B.lZJ7wH/BUILD/gdal-3.0.4/alg -I/tmp/B.lZJ7wH/BUILD/gdal-3.0.4/ogr -I/tmp/B.lZJ7wH/BUILD/gdal-3.0.4/ogr/ogrsf_frmts -I/tmp/B.lZJ7wH/BUILD/gdal-3.0.4/gnm -I/tmp/B.lZJ7wH/BUILD/gdal-3.0.4/apps -DHAVE_AVX_AT_COMPILE_TIME -DHAVE_SSSE3_AT_COMPILE_TIME -DHAVE_SSE_AT_COMPILE_TIME -O2 -fwrapv -pipe -Wformat -Werror=format-security -gdwarf-4 -fno-debug-types-section -fvar-tracking-assignments -g2 -Wp,-D_FORTIFY_SOURCE=2 -fstack-protector-strong --param=ssp-buffer-size=4 -Werror=trampolines -fPIC -march=x86-64 -gdwarf-4 -fno-debug-types-section -fvar-tracking-assignments -g2  -fvisibility=hidden  -Wall -Wextra -Winit-self -Wunused-parameter -Wformat -Werror=format-security -Wno-format-nonliteral -Wlogical-op -Wshadow -Werror=vla -Wdate-time -Wnull-dereference -Wduplicated-cond -Wextra-semi -Wfloat-conversion -Wmissing-declarations -Wnon-virtual-dtor -Woverloaded-virtual -fno-operator-names -Wzero-as-null-pointer-constant -Wsuggest-override -Wimplicit-fallthrough  -I../geojson -I/usr/include/json-c -I.. -I../.. -I../pgdump -DGNM_ENABLED -I/tmp/B.lZJ7wH/BUILD/gdal-3.0.4/port -I/usr/include/openjpeg-2.3 -I/usr/include  -DGDAL_COMPILATION -DHAVE_XERCES -I/usr/include -I/usr/include/xercesc -I/tmp/B.lZJ7wH/BUILD/gdal-3.0.4/port -I/usr/include/openjpeg-2.3 -I/usr/include  -DGDAL_COMPILATION -c -o ../o/ogramigocloudresultlayer.lo ogramigocloudresultlayer.cpp
make[3]: Leaving directory '/tmp/B.lZJ7wH/BUILD/gdal-3.0.4/ogr/ogrsf_frmts/amigocloud'
make[2]: Entering directory '/tmp/B.lZJ7wH/BUILD/gdal-3.0.4/frmts/wms'
/bin/sh /tmp/B.lZJ7wH/BUILD/gdal-3.0.4/libtool --mode=compile --silent --tag=CXX x86_64-pld-linux-g++ -I/tmp/B.lZJ7wH/BUILD/gdal-3.0.4/port -I/tmp/B.lZJ7wH/BUILD/gdal-3.0.4/gcore -I/tmp/B.lZJ7wH/BUILD/gdal-3.0.4/alg -I/tmp/B.lZJ7wH/BUILD/gdal-3.0.4/ogr -I/tmp/B.lZJ7wH/BUILD/gdal-3.0.4/ogr/ogrsf_frmts -I/tmp/B.lZJ7wH/BUILD/gdal-3.0.4/gnm -I/tmp/B.lZJ7wH/BUILD/gdal-3.0.4/apps -DHAVE_AVX_AT_COMPILE_TIME -DHAVE_SSSE3_AT_COMPILE_TIME -DHAVE_SSE_AT_COMPILE_TIME -O2 -fwrapv -pipe -Wformat -Werror=format-security -gdwarf-4 -fno-debug-types-section -fvar-tracking-assignments -g2 -Wp,-D_FORTIFY_SOURCE=2 -fstack-protector-strong --param=ssp-buffer-size=4 -Werror=trampolines -fPIC -march=x86-64 -gdwarf-4 -fno-debug-types-section -fvar-tracking-assignments -g2  -fvisibility=hidden  -Wall -Wextra -Winit-self -Wunused-parameter -Wformat -Werror=format-security -Wno-format-nonliteral -Wlogical-op -Wshadow -Werror=vla -Wdate-time -Wnull-dereference -Wduplicated-cond -Wextra-semi -Wfloat-conversion -Wmissing-declarations -Wnon-virtual-dtor -Woverloaded-virtual -fno-operator-names -Wzero-as-null-pointer-constant -Wsuggest-override -Wimplicit-fallthrough  -DGNM_ENABLED -I/tmp/B.lZJ7wH/BUILD/gdal-3.0.4/port -I/usr/include/openjpeg-2.3 -I/usr/include  -DGDAL_COMPILATION -DHAVE_XERCES -I/usr/include -I/usr/include/xercesc -I/tmp/B.lZJ7wH/BUILD/gdal-3.0.4/port -I/usr/include/openjpeg-2.3 -I/usr/include  -DGDAL_COMPILATION -DHAVE_CURL  -c -o ../o/minidriver_virtualearth.lo minidriver_virtualearth.cpp
make[2]: Leaving directory '/tmp/B.lZJ7wH/BUILD/gdal-3.0.4/frmts/wms'
make[3]: Entering directory '/tmp/B.lZJ7wH/BUILD/gdal-3.0.4/ogr/ogrsf_frmts/csw'
/bin/sh /tmp/B.lZJ7wH/BUILD/gdal-3.0.4/libtool --mode=compile --silent --tag=CXX x86_64-pld-linux-g++ -I/tmp/B.lZJ7wH/BUILD/gdal-3.0.4/port -I/tmp/B.lZJ7wH/BUILD/gdal-3.0.4/gcore -I/tmp/B.lZJ7wH/BUILD/gdal-3.0.4/alg -I/tmp/B.lZJ7wH/BUILD/gdal-3.0.4/ogr -I/tmp/B.lZJ7wH/BUILD/gdal-3.0.4/ogr/ogrsf_frmts -I/tmp/B.lZJ7wH/BUILD/gdal-3.0.4/gnm -I/tmp/B.lZJ7wH/BUILD/gdal-3.0.4/apps -DHAVE_AVX_AT_COMPILE_TIME -DHAVE_SSSE3_AT_COMPILE_TIME -DHAVE_SSE_AT_COMPILE_TIME -O2 -fwrapv -pipe -Wformat -Werror=format-security -gdwarf-4 -fno-debug-types-section -fvar-tracking-assignments -g2 -Wp,-D_FORTIFY_SOURCE=2 -fstack-protector-strong --param=ssp-buffer-size=4 -Werror=trampolines -fPIC -march=x86-64 -gdwarf-4 -fno-debug-types-section -fvar-tracking-assignments -g2  -fvisibility=hidden  -Wall -Wextra -Winit-self -Wunused-parameter -Wformat -Werror=format-security -Wno-format-nonliteral -Wlogical-op -Wshadow -Werror=vla -Wdate-time -Wnull-dereference -Wduplicated-cond -Wextra-semi -Wfloat-conversion -Wmissing-declarations -Wnon-virtual-dtor -Woverloaded-virtual -fno-operator-names -Wzero-as-null-pointer-constant -Wsuggest-override -Wimplicit-fallthrough  -I.. -I../.. -I../gml -I../wfs  -DGNM_ENABLED -I/tmp/B.lZJ7wH/BUILD/gdal-3.0.4/port -I/usr/include/openjpeg-2.3 -I/usr/include  -DGDAL_COMPILATION -DHAVE_XERCES -I/usr/include -I/usr/include/xercesc -I/tmp/B.lZJ7wH/BUILD/gdal-3.0.4/port -I/usr/include/openjpeg-2.3 -I/usr/include  -DGDAL_COMPILATION -c -o ../o/ogrcswdataset.lo ogrcswdataset.cpp
make[3]: Leaving directory '/tmp/B.lZJ7wH/BUILD/gdal-3.0.4/ogr/ogrsf_frmts/csw'
make[3]: Entering directory '/tmp/B.lZJ7wH/BUILD/gdal-3.0.4/ogr/ogrsf_frmts/couchdb'
/bin/sh /tmp/B.lZJ7wH/BUILD/gdal-3.0.4/libtool --mode=compile --silent --tag=CXX x86_64-pld-linux-g++ -I/tmp/B.lZJ7wH/BUILD/gdal-3.0.4/port -I/tmp/B.lZJ7wH/BUILD/gdal-3.0.4/gcore -I/tmp/B.lZJ7wH/BUILD/gdal-3.0.4/alg -I/tmp/B.lZJ7wH/BUILD/gdal-3.0.4/ogr -I/tmp/B.lZJ7wH/BUILD/gdal-3.0.4/ogr/ogrsf_frmts -I/tmp/B.lZJ7wH/BUILD/gdal-3.0.4/gnm -I/tmp/B.lZJ7wH/BUILD/gdal-3.0.4/apps -DHAVE_AVX_AT_COMPILE_TIME -DHAVE_SSSE3_AT_COMPILE_TIME -DHAVE_SSE_AT_COMPILE_TIME -O2 -fwrapv -pipe -Wformat -Werror=format-security -gdwarf-4 -fno-debug-types-section -fvar-tracking-assignments -g2 -Wp,-D_FORTIFY_SOURCE=2 -fstack-protector-strong --param=ssp-buffer-size=4 -Werror=trampolines -fPIC -march=x86-64 -gdwarf-4 -fno-debug-types-section -fvar-tracking-assignments -g2  -fvisibility=hidden  -Wall -Wextra -Winit-self -Wunused-parameter -Wformat -Werror=format-security -Wno-format-nonliteral -Wlogical-op -Wshadow -Werror=vla -Wdate-time -Wnull-dereference -Wduplicated-cond -Wextra-semi -Wfloat-conversion -Wmissing-declarations -Wnon-virtual-dtor -Woverloaded-virtual -fno-operator-names -Wzero-as-null-pointer-constant -Wsuggest-override -Wimplicit-fallthrough  -I/usr/include/json-c -I.. -I../.. -I../geojson  -DGNM_ENABLED -I/tmp/B.lZJ7wH/BUILD/gdal-3.0.4/port -I/usr/include/openjpeg-2.3 -I/usr/include  -DGDAL_COMPILATION -DHAVE_XERCES -I/usr/include -I/usr/include/xercesc -I/tmp/B.lZJ7wH/BUILD/gdal-3.0.4/port -I/usr/include/openjpeg-2.3 -I/usr/include  -DGDAL_COMPILATION -c -o ../o/ogrcouchdbdatasource.lo ogrcouchdbdatasource.cpp
make[3]: Leaving directory '/tmp/B.lZJ7wH/BUILD/gdal-3.0.4/ogr/ogrsf_frmts/couchdb'
make[2]: Entering directory '/tmp/B.lZJ7wH/BUILD/gdal-3.0.4/frmts/wms'
/bin/sh /tmp/B.lZJ7wH/BUILD/gdal-3.0.4/libtool --mode=compile --silent --tag=CXX x86_64-pld-linux-g++ -I/tmp/B.lZJ7wH/BUILD/gdal-3.0.4/port -I/tmp/B.lZJ7wH/BUILD/gdal-3.0.4/gcore -I/tmp/B.lZJ7wH/BUILD/gdal-3.0.4/alg -I/tmp/B.lZJ7wH/BUILD/gdal-3.0.4/ogr -I/tmp/B.lZJ7wH/BUILD/gdal-3.0.4/ogr/ogrsf_frmts -I/tmp/B.lZJ7wH/BUILD/gdal-3.0.4/gnm -I/tmp/B.lZJ7wH/BUILD/gdal-3.0.4/apps -DHAVE_AVX_AT_COMPILE_TIME -DHAVE_SSSE3_AT_COMPILE_TIME -DHAVE_SSE_AT_COMPILE_TIME -O2 -fwrapv -pipe -Wformat -Werror=format-security -gdwarf-4 -fno-debug-types-section -fvar-tracking-assignments -g2 -Wp,-D_FORTIFY_SOURCE=2 -fstack-protector-strong --param=ssp-buffer-size=4 -Werror=trampolines -fPIC -march=x86-64 -gdwarf-4 -fno-debug-types-section -fvar-tracking-assignments -g2  -fvisibility=hidden  -Wall -Wextra -Winit-self -Wunused-parameter -Wformat -Werror=format-security -Wno-format-nonliteral -Wlogical-op -Wshadow -Werror=vla -Wdate-time -Wnull-dereference -Wduplicated-cond -Wextra-semi -Wfloat-conversion -Wmissing-declarations -Wnon-virtual-dtor -Woverloaded-virtual -fno-operator-names -Wzero-as-null-pointer-constant -Wsuggest-override -Wimplicit-fallthrough  -DGNM_ENABLED -I/tmp/B.lZJ7wH/BUILD/gdal-3.0.4/port -I/usr/include/openjpeg-2.3 -I/usr/include  -DGDAL_COMPILATION -DHAVE_XERCES -I/usr/include -I/usr/include/xercesc -I/tmp/B.lZJ7wH/BUILD/gdal-3.0.4/port -I/usr/include/openjpeg-2.3 -I/usr/include  -DGDAL_COMPILATION -DHAVE_CURL  -c -o ../o/minidriver_arcgis_server.lo minidriver_arcgis_server.cpp
make[2]: Leaving directory '/tmp/B.lZJ7wH/BUILD/gdal-3.0.4/frmts/wms'
make[2]: Entering directory '/tmp/B.lZJ7wH/BUILD/gdal-3.0.4/frmts/webp'
/bin/sh /tmp/B.lZJ7wH/BUILD/gdal-3.0.4/libtool --mode=compile --silent --tag=CXX x86_64-pld-linux-g++ -I/tmp/B.lZJ7wH/BUILD/gdal-3.0.4/port -I/tmp/B.lZJ7wH/BUILD/gdal-3.0.4/gcore -I/tmp/B.lZJ7wH/BUILD/gdal-3.0.4/alg -I/tmp/B.lZJ7wH/BUILD/gdal-3.0.4/ogr -I/tmp/B.lZJ7wH/BUILD/gdal-3.0.4/ogr/ogrsf_frmts -I/tmp/B.lZJ7wH/BUILD/gdal-3.0.4/gnm -I/tmp/B.lZJ7wH/BUILD/gdal-3.0.4/apps -DHAVE_AVX_AT_COMPILE_TIME -DHAVE_SSSE3_AT_COMPILE_TIME -DHAVE_SSE_AT_COMPILE_TIME -O2 -fwrapv -pipe -Wformat -Werror=format-security -gdwarf-4 -fno-debug-types-section -fvar-tracking-assignments -g2 -Wp,-D_FORTIFY_SOURCE=2 -fstack-protector-strong --param=ssp-buffer-size=4 -Werror=trampolines -fPIC -march=x86-64 -gdwarf-4 -fno-debug-types-section -fvar-tracking-assignments -g2  -fvisibility=hidden  -Wall -Wextra -Winit-self -Wunused-parameter -Wformat -Werror=format-security -Wno-format-nonliteral -Wlogical-op -Wshadow -Werror=vla -Wdate-time -Wnull-dereference -Wduplicated-cond -Wextra-semi -Wfloat-conversion -Wmissing-declarations -Wnon-virtual-dtor -Woverloaded-virtual -fno-operator-names -Wzero-as-null-pointer-constant -Wsuggest-override -Wimplicit-fallthrough  -DGNM_ENABLED -I/tmp/B.lZJ7wH/BUILD/gdal-3.0.4/port -I/usr/include/openjpeg-2.3 -I/usr/include  -DGDAL_COMPILATION -DHAVE_XERCES -I/usr/include -I/usr/include/xercesc -I/tmp/B.lZJ7wH/BUILD/gdal-3.0.4/port -I/usr/include/openjpeg-2.3 -I/usr/include  -DGDAL_COMPILATION -c -o ../o/webpdataset.lo webpdataset.cpp
make[2]: Leaving directory '/tmp/B.lZJ7wH/BUILD/gdal-3.0.4/frmts/webp'
/usr/bin/make -C dods install-obj
make[2]: Entering directory '/tmp/B.lZJ7wH/BUILD/gdal-3.0.4/frmts/epsilon'
/bin/sh /tmp/B.lZJ7wH/BUILD/gdal-3.0.4/libtool --mode=compile --silent --tag=CXX x86_64-pld-linux-g++ -I/tmp/B.lZJ7wH/BUILD/gdal-3.0.4/port -I/tmp/B.lZJ7wH/BUILD/gdal-3.0.4/gcore -I/tmp/B.lZJ7wH/BUILD/gdal-3.0.4/alg -I/tmp/B.lZJ7wH/BUILD/gdal-3.0.4/ogr -I/tmp/B.lZJ7wH/BUILD/gdal-3.0.4/ogr/ogrsf_frmts -I/tmp/B.lZJ7wH/BUILD/gdal-3.0.4/gnm -I/tmp/B.lZJ7wH/BUILD/gdal-3.0.4/apps -DHAVE_AVX_AT_COMPILE_TIME -DHAVE_SSSE3_AT_COMPILE_TIME -DHAVE_SSE_AT_COMPILE_TIME -O2 -fwrapv -pipe -Wformat -Werror=format-security -gdwarf-4 -fno-debug-types-section -fvar-tracking-assignments -g2 -Wp,-D_FORTIFY_SOURCE=2 -fstack-protector-strong --param=ssp-buffer-size=4 -Werror=trampolines -fPIC -march=x86-64 -gdwarf-4 -fno-debug-types-section -fvar-tracking-assignments -g2  -fvisibility=hidden  -Wall -Wextra -Winit-self -Wunused-parameter -Wformat -Werror=format-security -Wno-format-nonliteral -Wlogical-op -Wshadow -Werror=vla -Wdate-time -Wnull-dereference -Wduplicated-cond -Wextra-semi -Wfloat-conversion -Wmissing-declarations -Wnon-virtual-dtor -Woverloaded-virtual -fno-operator-names -Wzero-as-null-pointer-constant -Wsuggest-override -Wimplicit-fallthrough   -DGNM_ENABLED -I/tmp/B.lZJ7wH/BUILD/gdal-3.0.4/port -I/usr/include/openjpeg-2.3 -I/usr/include  -DGDAL_COMPILATION -DHAVE_XERCES -I/usr/include -I/usr/include/xercesc -I/tmp/B.lZJ7wH/BUILD/gdal-3.0.4/port -I/usr/include/openjpeg-2.3 -I/usr/include  -DGDAL_COMPILATION -c -o ../o/epsilondataset.lo epsilondataset.cpp
make[2]: Leaving directory '/tmp/B.lZJ7wH/BUILD/gdal-3.0.4/frmts/epsilon'
/usr/bin/make -C openjpeg install-obj
make[2]: Entering directory '/tmp/B.lZJ7wH/BUILD/gdal-3.0.4/frmts/mbtiles'
/bin/sh /tmp/B.lZJ7wH/BUILD/gdal-3.0.4/libtool --mode=compile --silent --tag=CXX x86_64-pld-linux-g++ -I/tmp/B.lZJ7wH/BUILD/gdal-3.0.4/port -I/tmp/B.lZJ7wH/BUILD/gdal-3.0.4/gcore -I/tmp/B.lZJ7wH/BUILD/gdal-3.0.4/alg -I/tmp/B.lZJ7wH/BUILD/gdal-3.0.4/ogr -I/tmp/B.lZJ7wH/BUILD/gdal-3.0.4/ogr/ogrsf_frmts -I/tmp/B.lZJ7wH/BUILD/gdal-3.0.4/gnm -I/tmp/B.lZJ7wH/BUILD/gdal-3.0.4/apps -DHAVE_AVX_AT_COMPILE_TIME -DHAVE_SSSE3_AT_COMPILE_TIME -DHAVE_SSE_AT_COMPILE_TIME -O2 -fwrapv -pipe -Wformat -Werror=format-security -gdwarf-4 -fno-debug-types-section -fvar-tracking-assignments -g2 -Wp,-D_FORTIFY_SOURCE=2 -fstack-protector-strong --param=ssp-buffer-size=4 -Werror=trampolines -fPIC -march=x86-64 -gdwarf-4 -fno-debug-types-section -fvar-tracking-assignments -g2  -fvisibility=hidden  -Wall -Wextra -Winit-self -Wunused-parameter -Wformat -Werror=format-security -Wno-format-nonliteral -Wlogical-op -Wshadow -Werror=vla -Wdate-time -Wnull-dereference -Wduplicated-cond -Wextra-semi -Wfloat-conversion -Wmissing-declarations -Wnon-virtual-dtor -Woverloaded-virtual -fno-operator-names -Wzero-as-null-pointer-constant -Wsuggest-override -Wimplicit-fallthrough  -DHAVE_GEOS=1 -I../../ogr/ogrsf_frmts/geojson -I../../ogr/ogrsf_frmts/mvt -I/usr/include/json-c   -DGNM_ENABLED -I/tmp/B.lZJ7wH/BUILD/gdal-3.0.4/port -I/usr/include/openjpeg-2.3 -I/usr/include  -DGDAL_COMPILATION -DHAVE_XERCES -I/usr/include -I/usr/include/xercesc -I/tmp/B.lZJ7wH/BUILD/gdal-3.0.4/port -I/usr/include/openjpeg-2.3 -I/usr/include  -DGDAL_COMPILATION -I../../ogr -I../../ogr/ogrsf_frmts/gpkg -I../../ogr/ogrsf_frmts/sqlite -I/usr/include -DHAVE_SQLITE -c -o ../o/mbtilesdataset.lo mbtilesdataset.cpp
make[2]: Leaving directory '/tmp/B.lZJ7wH/BUILD/gdal-3.0.4/frmts/mbtiles'
/usr/bin/make -C jpeg2000 install-obj
make[2]: Entering directory '/tmp/B.lZJ7wH/BUILD/gdal-3.0.4/frmts/wms'
/bin/sh /tmp/B.lZJ7wH/BUILD/gdal-3.0.4/libtool --mode=compile --silent --tag=CXX x86_64-pld-linux-g++ -I/tmp/B.lZJ7wH/BUILD/gdal-3.0.4/port -I/tmp/B.lZJ7wH/BUILD/gdal-3.0.4/gcore -I/tmp/B.lZJ7wH/BUILD/gdal-3.0.4/alg -I/tmp/B.lZJ7wH/BUILD/gdal-3.0.4/ogr -I/tmp/B.lZJ7wH/BUILD/gdal-3.0.4/ogr/ogrsf_frmts -I/tmp/B.lZJ7wH/BUILD/gdal-3.0.4/gnm -I/tmp/B.lZJ7wH/BUILD/gdal-3.0.4/apps -DHAVE_AVX_AT_COMPILE_TIME -DHAVE_SSSE3_AT_COMPILE_TIME -DHAVE_SSE_AT_COMPILE_TIME -O2 -fwrapv -pipe -Wformat -Werror=format-security -gdwarf-4 -fno-debug-types-section -fvar-tracking-assignments -g2 -Wp,-D_FORTIFY_SOURCE=2 -fstack-protector-strong --param=ssp-buffer-size=4 -Werror=trampolines -fPIC -march=x86-64 -gdwarf-4 -fno-debug-types-section -fvar-tracking-assignments -g2  -fvisibility=hidden  -Wall -Wextra -Winit-self -Wunused-parameter -Wformat -Werror=format-security -Wno-format-nonliteral -Wlogical-op -Wshadow -Werror=vla -Wdate-time -Wnull-dereference -Wduplicated-cond -Wextra-semi -Wfloat-conversion -Wmissing-declarations -Wnon-virtual-dtor -Woverloaded-virtual -fno-operator-names -Wzero-as-null-pointer-constant -Wsuggest-override -Wimplicit-fallthrough  -DGNM_ENABLED -I/tmp/B.lZJ7wH/BUILD/gdal-3.0.4/port -I/usr/include/openjpeg-2.3 -I/usr/include  -DGDAL_COMPILATION -DHAVE_XERCES -I/usr/include -I/usr/include/xercesc -I/tmp/B.lZJ7wH/BUILD/gdal-3.0.4/port -I/usr/include/openjpeg-2.3 -I/usr/include  -DGDAL_COMPILATION -DHAVE_CURL  -c -o ../o/minidriver_iip.lo minidriver_iip.cpp
make[2]: Leaving directory '/tmp/B.lZJ7wH/BUILD/gdal-3.0.4/frmts/wms'
make[3]: Entering directory '/tmp/B.lZJ7wH/BUILD/gdal-3.0.4/ogr/ogrsf_frmts/couchdb'
/bin/sh /tmp/B.lZJ7wH/BUILD/gdal-3.0.4/libtool --mode=compile --silent --tag=CXX x86_64-pld-linux-g++ -I/tmp/B.lZJ7wH/BUILD/gdal-3.0.4/port -I/tmp/B.lZJ7wH/BUILD/gdal-3.0.4/gcore -I/tmp/B.lZJ7wH/BUILD/gdal-3.0.4/alg -I/tmp/B.lZJ7wH/BUILD/gdal-3.0.4/ogr -I/tmp/B.lZJ7wH/BUILD/gdal-3.0.4/ogr/ogrsf_frmts -I/tmp/B.lZJ7wH/BUILD/gdal-3.0.4/gnm -I/tmp/B.lZJ7wH/BUILD/gdal-3.0.4/apps -DHAVE_AVX_AT_COMPILE_TIME -DHAVE_SSSE3_AT_COMPILE_TIME -DHAVE_SSE_AT_COMPILE_TIME -O2 -fwrapv -pipe -Wformat -Werror=format-security -gdwarf-4 -fno-debug-types-section -fvar-tracking-assignments -g2 -Wp,-D_FORTIFY_SOURCE=2 -fstack-protector-strong --param=ssp-buffer-size=4 -Werror=trampolines -fPIC -march=x86-64 -gdwarf-4 -fno-debug-types-section -fvar-tracking-assignments -g2  -fvisibility=hidden  -Wall -Wextra -Winit-self -Wunused-parameter -Wformat -Werror=format-security -Wno-format-nonliteral -Wlogical-op -Wshadow -Werror=vla -Wdate-time -Wnull-dereference -Wduplicated-cond -Wextra-semi -Wfloat-conversion -Wmissing-declarations -Wnon-virtual-dtor -Woverloaded-virtual -fno-operator-names -Wzero-as-null-pointer-constant -Wsuggest-override -Wimplicit-fallthrough  -I/usr/include/json-c -I.. -I../.. -I../geojson  -DGNM_ENABLED -I/tmp/B.lZJ7wH/BUILD/gdal-3.0.4/port -I/usr/include/openjpeg-2.3 -I/usr/include  -DGDAL_COMPILATION -DHAVE_XERCES -I/usr/include -I/usr/include/xercesc -I/tmp/B.lZJ7wH/BUILD/gdal-3.0.4/port -I/usr/include/openjpeg-2.3 -I/usr/include  -DGDAL_COMPILATION -c -o ../o/ogrcouchdblayer.lo ogrcouchdblayer.cpp
make[3]: Leaving directory '/tmp/B.lZJ7wH/BUILD/gdal-3.0.4/ogr/ogrsf_frmts/couchdb'
make[2]: Entering directory '/tmp/B.lZJ7wH/BUILD/gdal-3.0.4/frmts/pdf'
/bin/sh /tmp/B.lZJ7wH/BUILD/gdal-3.0.4/libtool --mode=compile --silent --tag=CXX x86_64-pld-linux-g++ -I/tmp/B.lZJ7wH/BUILD/gdal-3.0.4/port -I/tmp/B.lZJ7wH/BUILD/gdal-3.0.4/gcore -I/tmp/B.lZJ7wH/BUILD/gdal-3.0.4/alg -I/tmp/B.lZJ7wH/BUILD/gdal-3.0.4/ogr -I/tmp/B.lZJ7wH/BUILD/gdal-3.0.4/ogr/ogrsf_frmts -I/tmp/B.lZJ7wH/BUILD/gdal-3.0.4/gnm -I/tmp/B.lZJ7wH/BUILD/gdal-3.0.4/apps -DHAVE_AVX_AT_COMPILE_TIME -DHAVE_SSSE3_AT_COMPILE_TIME -DHAVE_SSE_AT_COMPILE_TIME -O2 -fwrapv -pipe -Wformat -Werror=format-security -gdwarf-4 -fno-debug-types-section -fvar-tracking-assignments -g2 -Wp,-D_FORTIFY_SOURCE=2 -fstack-protector-strong --param=ssp-buffer-size=4 -Werror=trampolines -fPIC -march=x86-64 -gdwarf-4 -fno-debug-types-section -fvar-tracking-assignments -g2  -fvisibility=hidden  -Wall -Wextra -Winit-self -Wunused-parameter -Wformat -Werror=format-security -Wno-format-nonliteral -Wlogical-op -Wshadow -Werror=vla -Wdate-time -Wnull-dereference -Wduplicated-cond -Wextra-semi -Wfloat-conversion -Wmissing-declarations -Wnon-virtual-dtor -Woverloaded-virtual -fno-operator-names -Wzero-as-null-pointer-constant -Wsuggest-override -Wimplicit-fallthrough  -I../vrt -I../mem -I../../ogr/ogrsf_frmts/mem -DGNM_ENABLED -I/tmp/B.lZJ7wH/BUILD/gdal-3.0.4/port -I/usr/include/openjpeg-2.3 -I/usr/include  -DGDAL_COMPILATION -DHAVE_XERCES -I/usr/include -I/usr/include/xercesc -I/tmp/B.lZJ7wH/BUILD/gdal-3.0.4/port -I/usr/include/openjpeg-2.3 -I/usr/include  -DGDAL_COMPILATION -DHAVE_POPPLER -DPOPPLER_MAJOR_VERSION=20 -DPOPPLER_MINOR_VERSION=10 -I/usr/include -I/usr/include/poppler   -DDO_NOT_USE_DEBUG_BOOL -c -o ../o/pdfio.lo pdfio.cpp
make[2]: Leaving directory '/tmp/B.lZJ7wH/BUILD/gdal-3.0.4/frmts/pdf'
make[2]: Entering directory '/tmp/B.lZJ7wH/BUILD/gdal-3.0.4/frmts/jpeg2000'
/bin/sh /tmp/B.lZJ7wH/BUILD/gdal-3.0.4/libtool --mode=compile --silent --tag=CXX x86_64-pld-linux-g++ -I/tmp/B.lZJ7wH/BUILD/gdal-3.0.4/port -I/tmp/B.lZJ7wH/BUILD/gdal-3.0.4/gcore -I/tmp/B.lZJ7wH/BUILD/gdal-3.0.4/alg -I/tmp/B.lZJ7wH/BUILD/gdal-3.0.4/ogr -I/tmp/B.lZJ7wH/BUILD/gdal-3.0.4/ogr/ogrsf_frmts -I/tmp/B.lZJ7wH/BUILD/gdal-3.0.4/gnm -I/tmp/B.lZJ7wH/BUILD/gdal-3.0.4/apps -DHAVE_AVX_AT_COMPILE_TIME -DHAVE_SSSE3_AT_COMPILE_TIME -DHAVE_SSE_AT_COMPILE_TIME -O2 -fwrapv -pipe -Wformat -Werror=format-security -gdwarf-4 -fno-debug-types-section -fvar-tracking-assignments -g2 -Wp,-D_FORTIFY_SOURCE=2 -fstack-protector-strong --param=ssp-buffer-size=4 -Werror=trampolines -fPIC -march=x86-64 -gdwarf-4 -fno-debug-types-section -fvar-tracking-assignments -g2  -fvisibility=hidden  -Wall -Wextra -Winit-self -Wunused-parameter -Wformat -Werror=format-security -Wno-format-nonliteral -Wlogical-op -Wshadow -Werror=vla -Wdate-time -Wnull-dereference -Wduplicated-cond -Wextra-semi -Wfloat-conversion -Wmissing-declarations -Wnon-virtual-dtor -Woverloaded-virtual -fno-operator-names -Wzero-as-null-pointer-constant -Wsuggest-override -Wimplicit-fallthrough   -DGNM_ENABLED -I/tmp/B.lZJ7wH/BUILD/gdal-3.0.4/port -I/usr/include/openjpeg-2.3 -I/usr/include  -DGDAL_COMPILATION -DHAVE_XERCES -I/usr/include -I/usr/include/xercesc -I/tmp/B.lZJ7wH/BUILD/gdal-3.0.4/port -I/usr/include/openjpeg-2.3 -I/usr/include  -DGDAL_COMPILATION -c -o ../o/jpeg2000dataset.lo jpeg2000dataset.cpp
jpeg2000dataset.cpp: In member function 'int JPEG2000Dataset::DecodeImage()':
jpeg2000dataset.cpp:487:20: warning: comparison of integer expressions of different signedness: 'int' and 'unsigned int' [-Wsign-compare]
  487 |         if (nBands != jas_image_numcmpts( psImage ))
      |                    ^
jpeg2000dataset.cpp:516:32: warning: comparison of integer expressions of different signedness: 'int' and 'unsigned int' [-Wsign-compare]
  516 |             if (poBand->iDepth != jas_image_cmptprec( psImage, iBand ) ||
      |                                ^
jpeg2000dataset.cpp: In static member function 'static GDALDataset* JPEG2000Dataset::Open(GDALOpenInfo*)':
jpeg2000dataset.cpp:611:46: error: invalid conversion from 'const char*' to 'char*' [-fpermissive]
  611 |     if ( !(pszFormatName = jas_image_fmttostr( iFormat )) )
      |                            ~~~~~~~~~~~~~~~~~~^~~~~~~~~~~
      |                                              |
      |                                              const char*
make[2]: *** [../../GDALmake.opt:637: ../o/jpeg2000dataset.lo] Error 1
make[2]: Leaving directory '/tmp/B.lZJ7wH/BUILD/gdal-3.0.4/frmts/jpeg2000'
make[1]: *** [GNUmakefile:15: jpeg2000-install-obj] Error 2
make[1]: *** Waiting for unfinished jobs....
make[2]: Entering directory '/tmp/B.lZJ7wH/BUILD/gdal-3.0.4/frmts/pdf'
/bin/sh /tmp/B.lZJ7wH/BUILD/gdal-3.0.4/libtool --mode=compile --silent --tag=CXX x86_64-pld-linux-g++ -I/tmp/B.lZJ7wH/BUILD/gdal-3.0.4/port -I/tmp/B.lZJ7wH/BUILD/gdal-3.0.4/gcore -I/tmp/B.lZJ7wH/BUILD/gdal-3.0.4/alg -I/tmp/B.lZJ7wH/BUILD/gdal-3.0.4/ogr -I/tmp/B.lZJ7wH/BUILD/gdal-3.0.4/ogr/ogrsf_frmts -I/tmp/B.lZJ7wH/BUILD/gdal-3.0.4/gnm -I/tmp/B.lZJ7wH/BUILD/gdal-3.0.4/apps -DHAVE_AVX_AT_COMPILE_TIME -DHAVE_SSSE3_AT_COMPILE_TIME -DHAVE_SSE_AT_COMPILE_TIME -O2 -fwrapv -pipe -Wformat -Werror=format-security -gdwarf-4 -fno-debug-types-section -fvar-tracking-assignments -g2 -Wp,-D_FORTIFY_SOURCE=2 -fstack-protector-strong --param=ssp-buffer-size=4 -Werror=trampolines -fPIC -march=x86-64 -gdwarf-4 -fno-debug-types-section -fvar-tracking-assignments -g2  -fvisibility=hidden  -Wall -Wextra -Winit-self -Wunused-parameter -Wformat -Werror=format-security -Wno-format-nonliteral -Wlogical-op -Wshadow -Werror=vla -Wdate-time -Wnull-dereference -Wduplicated-cond -Wextra-semi -Wfloat-conversion -Wmissing-declarations -Wnon-virtual-dtor -Woverloaded-virtual -fno-operator-names -Wzero-as-null-pointer-constant -Wsuggest-override -Wimplicit-fallthrough  -I../vrt -I../mem -I../../ogr/ogrsf_frmts/mem -DGNM_ENABLED -I/tmp/B.lZJ7wH/BUILD/gdal-3.0.4/port -I/usr/include/openjpeg-2.3 -I/usr/include  -DGDAL_COMPILATION -DHAVE_XERCES -I/usr/include -I/usr/include/xercesc -I/tmp/B.lZJ7wH/BUILD/gdal-3.0.4/port -I/usr/include/openjpeg-2.3 -I/usr/include  -DGDAL_COMPILATION -DHAVE_POPPLER -DPOPPLER_MAJOR_VERSION=20 -DPOPPLER_MINOR_VERSION=10 -I/usr/include -I/usr/include/poppler   -DDO_NOT_USE_DEBUG_BOOL -c -o ../o/pdfobject.lo pdfobject.cpp
make[2]: Leaving directory '/tmp/B.lZJ7wH/BUILD/gdal-3.0.4/frmts/pdf'
make[3]: Entering directory '/tmp/B.lZJ7wH/BUILD/gdal-3.0.4/ogr/ogrsf_frmts/couchdb'
/bin/sh /tmp/B.lZJ7wH/BUILD/gdal-3.0.4/libtool --mode=compile --silent --tag=CXX x86_64-pld-linux-g++ -I/tmp/B.lZJ7wH/BUILD/gdal-3.0.4/port -I/tmp/B.lZJ7wH/BUILD/gdal-3.0.4/gcore -I/tmp/B.lZJ7wH/BUILD/gdal-3.0.4/alg -I/tmp/B.lZJ7wH/BUILD/gdal-3.0.4/ogr -I/tmp/B.lZJ7wH/BUILD/gdal-3.0.4/ogr/ogrsf_frmts -I/tmp/B.lZJ7wH/BUILD/gdal-3.0.4/gnm -I/tmp/B.lZJ7wH/BUILD/gdal-3.0.4/apps -DHAVE_AVX_AT_COMPILE_TIME -DHAVE_SSSE3_AT_COMPILE_TIME -DHAVE_SSE_AT_COMPILE_TIME -O2 -fwrapv -pipe -Wformat -Werror=format-security -gdwarf-4 -fno-debug-types-section -fvar-tracking-assignments -g2 -Wp,-D_FORTIFY_SOURCE=2 -fstack-protector-strong --param=ssp-buffer-size=4 -Werror=trampolines -fPIC -march=x86-64 -gdwarf-4 -fno-debug-types-section -fvar-tracking-assignments -g2  -fvisibility=hidden  -Wall -Wextra -Winit-self -Wunused-parameter -Wformat -Werror=format-security -Wno-format-nonliteral -Wlogical-op -Wshadow -Werror=vla -Wdate-time -Wnull-dereference -Wduplicated-cond -Wextra-semi -Wfloat-conversion -Wmissing-declarations -Wnon-virtual-dtor -Woverloaded-virtual -fno-operator-names -Wzero-as-null-pointer-constant -Wsuggest-override -Wimplicit-fallthrough  -I/usr/include/json-c -I.. -I../.. -I../geojson  -DGNM_ENABLED -I/tmp/B.lZJ7wH/BUILD/gdal-3.0.4/port -I/usr/include/openjpeg-2.3 -I/usr/include  -DGDAL_COMPILATION -DHAVE_XERCES -I/usr/include -I/usr/include/xercesc -I/tmp/B.lZJ7wH/BUILD/gdal-3.0.4/port -I/usr/include/openjpeg-2.3 -I/usr/include  -DGDAL_COMPILATION -c -o ../o/ogrcouchdbrowslayer.lo ogrcouchdbrowslayer.cpp
make[3]: Leaving directory '/tmp/B.lZJ7wH/BUILD/gdal-3.0.4/ogr/ogrsf_frmts/couchdb'
make[3]: Entering directory '/tmp/B.lZJ7wH/BUILD/gdal-3.0.4/ogr/ogrsf_frmts/couchdb'
/bin/sh /tmp/B.lZJ7wH/BUILD/gdal-3.0.4/libtool --mode=compile --silent --tag=CXX x86_64-pld-linux-g++ -I/tmp/B.lZJ7wH/BUILD/gdal-3.0.4/port -I/tmp/B.lZJ7wH/BUILD/gdal-3.0.4/gcore -I/tmp/B.lZJ7wH/BUILD/gdal-3.0.4/alg -I/tmp/B.lZJ7wH/BUILD/gdal-3.0.4/ogr -I/tmp/B.lZJ7wH/BUILD/gdal-3.0.4/ogr/ogrsf_frmts -I/tmp/B.lZJ7wH/BUILD/gdal-3.0.4/gnm -I/tmp/B.lZJ7wH/BUILD/gdal-3.0.4/apps -DHAVE_AVX_AT_COMPILE_TIME -DHAVE_SSSE3_AT_COMPILE_TIME -DHAVE_SSE_AT_COMPILE_TIME -O2 -fwrapv -pipe -Wformat -Werror=format-security -gdwarf-4 -fno-debug-types-section -fvar-tracking-assignments -g2 -Wp,-D_FORTIFY_SOURCE=2 -fstack-protector-strong --param=ssp-buffer-size=4 -Werror=trampolines -fPIC -march=x86-64 -gdwarf-4 -fno-debug-types-section -fvar-tracking-assignments -g2  -fvisibility=hidden  -Wall -Wextra -Winit-self -Wunused-parameter -Wformat -Werror=format-security -Wno-format-nonliteral -Wlogical-op -Wshadow -Werror=vla -Wdate-time -Wnull-dereference -Wduplicated-cond -Wextra-semi -Wfloat-conversion -Wmissing-declarations -Wnon-virtual-dtor -Woverloaded-virtual -fno-operator-names -Wzero-as-null-pointer-constant -Wsuggest-override -Wimplicit-fallthrough  -I/usr/include/json-c -I.. -I../.. -I../geojson  -DGNM_ENABLED -I/tmp/B.lZJ7wH/BUILD/gdal-3.0.4/port -I/usr/include/openjpeg-2.3 -I/usr/include  -DGDAL_COMPILATION -DHAVE_XERCES -I/usr/include -I/usr/include/xercesc -I/tmp/B.lZJ7wH/BUILD/gdal-3.0.4/port -I/usr/include/openjpeg-2.3 -I/usr/include  -DGDAL_COMPILATION -c -o ../o/ogrcouchdbtablelayer.lo ogrcouchdbtablelayer.cpp
make[3]: Leaving directory '/tmp/B.lZJ7wH/BUILD/gdal-3.0.4/ogr/ogrsf_frmts/couchdb'
/usr/bin/make -C elastic
make[2]: Entering directory '/tmp/B.lZJ7wH/BUILD/gdal-3.0.4/frmts/dods'
/bin/sh /tmp/B.lZJ7wH/BUILD/gdal-3.0.4/libtool --mode=compile --silent --tag=CXX x86_64-pld-linux-g++ -I/tmp/B.lZJ7wH/BUILD/gdal-3.0.4/port -I/tmp/B.lZJ7wH/BUILD/gdal-3.0.4/gcore -I/tmp/B.lZJ7wH/BUILD/gdal-3.0.4/alg -I/tmp/B.lZJ7wH/BUILD/gdal-3.0.4/ogr -I/tmp/B.lZJ7wH/BUILD/gdal-3.0.4/ogr/ogrsf_frmts -I/tmp/B.lZJ7wH/BUILD/gdal-3.0.4/gnm -I/tmp/B.lZJ7wH/BUILD/gdal-3.0.4/apps -DHAVE_AVX_AT_COMPILE_TIME -DHAVE_SSSE3_AT_COMPILE_TIME -DHAVE_SSE_AT_COMPILE_TIME -O2 -fwrapv -pipe -Wformat -Werror=format-security -gdwarf-4 -fno-debug-types-section -fvar-tracking-assignments -g2 -Wp,-D_FORTIFY_SOURCE=2 -fstack-protector-strong --param=ssp-buffer-size=4 -Werror=trampolines -fPIC -march=x86-64 -gdwarf-4 -fno-debug-types-section -fvar-tracking-assignments -g2  -fvisibility=hidden  -Wall -Wextra -Winit-self -Wunused-parameter -Wformat -Werror=format-security -Wno-format-nonliteral -Wlogical-op -Wshadow -Werror=vla -Wdate-time -Wnull-dereference -Wduplicated-cond -Wextra-semi -Wfloat-conversion -Wmissing-declarations -Wnon-virtual-dtor -Woverloaded-virtual -fno-operator-names -Wzero-as-null-pointer-constant -Wsuggest-override -Wimplicit-fallthrough  -DGNM_ENABLED -I/tmp/B.lZJ7wH/BUILD/gdal-3.0.4/port -I/usr/include/openjpeg-2.3 -I/usr/include  -DGDAL_COMPILATION -DHAVE_XERCES -I/usr/include -I/usr/include/xercesc -I/tmp/B.lZJ7wH/BUILD/gdal-3.0.4/port -I/usr/include/openjpeg-2.3 -I/usr/include  -DGDAL_COMPILATION -I/usr/include/libdap -I/usr/include/libxml2 -I/usr/include/libdap -I/usr/include/libxml2  -DLIBDAP_310 -DLIBDAP_39 -I/usr/include/tirpc -c -o ../o/dodsdataset2.lo dodsdataset2.cpp
make[2]: Leaving directory '/tmp/B.lZJ7wH/BUILD/gdal-3.0.4/frmts/dods'
/usr/bin/make -C gft
make[2]: Entering directory '/tmp/B.lZJ7wH/BUILD/gdal-3.0.4/frmts/wms'
/bin/sh /tmp/B.lZJ7wH/BUILD/gdal-3.0.4/libtool --mode=compile --silent --tag=CXX x86_64-pld-linux-g++ -I/tmp/B.lZJ7wH/BUILD/gdal-3.0.4/port -I/tmp/B.lZJ7wH/BUILD/gdal-3.0.4/gcore -I/tmp/B.lZJ7wH/BUILD/gdal-3.0.4/alg -I/tmp/B.lZJ7wH/BUILD/gdal-3.0.4/ogr -I/tmp/B.lZJ7wH/BUILD/gdal-3.0.4/ogr/ogrsf_frmts -I/tmp/B.lZJ7wH/BUILD/gdal-3.0.4/gnm -I/tmp/B.lZJ7wH/BUILD/gdal-3.0.4/apps -DHAVE_AVX_AT_COMPILE_TIME -DHAVE_SSSE3_AT_COMPILE_TIME -DHAVE_SSE_AT_COMPILE_TIME -O2 -fwrapv -pipe -Wformat -Werror=format-security -gdwarf-4 -fno-debug-types-section -fvar-tracking-assignments -g2 -Wp,-D_FORTIFY_SOURCE=2 -fstack-protector-strong --param=ssp-buffer-size=4 -Werror=trampolines -fPIC -march=x86-64 -gdwarf-4 -fno-debug-types-section -fvar-tracking-assignments -g2  -fvisibility=hidden  -Wall -Wextra -Winit-self -Wunused-parameter -Wformat -Werror=format-security -Wno-format-nonliteral -Wlogical-op -Wshadow -Werror=vla -Wdate-time -Wnull-dereference -Wduplicated-cond -Wextra-semi -Wfloat-conversion -Wmissing-declarations -Wnon-virtual-dtor -Woverloaded-virtual -fno-operator-names -Wzero-as-null-pointer-constant -Wsuggest-override -Wimplicit-fallthrough  -DGNM_ENABLED -I/tmp/B.lZJ7wH/BUILD/gdal-3.0.4/port -I/usr/include/openjpeg-2.3 -I/usr/include  -DGDAL_COMPILATION -DHAVE_XERCES -I/usr/include -I/usr/include/xercesc -I/tmp/B.lZJ7wH/BUILD/gdal-3.0.4/port -I/usr/include/openjpeg-2.3 -I/usr/include  -DGDAL_COMPILATION -DHAVE_CURL  -c -o ../o/minidriver_mrf.lo minidriver_mrf.cpp
make[2]: Leaving directory '/tmp/B.lZJ7wH/BUILD/gdal-3.0.4/frmts/wms'
make[2]: Entering directory '/tmp/B.lZJ7wH/BUILD/gdal-3.0.4/frmts/openjpeg'
/bin/sh /tmp/B.lZJ7wH/BUILD/gdal-3.0.4/libtool --mode=compile --silent --tag=CXX x86_64-pld-linux-g++ -I/tmp/B.lZJ7wH/BUILD/gdal-3.0.4/port -I/tmp/B.lZJ7wH/BUILD/gdal-3.0.4/gcore -I/tmp/B.lZJ7wH/BUILD/gdal-3.0.4/alg -I/tmp/B.lZJ7wH/BUILD/gdal-3.0.4/ogr -I/tmp/B.lZJ7wH/BUILD/gdal-3.0.4/ogr/ogrsf_frmts -I/tmp/B.lZJ7wH/BUILD/gdal-3.0.4/gnm -I/tmp/B.lZJ7wH/BUILD/gdal-3.0.4/apps -DHAVE_AVX_AT_COMPILE_TIME -DHAVE_SSSE3_AT_COMPILE_TIME -DHAVE_SSE_AT_COMPILE_TIME -O2 -fwrapv -pipe -Wformat -Werror=format-security -gdwarf-4 -fno-debug-types-section -fvar-tracking-assignments -g2 -Wp,-D_FORTIFY_SOURCE=2 -fstack-protector-strong --param=ssp-buffer-size=4 -Werror=trampolines -fPIC -march=x86-64 -gdwarf-4 -fno-debug-types-section -fvar-tracking-assignments -g2  -fvisibility=hidden  -Wall -Wextra -Winit-self -Wunused-parameter -Wformat -Werror=format-security -Wno-format-nonliteral -Wlogical-op -Wshadow -Werror=vla -Wdate-time -Wnull-dereference -Wduplicated-cond -Wextra-semi -Wfloat-conversion -Wmissing-declarations -Wnon-virtual-dtor -Woverloaded-virtual -fno-operator-names -Wzero-as-null-pointer-constant -Wsuggest-override -Wimplicit-fallthrough  -I.. -DGNM_ENABLED -I/tmp/B.lZJ7wH/BUILD/gdal-3.0.4/port -I/usr/include/openjpeg-2.3 -I/usr/include  -DGDAL_COMPILATION -DHAVE_XERCES -I/usr/include -I/usr/include/xercesc -I/tmp/B.lZJ7wH/BUILD/gdal-3.0.4/port -I/usr/include/openjpeg-2.3 -I/usr/include  -DGDAL_COMPILATION -c -o ../o/openjpegdataset.lo openjpegdataset.cpp
make[2]: Leaving directory '/tmp/B.lZJ7wH/BUILD/gdal-3.0.4/frmts/openjpeg'
make[2]: Entering directory '/tmp/B.lZJ7wH/BUILD/gdal-3.0.4/frmts/pdf'
/bin/sh /tmp/B.lZJ7wH/BUILD/gdal-3.0.4/libtool --mode=compile --silent --tag=CXX x86_64-pld-linux-g++ -I/tmp/B.lZJ7wH/BUILD/gdal-3.0.4/port -I/tmp/B.lZJ7wH/BUILD/gdal-3.0.4/gcore -I/tmp/B.lZJ7wH/BUILD/gdal-3.0.4/alg -I/tmp/B.lZJ7wH/BUILD/gdal-3.0.4/ogr -I/tmp/B.lZJ7wH/BUILD/gdal-3.0.4/ogr/ogrsf_frmts -I/tmp/B.lZJ7wH/BUILD/gdal-3.0.4/gnm -I/tmp/B.lZJ7wH/BUILD/gdal-3.0.4/apps -DHAVE_AVX_AT_COMPILE_TIME -DHAVE_SSSE3_AT_COMPILE_TIME -DHAVE_SSE_AT_COMPILE_TIME -O2 -fwrapv -pipe -Wformat -Werror=format-security -gdwarf-4 -fno-debug-types-section -fvar-tracking-assignments -g2 -Wp,-D_FORTIFY_SOURCE=2 -fstack-protector-strong --param=ssp-buffer-size=4 -Werror=trampolines -fPIC -march=x86-64 -gdwarf-4 -fno-debug-types-section -fvar-tracking-assignments -g2  -fvisibility=hidden  -Wall -Wextra -Winit-self -Wunused-parameter -Wformat -Werror=format-security -Wno-format-nonliteral -Wlogical-op -Wshadow -Werror=vla -Wdate-time -Wnull-dereference -Wduplicated-cond -Wextra-semi -Wfloat-conversion -Wmissing-declarations -Wnon-virtual-dtor -Woverloaded-virtual -fno-operator-names -Wzero-as-null-pointer-constant -Wsuggest-override -Wimplicit-fallthrough  -I../vrt -I../mem -I../../ogr/ogrsf_frmts/mem -DGNM_ENABLED -I/tmp/B.lZJ7wH/BUILD/gdal-3.0.4/port -I/usr/include/openjpeg-2.3 -I/usr/include  -DGDAL_COMPILATION -DHAVE_XERCES -I/usr/include -I/usr/include/xercesc -I/tmp/B.lZJ7wH/BUILD/gdal-3.0.4/port -I/usr/include/openjpeg-2.3 -I/usr/include  -DGDAL_COMPILATION -DHAVE_POPPLER -DPOPPLER_MAJOR_VERSION=20 -DPOPPLER_MINOR_VERSION=10 -I/usr/include -I/usr/include/poppler   -DDO_NOT_USE_DEBUG_BOOL -c -o ../o/pdfdataset.lo pdfdataset.cpp
make[2]: Leaving directory '/tmp/B.lZJ7wH/BUILD/gdal-3.0.4/frmts/pdf'
make[2]: Entering directory '/tmp/B.lZJ7wH/BUILD/gdal-3.0.4/frmts/pdf'
/bin/sh /tmp/B.lZJ7wH/BUILD/gdal-3.0.4/libtool --mode=compile --silent --tag=CXX x86_64-pld-linux-g++ -I/tmp/B.lZJ7wH/BUILD/gdal-3.0.4/port -I/tmp/B.lZJ7wH/BUILD/gdal-3.0.4/gcore -I/tmp/B.lZJ7wH/BUILD/gdal-3.0.4/alg -I/tmp/B.lZJ7wH/BUILD/gdal-3.0.4/ogr -I/tmp/B.lZJ7wH/BUILD/gdal-3.0.4/ogr/ogrsf_frmts -I/tmp/B.lZJ7wH/BUILD/gdal-3.0.4/gnm -I/tmp/B.lZJ7wH/BUILD/gdal-3.0.4/apps -DHAVE_AVX_AT_COMPILE_TIME -DHAVE_SSSE3_AT_COMPILE_TIME -DHAVE_SSE_AT_COMPILE_TIME -O2 -fwrapv -pipe -Wformat -Werror=format-security -gdwarf-4 -fno-debug-types-section -fvar-tracking-assignments -g2 -Wp,-D_FORTIFY_SOURCE=2 -fstack-protector-strong --param=ssp-buffer-size=4 -Werror=trampolines -fPIC -march=x86-64 -gdwarf-4 -fno-debug-types-section -fvar-tracking-assignments -g2  -fvisibility=hidden  -Wall -Wextra -Winit-self -Wunused-parameter -Wformat -Werror=format-security -Wno-format-nonliteral -Wlogical-op -Wshadow -Werror=vla -Wdate-time -Wnull-dereference -Wduplicated-cond -Wextra-semi -Wfloat-conversion -Wmissing-declarations -Wnon-virtual-dtor -Woverloaded-virtual -fno-operator-names -Wzero-as-null-pointer-constant -Wsuggest-override -Wimplicit-fallthrough  -I../vrt -I../mem -I../../ogr/ogrsf_frmts/mem -DGNM_ENABLED -I/tmp/B.lZJ7wH/BUILD/gdal-3.0.4/port -I/usr/include/openjpeg-2.3 -I/usr/include  -DGDAL_COMPILATION -DHAVE_XERCES -I/usr/include -I/usr/include/xercesc -I/tmp/B.lZJ7wH/BUILD/gdal-3.0.4/port -I/usr/include/openjpeg-2.3 -I/usr/include  -DGDAL_COMPILATION -DHAVE_POPPLER -DPOPPLER_MAJOR_VERSION=20 -DPOPPLER_MINOR_VERSION=10 -I/usr/include -I/usr/include/poppler   -DDO_NOT_USE_DEBUG_BOOL -c -o ../o/ogrpdflayer.lo ogrpdflayer.cpp
make[2]: Leaving directory '/tmp/B.lZJ7wH/BUILD/gdal-3.0.4/frmts/pdf'
make[3]: Entering directory '/tmp/B.lZJ7wH/BUILD/gdal-3.0.4/ogr/ogrsf_frmts/gft'
/bin/sh /tmp/B.lZJ7wH/BUILD/gdal-3.0.4/libtool --mode=compile --silent --tag=CXX x86_64-pld-linux-g++ -I/tmp/B.lZJ7wH/BUILD/gdal-3.0.4/port -I/tmp/B.lZJ7wH/BUILD/gdal-3.0.4/gcore -I/tmp/B.lZJ7wH/BUILD/gdal-3.0.4/alg -I/tmp/B.lZJ7wH/BUILD/gdal-3.0.4/ogr -I/tmp/B.lZJ7wH/BUILD/gdal-3.0.4/ogr/ogrsf_frmts -I/tmp/B.lZJ7wH/BUILD/gdal-3.0.4/gnm -I/tmp/B.lZJ7wH/BUILD/gdal-3.0.4/apps -DHAVE_AVX_AT_COMPILE_TIME -DHAVE_SSSE3_AT_COMPILE_TIME -DHAVE_SSE_AT_COMPILE_TIME -O2 -fwrapv -pipe -Wformat -Werror=format-security -gdwarf-4 -fno-debug-types-section -fvar-tracking-assignments -g2 -Wp,-D_FORTIFY_SOURCE=2 -fstack-protector-strong --param=ssp-buffer-size=4 -Werror=trampolines -fPIC -march=x86-64 -gdwarf-4 -fno-debug-types-section -fvar-tracking-assignments -g2  -fvisibility=hidden  -Wall -Wextra -Winit-self -Wunused-parameter -Wformat -Werror=format-security -Wno-format-nonliteral -Wlogical-op -Wshadow -Werror=vla -Wdate-time -Wnull-dereference -Wduplicated-cond -Wextra-semi -Wfloat-conversion -Wmissing-declarations -Wnon-virtual-dtor -Woverloaded-virtual -fno-operator-names -Wzero-as-null-pointer-constant -Wsuggest-override -Wimplicit-fallthrough  -I.. -I../..  -DGNM_ENABLED -I/tmp/B.lZJ7wH/BUILD/gdal-3.0.4/port -I/usr/include/openjpeg-2.3 -I/usr/include  -DGDAL_COMPILATION -DHAVE_XERCES -I/usr/include -I/usr/include/xercesc -I/tmp/B.lZJ7wH/BUILD/gdal-3.0.4/port -I/usr/include/openjpeg-2.3 -I/usr/include  -DGDAL_COMPILATION -c -o ../o/ogrgftdriver.lo ogrgftdriver.cpp
make[3]: Leaving directory '/tmp/B.lZJ7wH/BUILD/gdal-3.0.4/ogr/ogrsf_frmts/gft'
make[3]: Entering directory '/tmp/B.lZJ7wH/BUILD/gdal-3.0.4/ogr/ogrsf_frmts/elastic'
/bin/sh /tmp/B.lZJ7wH/BUILD/gdal-3.0.4/libtool --mode=compile --silent --tag=CXX x86_64-pld-linux-g++ -I/tmp/B.lZJ7wH/BUILD/gdal-3.0.4/port -I/tmp/B.lZJ7wH/BUILD/gdal-3.0.4/gcore -I/tmp/B.lZJ7wH/BUILD/gdal-3.0.4/alg -I/tmp/B.lZJ7wH/BUILD/gdal-3.0.4/ogr -I/tmp/B.lZJ7wH/BUILD/gdal-3.0.4/ogr/ogrsf_frmts -I/tmp/B.lZJ7wH/BUILD/gdal-3.0.4/gnm -I/tmp/B.lZJ7wH/BUILD/gdal-3.0.4/apps -DHAVE_AVX_AT_COMPILE_TIME -DHAVE_SSSE3_AT_COMPILE_TIME -DHAVE_SSE_AT_COMPILE_TIME -O2 -fwrapv -pipe -Wformat -Werror=format-security -gdwarf-4 -fno-debug-types-section -fvar-tracking-assignments -g2 -Wp,-D_FORTIFY_SOURCE=2 -fstack-protector-strong --param=ssp-buffer-size=4 -Werror=trampolines -fPIC -march=x86-64 -gdwarf-4 -fno-debug-types-section -fvar-tracking-assignments -g2  -fvisibility=hidden  -Wall -Wextra -Winit-self -Wunused-parameter -Wformat -Werror=format-security -Wno-format-nonliteral -Wlogical-op -Wshadow -Werror=vla -Wdate-time -Wnull-dereference -Wduplicated-cond -Wextra-semi -Wfloat-conversion -Wmissing-declarations -Wnon-virtual-dtor -Woverloaded-virtual -fno-operator-names -Wzero-as-null-pointer-constant -Wsuggest-override -Wimplicit-fallthrough  -I/usr/include/json-c -I.. -I../.. -I../geojson -DGNM_ENABLED -I/tmp/B.lZJ7wH/BUILD/gdal-3.0.4/port -I/usr/include/openjpeg-2.3 -I/usr/include  -DGDAL_COMPILATION -DHAVE_XERCES -I/usr/include -I/usr/include/xercesc -I/tmp/B.lZJ7wH/BUILD/gdal-3.0.4/port -I/usr/include/openjpeg-2.3 -I/usr/include  -DGDAL_COMPILATION -c -o ../o/ogrelasticdriver.lo ogrelasticdriver.cpp
make[3]: Leaving directory '/tmp/B.lZJ7wH/BUILD/gdal-3.0.4/ogr/ogrsf_frmts/elastic'
make[1]: Entering directory '/tmp/B.lZJ7wH/BUILD/gdal-3.0.4/ogr'
/bin/sh /tmp/B.lZJ7wH/BUILD/gdal-3.0.4/libtool --mode=compile --silent --tag=CXX x86_64-pld-linux-g++ -I/tmp/B.lZJ7wH/BUILD/gdal-3.0.4/port -I/tmp/B.lZJ7wH/BUILD/gdal-3.0.4/gcore -I/tmp/B.lZJ7wH/BUILD/gdal-3.0.4/alg -I/tmp/B.lZJ7wH/BUILD/gdal-3.0.4/ogr -I/tmp/B.lZJ7wH/BUILD/gdal-3.0.4/ogr/ogrsf_frmts -I/tmp/B.lZJ7wH/BUILD/gdal-3.0.4/gnm -I/tmp/B.lZJ7wH/BUILD/gdal-3.0.4/apps -Weffc++ -Wold-style-cast -DHAVE_MITAB -DHAVE_AVX_AT_COMPILE_TIME -DHAVE_SSSE3_AT_COMPILE_TIME -DHAVE_SSE_AT_COMPILE_TIME -O2 -fwrapv -pipe -Wformat -Werror=format-security -gdwarf-4 -fno-debug-types-section -fvar-tracking-assignments -g2 -Wp,-D_FORTIFY_SOURCE=2 -fstack-protector-strong --param=ssp-buffer-size=4 -Werror=trampolines -fPIC -march=x86-64 -gdwarf-4 -fno-debug-types-section -fvar-tracking-assignments -g2  -fvisibility=hidden  -Wall -Wextra -Winit-self -Wunused-parameter -Wformat -Werror=format-security -Wno-format-nonliteral -Wlogical-op -Wshadow -Werror=vla -Wdate-time -Wnull-dereference -Wduplicated-cond -Wextra-semi -Wfloat-conversion -Wmissing-declarations -Wnon-virtual-dtor -Woverloaded-virtual -fno-operator-names -Wzero-as-null-pointer-constant -Wsuggest-override -Wimplicit-fallthrough  -Iogrsf_frmts -Iogrsf_frmts/mem -Iogrsf_frmts/geojson -I/usr/include/json-c -I.    -DHAVE_XERCES -I/usr/include -I/usr/include/xercesc -DHAVE_EXPAT -I/usr/include -DHAVE_GEOS=1 -I/usr/include -DGNM_ENABLED -I/tmp/B.lZJ7wH/BUILD/gdal-3.0.4/port -I/usr/include/openjpeg-2.3 -I/usr/include  -DGDAL_COMPILATION -DHAVE_XERCES -I/usr/include -I/usr/include/xercesc -I/tmp/B.lZJ7wH/BUILD/gdal-3.0.4/port -I/usr/include/openjpeg-2.3 -I/usr/include  -DGDAL_COMPILATION  -c -o swq_expr_node.lo swq_expr_node.cpp
make[1]: Leaving directory '/tmp/B.lZJ7wH/BUILD/gdal-3.0.4/ogr'
make[1]: Entering directory '/tmp/B.lZJ7wH/BUILD/gdal-3.0.4/ogr'
/bin/sh /tmp/B.lZJ7wH/BUILD/gdal-3.0.4/libtool --mode=compile --silent --tag=CXX x86_64-pld-linux-g++ -I/tmp/B.lZJ7wH/BUILD/gdal-3.0.4/port -I/tmp/B.lZJ7wH/BUILD/gdal-3.0.4/gcore -I/tmp/B.lZJ7wH/BUILD/gdal-3.0.4/alg -I/tmp/B.lZJ7wH/BUILD/gdal-3.0.4/ogr -I/tmp/B.lZJ7wH/BUILD/gdal-3.0.4/ogr/ogrsf_frmts -I/tmp/B.lZJ7wH/BUILD/gdal-3.0.4/gnm -I/tmp/B.lZJ7wH/BUILD/gdal-3.0.4/apps -Weffc++ -Wold-style-cast -DHAVE_MITAB -DHAVE_AVX_AT_COMPILE_TIME -DHAVE_SSSE3_AT_COMPILE_TIME -DHAVE_SSE_AT_COMPILE_TIME -O2 -fwrapv -pipe -Wformat -Werror=format-security -gdwarf-4 -fno-debug-types-section -fvar-tracking-assignments -g2 -Wp,-D_FORTIFY_SOURCE=2 -fstack-protector-strong --param=ssp-buffer-size=4 -Werror=trampolines -fPIC -march=x86-64 -gdwarf-4 -fno-debug-types-section -fvar-tracking-assignments -g2  -fvisibility=hidden  -Wall -Wextra -Winit-self -Wunused-parameter -Wformat -Werror=format-security -Wno-format-nonliteral -Wlogical-op -Wshadow -Werror=vla -Wdate-time -Wnull-dereference -Wduplicated-cond -Wextra-semi -Wfloat-conversion -Wmissing-declarations -Wnon-virtual-dtor -Woverloaded-virtual -fno-operator-names -Wzero-as-null-pointer-constant -Wsuggest-override -Wimplicit-fallthrough  -Iogrsf_frmts -Iogrsf_frmts/mem -Iogrsf_frmts/geojson -I/usr/include/json-c -I.    -DHAVE_XERCES -I/usr/include -I/usr/include/xercesc -DHAVE_EXPAT -I/usr/include -DHAVE_GEOS=1 -I/usr/include -DGNM_ENABLED -I/tmp/B.lZJ7wH/BUILD/gdal-3.0.4/port -I/usr/include/openjpeg-2.3 -I/usr/include  -DGDAL_COMPILATION -DHAVE_XERCES -I/usr/include -I/usr/include/xercesc -I/tmp/B.lZJ7wH/BUILD/gdal-3.0.4/port -I/usr/include/openjpeg-2.3 -I/usr/include  -DGDAL_COMPILATION  -Wno-logical-op -c -o swq_parser.lo swq_parser.cpp
make[1]: Leaving directory '/tmp/B.lZJ7wH/BUILD/gdal-3.0.4/ogr'
make[2]: Entering directory '/tmp/B.lZJ7wH/BUILD/gdal-3.0.4/frmts/pdf'
/bin/sh /tmp/B.lZJ7wH/BUILD/gdal-3.0.4/libtool --mode=compile --silent --tag=CXX x86_64-pld-linux-g++ -I/tmp/B.lZJ7wH/BUILD/gdal-3.0.4/port -I/tmp/B.lZJ7wH/BUILD/gdal-3.0.4/gcore -I/tmp/B.lZJ7wH/BUILD/gdal-3.0.4/alg -I/tmp/B.lZJ7wH/BUILD/gdal-3.0.4/ogr -I/tmp/B.lZJ7wH/BUILD/gdal-3.0.4/ogr/ogrsf_frmts -I/tmp/B.lZJ7wH/BUILD/gdal-3.0.4/gnm -I/tmp/B.lZJ7wH/BUILD/gdal-3.0.4/apps -DHAVE_AVX_AT_COMPILE_TIME -DHAVE_SSSE3_AT_COMPILE_TIME -DHAVE_SSE_AT_COMPILE_TIME -O2 -fwrapv -pipe -Wformat -Werror=format-security -gdwarf-4 -fno-debug-types-section -fvar-tracking-assignments -g2 -Wp,-D_FORTIFY_SOURCE=2 -fstack-protector-strong --param=ssp-buffer-size=4 -Werror=trampolines -fPIC -march=x86-64 -gdwarf-4 -fno-debug-types-section -fvar-tracking-assignments -g2  -fvisibility=hidden  -Wall -Wextra -Winit-self -Wunused-parameter -Wformat -Werror=format-security -Wno-format-nonliteral -Wlogical-op -Wshadow -Werror=vla -Wdate-time -Wnull-dereference -Wduplicated-cond -Wextra-semi -Wfloat-conversion -Wmissing-declarations -Wnon-virtual-dtor -Woverloaded-virtual -fno-operator-names -Wzero-as-null-pointer-constant -Wsuggest-override -Wimplicit-fallthrough  -I../vrt -I../mem -I../../ogr/ogrsf_frmts/mem -DGNM_ENABLED -I/tmp/B.lZJ7wH/BUILD/gdal-3.0.4/port -I/usr/include/openjpeg-2.3 -I/usr/include  -DGDAL_COMPILATION -DHAVE_XERCES -I/usr/include -I/usr/include/xercesc -I/tmp/B.lZJ7wH/BUILD/gdal-3.0.4/port -I/usr/include/openjpeg-2.3 -I/usr/include  -DGDAL_COMPILATION -DHAVE_POPPLER -DPOPPLER_MAJOR_VERSION=20 -DPOPPLER_MINOR_VERSION=10 -I/usr/include -I/usr/include/poppler   -DDO_NOT_USE_DEBUG_BOOL -c -o ../o/pdfwritabledataset.lo pdfwritabledataset.cpp
make[2]: Leaving directory '/tmp/B.lZJ7wH/BUILD/gdal-3.0.4/frmts/pdf'
make[1]: Entering directory '/tmp/B.lZJ7wH/BUILD/gdal-3.0.4/ogr'
/bin/sh /tmp/B.lZJ7wH/BUILD/gdal-3.0.4/libtool --mode=compile --silent --tag=CXX x86_64-pld-linux-g++ -I/tmp/B.lZJ7wH/BUILD/gdal-3.0.4/port -I/tmp/B.lZJ7wH/BUILD/gdal-3.0.4/gcore -I/tmp/B.lZJ7wH/BUILD/gdal-3.0.4/alg -I/tmp/B.lZJ7wH/BUILD/gdal-3.0.4/ogr -I/tmp/B.lZJ7wH/BUILD/gdal-3.0.4/ogr/ogrsf_frmts -I/tmp/B.lZJ7wH/BUILD/gdal-3.0.4/gnm -I/tmp/B.lZJ7wH/BUILD/gdal-3.0.4/apps -Weffc++ -Wold-style-cast -DHAVE_MITAB -DHAVE_AVX_AT_COMPILE_TIME -DHAVE_SSSE3_AT_COMPILE_TIME -DHAVE_SSE_AT_COMPILE_TIME -O2 -fwrapv -pipe -Wformat -Werror=format-security -gdwarf-4 -fno-debug-types-section -fvar-tracking-assignments -g2 -Wp,-D_FORTIFY_SOURCE=2 -fstack-protector-strong --param=ssp-buffer-size=4 -Werror=trampolines -fPIC -march=x86-64 -gdwarf-4 -fno-debug-types-section -fvar-tracking-assignments -g2  -fvisibility=hidden  -Wall -Wextra -Winit-self -Wunused-parameter -Wformat -Werror=format-security -Wno-format-nonliteral -Wlogical-op -Wshadow -Werror=vla -Wdate-time -Wnull-dereference -Wduplicated-cond -Wextra-semi -Wfloat-conversion -Wmissing-declarations -Wnon-virtual-dtor -Woverloaded-virtual -fno-operator-names -Wzero-as-null-pointer-constant -Wsuggest-override -Wimplicit-fallthrough  -Iogrsf_frmts -Iogrsf_frmts/mem -Iogrsf_frmts/geojson -I/usr/include/json-c -I.    -DHAVE_XERCES -I/usr/include -I/usr/include/xercesc -DHAVE_EXPAT -I/usr/include -DHAVE_GEOS=1 -I/usr/include -DGNM_ENABLED -I/tmp/B.lZJ7wH/BUILD/gdal-3.0.4/port -I/usr/include/openjpeg-2.3 -I/usr/include  -DGDAL_COMPILATION -DHAVE_XERCES -I/usr/include -I/usr/include/xercesc -I/tmp/B.lZJ7wH/BUILD/gdal-3.0.4/port -I/usr/include/openjpeg-2.3 -I/usr/include  -DGDAL_COMPILATION  -c -o swq_select.lo swq_select.cpp
make[1]: Leaving directory '/tmp/B.lZJ7wH/BUILD/gdal-3.0.4/ogr'
make[1]: Entering directory '/tmp/B.lZJ7wH/BUILD/gdal-3.0.4/ogr'
/bin/sh /tmp/B.lZJ7wH/BUILD/gdal-3.0.4/libtool --mode=compile --silent --tag=CXX x86_64-pld-linux-g++ -I/tmp/B.lZJ7wH/BUILD/gdal-3.0.4/port -I/tmp/B.lZJ7wH/BUILD/gdal-3.0.4/gcore -I/tmp/B.lZJ7wH/BUILD/gdal-3.0.4/alg -I/tmp/B.lZJ7wH/BUILD/gdal-3.0.4/ogr -I/tmp/B.lZJ7wH/BUILD/gdal-3.0.4/ogr/ogrsf_frmts -I/tmp/B.lZJ7wH/BUILD/gdal-3.0.4/gnm -I/tmp/B.lZJ7wH/BUILD/gdal-3.0.4/apps -Weffc++ -Wold-style-cast -DHAVE_MITAB -DHAVE_AVX_AT_COMPILE_TIME -DHAVE_SSSE3_AT_COMPILE_TIME -DHAVE_SSE_AT_COMPILE_TIME -O2 -fwrapv -pipe -Wformat -Werror=format-security -gdwarf-4 -fno-debug-types-section -fvar-tracking-assignments -g2 -Wp,-D_FORTIFY_SOURCE=2 -fstack-protector-strong --param=ssp-buffer-size=4 -Werror=trampolines -fPIC -march=x86-64 -gdwarf-4 -fno-debug-types-section -fvar-tracking-assignments -g2  -fvisibility=hidden  -Wall -Wextra -Winit-self -Wunused-parameter -Wformat -Werror=format-security -Wno-format-nonliteral -Wlogical-op -Wshadow -Werror=vla -Wdate-time -Wnull-dereference -Wduplicated-cond -Wextra-semi -Wfloat-conversion -Wmissing-declarations -Wnon-virtual-dtor -Woverloaded-virtual -fno-operator-names -Wzero-as-null-pointer-constant -Wsuggest-override -Wimplicit-fallthrough  -Iogrsf_frmts -Iogrsf_frmts/mem -Iogrsf_frmts/geojson -I/usr/include/json-c -I.    -DHAVE_XERCES -I/usr/include -I/usr/include/xercesc -DHAVE_EXPAT -I/usr/include -DHAVE_GEOS=1 -I/usr/include -DGNM_ENABLED -I/tmp/B.lZJ7wH/BUILD/gdal-3.0.4/port -I/usr/include/openjpeg-2.3 -I/usr/include  -DGDAL_COMPILATION -DHAVE_XERCES -I/usr/include -I/usr/include/xercesc -I/tmp/B.lZJ7wH/BUILD/gdal-3.0.4/port -I/usr/include/openjpeg-2.3 -I/usr/include  -DGDAL_COMPILATION  -c -o swq_op_registrar.lo swq_op_registrar.cpp
make[1]: Leaving directory '/tmp/B.lZJ7wH/BUILD/gdal-3.0.4/ogr'
make[3]: Entering directory '/tmp/B.lZJ7wH/BUILD/gdal-3.0.4/ogr/ogrsf_frmts/gft'
/bin/sh /tmp/B.lZJ7wH/BUILD/gdal-3.0.4/libtool --mode=compile --silent --tag=CXX x86_64-pld-linux-g++ -I/tmp/B.lZJ7wH/BUILD/gdal-3.0.4/port -I/tmp/B.lZJ7wH/BUILD/gdal-3.0.4/gcore -I/tmp/B.lZJ7wH/BUILD/gdal-3.0.4/alg -I/tmp/B.lZJ7wH/BUILD/gdal-3.0.4/ogr -I/tmp/B.lZJ7wH/BUILD/gdal-3.0.4/ogr/ogrsf_frmts -I/tmp/B.lZJ7wH/BUILD/gdal-3.0.4/gnm -I/tmp/B.lZJ7wH/BUILD/gdal-3.0.4/apps -DHAVE_AVX_AT_COMPILE_TIME -DHAVE_SSSE3_AT_COMPILE_TIME -DHAVE_SSE_AT_COMPILE_TIME -O2 -fwrapv -pipe -Wformat -Werror=format-security -gdwarf-4 -fno-debug-types-section -fvar-tracking-assignments -g2 -Wp,-D_FORTIFY_SOURCE=2 -fstack-protector-strong --param=ssp-buffer-size=4 -Werror=trampolines -fPIC -march=x86-64 -gdwarf-4 -fno-debug-types-section -fvar-tracking-assignments -g2  -fvisibility=hidden  -Wall -Wextra -Winit-self -Wunused-parameter -Wformat -Werror=format-security -Wno-format-nonliteral -Wlogical-op -Wshadow -Werror=vla -Wdate-time -Wnull-dereference -Wduplicated-cond -Wextra-semi -Wfloat-conversion -Wmissing-declarations -Wnon-virtual-dtor -Woverloaded-virtual -fno-operator-names -Wzero-as-null-pointer-constant -Wsuggest-override -Wimplicit-fallthrough  -I.. -I../..  -DGNM_ENABLED -I/tmp/B.lZJ7wH/BUILD/gdal-3.0.4/port -I/usr/include/openjpeg-2.3 -I/usr/include  -DGDAL_COMPILATION -DHAVE_XERCES -I/usr/include -I/usr/include/xercesc -I/tmp/B.lZJ7wH/BUILD/gdal-3.0.4/port -I/usr/include/openjpeg-2.3 -I/usr/include  -DGDAL_COMPILATION -c -o ../o/ogrgftdatasource.lo ogrgftdatasource.cpp
make[3]: Leaving directory '/tmp/B.lZJ7wH/BUILD/gdal-3.0.4/ogr/ogrsf_frmts/gft'
make[1]: Entering directory '/tmp/B.lZJ7wH/BUILD/gdal-3.0.4/ogr'
/bin/sh /tmp/B.lZJ7wH/BUILD/gdal-3.0.4/libtool --mode=compile --silent --tag=CXX x86_64-pld-linux-g++ -I/tmp/B.lZJ7wH/BUILD/gdal-3.0.4/port -I/tmp/B.lZJ7wH/BUILD/gdal-3.0.4/gcore -I/tmp/B.lZJ7wH/BUILD/gdal-3.0.4/alg -I/tmp/B.lZJ7wH/BUILD/gdal-3.0.4/ogr -I/tmp/B.lZJ7wH/BUILD/gdal-3.0.4/ogr/ogrsf_frmts -I/tmp/B.lZJ7wH/BUILD/gdal-3.0.4/gnm -I/tmp/B.lZJ7wH/BUILD/gdal-3.0.4/apps -Weffc++ -Wold-style-cast -DHAVE_MITAB -DHAVE_AVX_AT_COMPILE_TIME -DHAVE_SSSE3_AT_COMPILE_TIME -DHAVE_SSE_AT_COMPILE_TIME -O2 -fwrapv -pipe -Wformat -Werror=format-security -gdwarf-4 -fno-debug-types-section -fvar-tracking-assignments -g2 -Wp,-D_FORTIFY_SOURCE=2 -fstack-protector-strong --param=ssp-buffer-size=4 -Werror=trampolines -fPIC -march=x86-64 -gdwarf-4 -fno-debug-types-section -fvar-tracking-assignments -g2  -fvisibility=hidden  -Wall -Wextra -Winit-self -Wunused-parameter -Wformat -Werror=format-security -Wno-format-nonliteral -Wlogical-op -Wshadow -Werror=vla -Wdate-time -Wnull-dereference -Wduplicated-cond -Wextra-semi -Wfloat-conversion -Wmissing-declarations -Wnon-virtual-dtor -Woverloaded-virtual -fno-operator-names -Wzero-as-null-pointer-constant -Wsuggest-override -Wimplicit-fallthrough  -Iogrsf_frmts -Iogrsf_frmts/mem -Iogrsf_frmts/geojson -I/usr/include/json-c -I.    -DHAVE_XERCES -I/usr/include -I/usr/include/xercesc -DHAVE_EXPAT -I/usr/include -DHAVE_GEOS=1 -I/usr/include -DGNM_ENABLED -I/tmp/B.lZJ7wH/BUILD/gdal-3.0.4/port -I/usr/include/openjpeg-2.3 -I/usr/include  -DGDAL_COMPILATION -DHAVE_XERCES -I/usr/include -I/usr/include/xercesc -I/tmp/B.lZJ7wH/BUILD/gdal-3.0.4/port -I/usr/include/openjpeg-2.3 -I/usr/include  -DGDAL_COMPILATION  -c -o ogr_srs_xml.lo ogr_srs_xml.cpp
make[1]: Leaving directory '/tmp/B.lZJ7wH/BUILD/gdal-3.0.4/ogr'
make[2]: Entering directory '/tmp/B.lZJ7wH/BUILD/gdal-3.0.4/frmts/pdf'
/bin/sh /tmp/B.lZJ7wH/BUILD/gdal-3.0.4/libtool --mode=compile --silent --tag=CXX x86_64-pld-linux-g++ -I/tmp/B.lZJ7wH/BUILD/gdal-3.0.4/port -I/tmp/B.lZJ7wH/BUILD/gdal-3.0.4/gcore -I/tmp/B.lZJ7wH/BUILD/gdal-3.0.4/alg -I/tmp/B.lZJ7wH/BUILD/gdal-3.0.4/ogr -I/tmp/B.lZJ7wH/BUILD/gdal-3.0.4/ogr/ogrsf_frmts -I/tmp/B.lZJ7wH/BUILD/gdal-3.0.4/gnm -I/tmp/B.lZJ7wH/BUILD/gdal-3.0.4/apps -DHAVE_AVX_AT_COMPILE_TIME -DHAVE_SSSE3_AT_COMPILE_TIME -DHAVE_SSE_AT_COMPILE_TIME -O2 -fwrapv -pipe -Wformat -Werror=format-security -gdwarf-4 -fno-debug-types-section -fvar-tracking-assignments -g2 -Wp,-D_FORTIFY_SOURCE=2 -fstack-protector-strong --param=ssp-buffer-size=4 -Werror=trampolines -fPIC -march=x86-64 -gdwarf-4 -fno-debug-types-section -fvar-tracking-assignments -g2  -fvisibility=hidden  -Wall -Wextra -Winit-self -Wunused-parameter -Wformat -Werror=format-security -Wno-format-nonliteral -Wlogical-op -Wshadow -Werror=vla -Wdate-time -Wnull-dereference -Wduplicated-cond -Wextra-semi -Wfloat-conversion -Wmissing-declarations -Wnon-virtual-dtor -Woverloaded-virtual -fno-operator-names -Wzero-as-null-pointer-constant -Wsuggest-override -Wimplicit-fallthrough  -I../vrt -I../mem -I../../ogr/ogrsf_frmts/mem -DGNM_ENABLED -I/tmp/B.lZJ7wH/BUILD/gdal-3.0.4/port -I/usr/include/openjpeg-2.3 -I/usr/include  -DGDAL_COMPILATION -DHAVE_XERCES -I/usr/include -I/usr/include/xercesc -I/tmp/B.lZJ7wH/BUILD/gdal-3.0.4/port -I/usr/include/openjpeg-2.3 -I/usr/include  -DGDAL_COMPILATION -DHAVE_POPPLER -DPOPPLER_MAJOR_VERSION=20 -DPOPPLER_MINOR_VERSION=10 -I/usr/include -I/usr/include/poppler   -DDO_NOT_USE_DEBUG_BOOL -c -o ../o/pdfreadvectors.lo pdfreadvectors.cpp
make[2]: Leaving directory '/tmp/B.lZJ7wH/BUILD/gdal-3.0.4/frmts/pdf'
make[1]: Entering directory '/tmp/B.lZJ7wH/BUILD/gdal-3.0.4/ogr'
/bin/sh /tmp/B.lZJ7wH/BUILD/gdal-3.0.4/libtool --mode=compile --silent --tag=CXX x86_64-pld-linux-g++ -I/tmp/B.lZJ7wH/BUILD/gdal-3.0.4/port -I/tmp/B.lZJ7wH/BUILD/gdal-3.0.4/gcore -I/tmp/B.lZJ7wH/BUILD/gdal-3.0.4/alg -I/tmp/B.lZJ7wH/BUILD/gdal-3.0.4/ogr -I/tmp/B.lZJ7wH/BUILD/gdal-3.0.4/ogr/ogrsf_frmts -I/tmp/B.lZJ7wH/BUILD/gdal-3.0.4/gnm -I/tmp/B.lZJ7wH/BUILD/gdal-3.0.4/apps -Weffc++ -Wold-style-cast -DHAVE_MITAB -DHAVE_AVX_AT_COMPILE_TIME -DHAVE_SSSE3_AT_COMPILE_TIME -DHAVE_SSE_AT_COMPILE_TIME -O2 -fwrapv -pipe -Wformat -Werror=format-security -gdwarf-4 -fno-debug-types-section -fvar-tracking-assignments -g2 -Wp,-D_FORTIFY_SOURCE=2 -fstack-protector-strong --param=ssp-buffer-size=4 -Werror=trampolines -fPIC -march=x86-64 -gdwarf-4 -fno-debug-types-section -fvar-tracking-assignments -g2  -fvisibility=hidden  -Wall -Wextra -Winit-self -Wunused-parameter -Wformat -Werror=format-security -Wno-format-nonliteral -Wlogical-op -Wshadow -Werror=vla -Wdate-time -Wnull-dereference -Wduplicated-cond -Wextra-semi -Wfloat-conversion -Wmissing-declarations -Wnon-virtual-dtor -Woverloaded-virtual -fno-operator-names -Wzero-as-null-pointer-constant -Wsuggest-override -Wimplicit-fallthrough  -Iogrsf_frmts -Iogrsf_frmts/mem -Iogrsf_frmts/geojson -I/usr/include/json-c -I.    -DHAVE_XERCES -I/usr/include -I/usr/include/xercesc -DHAVE_EXPAT -I/usr/include -DHAVE_GEOS=1 -I/usr/include -DGNM_ENABLED -I/tmp/B.lZJ7wH/BUILD/gdal-3.0.4/port -I/usr/include/openjpeg-2.3 -I/usr/include  -DGDAL_COMPILATION -DHAVE_XERCES -I/usr/include -I/usr/include/xercesc -I/tmp/B.lZJ7wH/BUILD/gdal-3.0.4/port -I/usr/include/openjpeg-2.3 -I/usr/include  -DGDAL_COMPILATION  -c -o swq_op_general.lo swq_op_general.cpp
make[1]: Leaving directory '/tmp/B.lZJ7wH/BUILD/gdal-3.0.4/ogr'
make[1]: Entering directory '/tmp/B.lZJ7wH/BUILD/gdal-3.0.4/ogr'
/bin/sh /tmp/B.lZJ7wH/BUILD/gdal-3.0.4/libtool --mode=compile --silent --tag=CXX x86_64-pld-linux-g++ -I/tmp/B.lZJ7wH/BUILD/gdal-3.0.4/port -I/tmp/B.lZJ7wH/BUILD/gdal-3.0.4/gcore -I/tmp/B.lZJ7wH/BUILD/gdal-3.0.4/alg -I/tmp/B.lZJ7wH/BUILD/gdal-3.0.4/ogr -I/tmp/B.lZJ7wH/BUILD/gdal-3.0.4/ogr/ogrsf_frmts -I/tmp/B.lZJ7wH/BUILD/gdal-3.0.4/gnm -I/tmp/B.lZJ7wH/BUILD/gdal-3.0.4/apps -Weffc++ -Wold-style-cast -DHAVE_MITAB -DHAVE_AVX_AT_COMPILE_TIME -DHAVE_SSSE3_AT_COMPILE_TIME -DHAVE_SSE_AT_COMPILE_TIME -O2 -fwrapv -pipe -Wformat -Werror=format-security -gdwarf-4 -fno-debug-types-section -fvar-tracking-assignments -g2 -Wp,-D_FORTIFY_SOURCE=2 -fstack-protector-strong --param=ssp-buffer-size=4 -Werror=trampolines -fPIC -march=x86-64 -gdwarf-4 -fno-debug-types-section -fvar-tracking-assignments -g2  -fvisibility=hidden  -Wall -Wextra -Winit-self -Wunused-parameter -Wformat -Werror=format-security -Wno-format-nonliteral -Wlogical-op -Wshadow -Werror=vla -Wdate-time -Wnull-dereference -Wduplicated-cond -Wextra-semi -Wfloat-conversion -Wmissing-declarations -Wnon-virtual-dtor -Woverloaded-virtual -fno-operator-names -Wzero-as-null-pointer-constant -Wsuggest-override -Wimplicit-fallthrough  -Iogrsf_frmts -Iogrsf_frmts/mem -Iogrsf_frmts/geojson -I/usr/include/json-c -I.    -DHAVE_XERCES -I/usr/include -I/usr/include/xercesc -DHAVE_EXPAT -I/usr/include -DHAVE_GEOS=1 -I/usr/include -DGNM_ENABLED -I/tmp/B.lZJ7wH/BUILD/gdal-3.0.4/port -I/usr/include/openjpeg-2.3 -I/usr/include  -DGDAL_COMPILATION -DHAVE_XERCES -I/usr/include -I/usr/include/xercesc -I/tmp/B.lZJ7wH/BUILD/gdal-3.0.4/port -I/usr/include/openjpeg-2.3 -I/usr/include  -DGDAL_COMPILATION  -c -o ograssemblepolygon.lo ograssemblepolygon.cpp
make[1]: Leaving directory '/tmp/B.lZJ7wH/BUILD/gdal-3.0.4/ogr'
make[3]: Entering directory '/tmp/B.lZJ7wH/BUILD/gdal-3.0.4/ogr/ogrsf_frmts/elastic'
/bin/sh /tmp/B.lZJ7wH/BUILD/gdal-3.0.4/libtool --mode=compile --silent --tag=CXX x86_64-pld-linux-g++ -I/tmp/B.lZJ7wH/BUILD/gdal-3.0.4/port -I/tmp/B.lZJ7wH/BUILD/gdal-3.0.4/gcore -I/tmp/B.lZJ7wH/BUILD/gdal-3.0.4/alg -I/tmp/B.lZJ7wH/BUILD/gdal-3.0.4/ogr -I/tmp/B.lZJ7wH/BUILD/gdal-3.0.4/ogr/ogrsf_frmts -I/tmp/B.lZJ7wH/BUILD/gdal-3.0.4/gnm -I/tmp/B.lZJ7wH/BUILD/gdal-3.0.4/apps -DHAVE_AVX_AT_COMPILE_TIME -DHAVE_SSSE3_AT_COMPILE_TIME -DHAVE_SSE_AT_COMPILE_TIME -O2 -fwrapv -pipe -Wformat -Werror=format-security -gdwarf-4 -fno-debug-types-section -fvar-tracking-assignments -g2 -Wp,-D_FORTIFY_SOURCE=2 -fstack-protector-strong --param=ssp-buffer-size=4 -Werror=trampolines -fPIC -march=x86-64 -gdwarf-4 -fno-debug-types-section -fvar-tracking-assignments -g2  -fvisibility=hidden  -Wall -Wextra -Winit-self -Wunused-parameter -Wformat -Werror=format-security -Wno-format-nonliteral -Wlogical-op -Wshadow -Werror=vla -Wdate-time -Wnull-dereference -Wduplicated-cond -Wextra-semi -Wfloat-conversion -Wmissing-declarations -Wnon-virtual-dtor -Woverloaded-virtual -fno-operator-names -Wzero-as-null-pointer-constant -Wsuggest-override -Wimplicit-fallthrough  -I/usr/include/json-c -I.. -I../.. -I../geojson -DGNM_ENABLED -I/tmp/B.lZJ7wH/BUILD/gdal-3.0.4/port -I/usr/include/openjpeg-2.3 -I/usr/include  -DGDAL_COMPILATION -DHAVE_XERCES -I/usr/include -I/usr/include/xercesc -I/tmp/B.lZJ7wH/BUILD/gdal-3.0.4/port -I/usr/include/openjpeg-2.3 -I/usr/include  -DGDAL_COMPILATION -c -o ../o/ogrelasticdatasource.lo ogrelasticdatasource.cpp
make[3]: Leaving directory '/tmp/B.lZJ7wH/BUILD/gdal-3.0.4/ogr/ogrsf_frmts/elastic'
make[2]: Entering directory '/tmp/B.lZJ7wH/BUILD/gdal-3.0.4/frmts/pdf'
/bin/sh /tmp/B.lZJ7wH/BUILD/gdal-3.0.4/libtool --mode=compile --silent --tag=CXX x86_64-pld-linux-g++ -I/tmp/B.lZJ7wH/BUILD/gdal-3.0.4/port -I/tmp/B.lZJ7wH/BUILD/gdal-3.0.4/gcore -I/tmp/B.lZJ7wH/BUILD/gdal-3.0.4/alg -I/tmp/B.lZJ7wH/BUILD/gdal-3.0.4/ogr -I/tmp/B.lZJ7wH/BUILD/gdal-3.0.4/ogr/ogrsf_frmts -I/tmp/B.lZJ7wH/BUILD/gdal-3.0.4/gnm -I/tmp/B.lZJ7wH/BUILD/gdal-3.0.4/apps -DHAVE_AVX_AT_COMPILE_TIME -DHAVE_SSSE3_AT_COMPILE_TIME -DHAVE_SSE_AT_COMPILE_TIME -O2 -fwrapv -pipe -Wformat -Werror=format-security -gdwarf-4 -fno-debug-types-section -fvar-tracking-assignments -g2 -Wp,-D_FORTIFY_SOURCE=2 -fstack-protector-strong --param=ssp-buffer-size=4 -Werror=trampolines -fPIC -march=x86-64 -gdwarf-4 -fno-debug-types-section -fvar-tracking-assignments -g2  -fvisibility=hidden  -Wall -Wextra -Winit-self -Wunused-parameter -Wformat -Werror=format-security -Wno-format-nonliteral -Wlogical-op -Wshadow -Werror=vla -Wdate-time -Wnull-dereference -Wduplicated-cond -Wextra-semi -Wfloat-conversion -Wmissing-declarations -Wnon-virtual-dtor -Woverloaded-virtual -fno-operator-names -Wzero-as-null-pointer-constant -Wsuggest-override -Wimplicit-fallthrough  -I../vrt -I../mem -I../../ogr/ogrsf_frmts/mem -DGNM_ENABLED -I/tmp/B.lZJ7wH/BUILD/gdal-3.0.4/port -I/usr/include/openjpeg-2.3 -I/usr/include  -DGDAL_COMPILATION -DHAVE_XERCES -I/usr/include -I/usr/include/xercesc -I/tmp/B.lZJ7wH/BUILD/gdal-3.0.4/port -I/usr/include/openjpeg-2.3 -I/usr/include  -DGDAL_COMPILATION -DHAVE_POPPLER -DPOPPLER_MAJOR_VERSION=20 -DPOPPLER_MINOR_VERSION=10 -I/usr/include -I/usr/include/poppler   -DDO_NOT_USE_DEBUG_BOOL -c -o ../o/pdfcreatecopy.lo pdfcreatecopy.cpp
make[2]: Leaving directory '/tmp/B.lZJ7wH/BUILD/gdal-3.0.4/frmts/pdf'
/usr/bin/make -C ngw
make[3]: Entering directory '/tmp/B.lZJ7wH/BUILD/gdal-3.0.4/ogr/ogrsf_frmts/gft'
/bin/sh /tmp/B.lZJ7wH/BUILD/gdal-3.0.4/libtool --mode=compile --silent --tag=CXX x86_64-pld-linux-g++ -I/tmp/B.lZJ7wH/BUILD/gdal-3.0.4/port -I/tmp/B.lZJ7wH/BUILD/gdal-3.0.4/gcore -I/tmp/B.lZJ7wH/BUILD/gdal-3.0.4/alg -I/tmp/B.lZJ7wH/BUILD/gdal-3.0.4/ogr -I/tmp/B.lZJ7wH/BUILD/gdal-3.0.4/ogr/ogrsf_frmts -I/tmp/B.lZJ7wH/BUILD/gdal-3.0.4/gnm -I/tmp/B.lZJ7wH/BUILD/gdal-3.0.4/apps -DHAVE_AVX_AT_COMPILE_TIME -DHAVE_SSSE3_AT_COMPILE_TIME -DHAVE_SSE_AT_COMPILE_TIME -O2 -fwrapv -pipe -Wformat -Werror=format-security -gdwarf-4 -fno-debug-types-section -fvar-tracking-assignments -g2 -Wp,-D_FORTIFY_SOURCE=2 -fstack-protector-strong --param=ssp-buffer-size=4 -Werror=trampolines -fPIC -march=x86-64 -gdwarf-4 -fno-debug-types-section -fvar-tracking-assignments -g2  -fvisibility=hidden  -Wall -Wextra -Winit-self -Wunused-parameter -Wformat -Werror=format-security -Wno-format-nonliteral -Wlogical-op -Wshadow -Werror=vla -Wdate-time -Wnull-dereference -Wduplicated-cond -Wextra-semi -Wfloat-conversion -Wmissing-declarations -Wnon-virtual-dtor -Woverloaded-virtual -fno-operator-names -Wzero-as-null-pointer-constant -Wsuggest-override -Wimplicit-fallthrough  -I.. -I../..  -DGNM_ENABLED -I/tmp/B.lZJ7wH/BUILD/gdal-3.0.4/port -I/usr/include/openjpeg-2.3 -I/usr/include  -DGDAL_COMPILATION -DHAVE_XERCES -I/usr/include -I/usr/include/xercesc -I/tmp/B.lZJ7wH/BUILD/gdal-3.0.4/port -I/usr/include/openjpeg-2.3 -I/usr/include  -DGDAL_COMPILATION -c -o ../o/ogrgftlayer.lo ogrgftlayer.cpp
make[3]: Leaving directory '/tmp/B.lZJ7wH/BUILD/gdal-3.0.4/ogr/ogrsf_frmts/gft'
make[1]: Entering directory '/tmp/B.lZJ7wH/BUILD/gdal-3.0.4/ogr'
/bin/sh /tmp/B.lZJ7wH/BUILD/gdal-3.0.4/libtool --mode=compile --silent --tag=CXX x86_64-pld-linux-g++ -I/tmp/B.lZJ7wH/BUILD/gdal-3.0.4/port -I/tmp/B.lZJ7wH/BUILD/gdal-3.0.4/gcore -I/tmp/B.lZJ7wH/BUILD/gdal-3.0.4/alg -I/tmp/B.lZJ7wH/BUILD/gdal-3.0.4/ogr -I/tmp/B.lZJ7wH/BUILD/gdal-3.0.4/ogr/ogrsf_frmts -I/tmp/B.lZJ7wH/BUILD/gdal-3.0.4/gnm -I/tmp/B.lZJ7wH/BUILD/gdal-3.0.4/apps -Weffc++ -Wold-style-cast -DHAVE_MITAB -DHAVE_AVX_AT_COMPILE_TIME -DHAVE_SSSE3_AT_COMPILE_TIME -DHAVE_SSE_AT_COMPILE_TIME -O2 -fwrapv -pipe -Wformat -Werror=format-security -gdwarf-4 -fno-debug-types-section -fvar-tracking-assignments -g2 -Wp,-D_FORTIFY_SOURCE=2 -fstack-protector-strong --param=ssp-buffer-size=4 -Werror=trampolines -fPIC -march=x86-64 -gdwarf-4 -fno-debug-types-section -fvar-tracking-assignments -g2  -fvisibility=hidden  -Wall -Wextra -Winit-self -Wunused-parameter -Wformat -Werror=format-security -Wno-format-nonliteral -Wlogical-op -Wshadow -Werror=vla -Wdate-time -Wnull-dereference -Wduplicated-cond -Wextra-semi -Wfloat-conversion -Wmissing-declarations -Wnon-virtual-dtor -Woverloaded-virtual -fno-operator-names -Wzero-as-null-pointer-constant -Wsuggest-override -Wimplicit-fallthrough  -Iogrsf_frmts -Iogrsf_frmts/mem -Iogrsf_frmts/geojson -I/usr/include/json-c -I.    -DHAVE_XERCES -I/usr/include -I/usr/include/xercesc -DHAVE_EXPAT -I/usr/include -DHAVE_GEOS=1 -I/usr/include -DGNM_ENABLED -I/tmp/B.lZJ7wH/BUILD/gdal-3.0.4/port -I/usr/include/openjpeg-2.3 -I/usr/include  -DGDAL_COMPILATION -DHAVE_XERCES -I/usr/include -I/usr/include/xercesc -I/tmp/B.lZJ7wH/BUILD/gdal-3.0.4/port -I/usr/include/openjpeg-2.3 -I/usr/include  -DGDAL_COMPILATION  -c -o ogr_expat.lo ogr_expat.cpp
make[1]: Leaving directory '/tmp/B.lZJ7wH/BUILD/gdal-3.0.4/ogr'
make[1]: Entering directory '/tmp/B.lZJ7wH/BUILD/gdal-3.0.4/ogr'
/bin/sh /tmp/B.lZJ7wH/BUILD/gdal-3.0.4/libtool --mode=compile --silent --tag=CXX x86_64-pld-linux-g++ -I/tmp/B.lZJ7wH/BUILD/gdal-3.0.4/port -I/tmp/B.lZJ7wH/BUILD/gdal-3.0.4/gcore -I/tmp/B.lZJ7wH/BUILD/gdal-3.0.4/alg -I/tmp/B.lZJ7wH/BUILD/gdal-3.0.4/ogr -I/tmp/B.lZJ7wH/BUILD/gdal-3.0.4/ogr/ogrsf_frmts -I/tmp/B.lZJ7wH/BUILD/gdal-3.0.4/gnm -I/tmp/B.lZJ7wH/BUILD/gdal-3.0.4/apps -Weffc++ -Wold-style-cast -DHAVE_MITAB -DHAVE_AVX_AT_COMPILE_TIME -DHAVE_SSSE3_AT_COMPILE_TIME -DHAVE_SSE_AT_COMPILE_TIME -O2 -fwrapv -pipe -Wformat -Werror=format-security -gdwarf-4 -fno-debug-types-section -fvar-tracking-assignments -g2 -Wp,-D_FORTIFY_SOURCE=2 -fstack-protector-strong --param=ssp-buffer-size=4 -Werror=trampolines -fPIC -march=x86-64 -gdwarf-4 -fno-debug-types-section -fvar-tracking-assignments -g2  -fvisibility=hidden  -Wall -Wextra -Winit-self -Wunused-parameter -Wformat -Werror=format-security -Wno-format-nonliteral -Wlogical-op -Wshadow -Werror=vla -Wdate-time -Wnull-dereference -Wduplicated-cond -Wextra-semi -Wfloat-conversion -Wmissing-declarations -Wnon-virtual-dtor -Woverloaded-virtual -fno-operator-names -Wzero-as-null-pointer-constant -Wsuggest-override -Wimplicit-fallthrough  -Iogrsf_frmts -Iogrsf_frmts/mem -Iogrsf_frmts/geojson -I/usr/include/json-c -I.    -DHAVE_XERCES -I/usr/include -I/usr/include/xercesc -DHAVE_EXPAT -I/usr/include -DHAVE_GEOS=1 -I/usr/include -DGNM_ENABLED -I/tmp/B.lZJ7wH/BUILD/gdal-3.0.4/port -I/usr/include/openjpeg-2.3 -I/usr/include  -DGDAL_COMPILATION -DHAVE_XERCES -I/usr/include -I/usr/include/xercesc -I/tmp/B.lZJ7wH/BUILD/gdal-3.0.4/port -I/usr/include/openjpeg-2.3 -I/usr/include  -DGDAL_COMPILATION  -c -o ogr2gmlgeometry.lo ogr2gmlgeometry.cpp
make[1]: Leaving directory '/tmp/B.lZJ7wH/BUILD/gdal-3.0.4/ogr'
make[1]: Entering directory '/tmp/B.lZJ7wH/BUILD/gdal-3.0.4/ogr'
/bin/sh /tmp/B.lZJ7wH/BUILD/gdal-3.0.4/libtool --mode=compile --silent --tag=CXX x86_64-pld-linux-g++ -I/tmp/B.lZJ7wH/BUILD/gdal-3.0.4/port -I/tmp/B.lZJ7wH/BUILD/gdal-3.0.4/gcore -I/tmp/B.lZJ7wH/BUILD/gdal-3.0.4/alg -I/tmp/B.lZJ7wH/BUILD/gdal-3.0.4/ogr -I/tmp/B.lZJ7wH/BUILD/gdal-3.0.4/ogr/ogrsf_frmts -I/tmp/B.lZJ7wH/BUILD/gdal-3.0.4/gnm -I/tmp/B.lZJ7wH/BUILD/gdal-3.0.4/apps -Weffc++ -Wold-style-cast -DHAVE_MITAB -DHAVE_AVX_AT_COMPILE_TIME -DHAVE_SSSE3_AT_COMPILE_TIME -DHAVE_SSE_AT_COMPILE_TIME -O2 -fwrapv -pipe -Wformat -Werror=format-security -gdwarf-4 -fno-debug-types-section -fvar-tracking-assignments -g2 -Wp,-D_FORTIFY_SOURCE=2 -fstack-protector-strong --param=ssp-buffer-size=4 -Werror=trampolines -fPIC -march=x86-64 -gdwarf-4 -fno-debug-types-section -fvar-tracking-assignments -g2  -fvisibility=hidden  -Wall -Wextra -Winit-self -Wunused-parameter -Wformat -Werror=format-security -Wno-format-nonliteral -Wlogical-op -Wshadow -Werror=vla -Wdate-time -Wnull-dereference -Wduplicated-cond -Wextra-semi -Wfloat-conversion -Wmissing-declarations -Wnon-virtual-dtor -Woverloaded-virtual -fno-operator-names -Wzero-as-null-pointer-constant -Wsuggest-override -Wimplicit-fallthrough  -Iogrsf_frmts -Iogrsf_frmts/mem -Iogrsf_frmts/geojson -I/usr/include/json-c -I.    -DHAVE_XERCES -I/usr/include -I/usr/include/xercesc -DHAVE_EXPAT -I/usr/include -DHAVE_GEOS=1 -I/usr/include -DGNM_ENABLED -I/tmp/B.lZJ7wH/BUILD/gdal-3.0.4/port -I/usr/include/openjpeg-2.3 -I/usr/include  -DGDAL_COMPILATION -DHAVE_XERCES -I/usr/include -I/usr/include/xercesc -I/tmp/B.lZJ7wH/BUILD/gdal-3.0.4/port -I/usr/include/openjpeg-2.3 -I/usr/include  -DGDAL_COMPILATION  -c -o ogrgeomediageometry.lo ogrgeomediageometry.cpp
make[1]: Leaving directory '/tmp/B.lZJ7wH/BUILD/gdal-3.0.4/ogr'
make[1]: Entering directory '/tmp/B.lZJ7wH/BUILD/gdal-3.0.4/ogr'
/bin/sh /tmp/B.lZJ7wH/BUILD/gdal-3.0.4/libtool --mode=compile --silent --tag=CXX x86_64-pld-linux-g++ -I/tmp/B.lZJ7wH/BUILD/gdal-3.0.4/port -I/tmp/B.lZJ7wH/BUILD/gdal-3.0.4/gcore -I/tmp/B.lZJ7wH/BUILD/gdal-3.0.4/alg -I/tmp/B.lZJ7wH/BUILD/gdal-3.0.4/ogr -I/tmp/B.lZJ7wH/BUILD/gdal-3.0.4/ogr/ogrsf_frmts -I/tmp/B.lZJ7wH/BUILD/gdal-3.0.4/gnm -I/tmp/B.lZJ7wH/BUILD/gdal-3.0.4/apps -Weffc++ -Wold-style-cast -DHAVE_MITAB -DHAVE_AVX_AT_COMPILE_TIME -DHAVE_SSSE3_AT_COMPILE_TIME -DHAVE_SSE_AT_COMPILE_TIME -O2 -fwrapv -pipe -Wformat -Werror=format-security -gdwarf-4 -fno-debug-types-section -fvar-tracking-assignments -g2 -Wp,-D_FORTIFY_SOURCE=2 -fstack-protector-strong --param=ssp-buffer-size=4 -Werror=trampolines -fPIC -march=x86-64 -gdwarf-4 -fno-debug-types-section -fvar-tracking-assignments -g2  -fvisibility=hidden  -Wall -Wextra -Winit-self -Wunused-parameter -Wformat -Werror=format-security -Wno-format-nonliteral -Wlogical-op -Wshadow -Werror=vla -Wdate-time -Wnull-dereference -Wduplicated-cond -Wextra-semi -Wfloat-conversion -Wmissing-declarations -Wnon-virtual-dtor -Woverloaded-virtual -fno-operator-names -Wzero-as-null-pointer-constant -Wsuggest-override -Wimplicit-fallthrough  -Iogrsf_frmts -Iogrsf_frmts/mem -Iogrsf_frmts/geojson -I/usr/include/json-c -I.    -DHAVE_XERCES -I/usr/include -I/usr/include/xercesc -DHAVE_EXPAT -I/usr/include -DHAVE_GEOS=1 -I/usr/include -DGNM_ENABLED -I/tmp/B.lZJ7wH/BUILD/gdal-3.0.4/port -I/usr/include/openjpeg-2.3 -I/usr/include  -DGDAL_COMPILATION -DHAVE_XERCES -I/usr/include -I/usr/include/xercesc -I/tmp/B.lZJ7wH/BUILD/gdal-3.0.4/port -I/usr/include/openjpeg-2.3 -I/usr/include  -DGDAL_COMPILATION  -c -o gml2ogrgeometry.lo gml2ogrgeometry.cpp
make[1]: Leaving directory '/tmp/B.lZJ7wH/BUILD/gdal-3.0.4/ogr'
make[3]: Entering directory '/tmp/B.lZJ7wH/BUILD/gdal-3.0.4/ogr/ogrsf_frmts/ngw'
/bin/sh /tmp/B.lZJ7wH/BUILD/gdal-3.0.4/libtool --mode=compile --silent --tag=CXX x86_64-pld-linux-g++ -I/tmp/B.lZJ7wH/BUILD/gdal-3.0.4/port -I/tmp/B.lZJ7wH/BUILD/gdal-3.0.4/gcore -I/tmp/B.lZJ7wH/BUILD/gdal-3.0.4/alg -I/tmp/B.lZJ7wH/BUILD/gdal-3.0.4/ogr -I/tmp/B.lZJ7wH/BUILD/gdal-3.0.4/ogr/ogrsf_frmts -I/tmp/B.lZJ7wH/BUILD/gdal-3.0.4/gnm -I/tmp/B.lZJ7wH/BUILD/gdal-3.0.4/apps -DHAVE_AVX_AT_COMPILE_TIME -DHAVE_SSSE3_AT_COMPILE_TIME -DHAVE_SSE_AT_COMPILE_TIME -O2 -fwrapv -pipe -Wformat -Werror=format-security -gdwarf-4 -fno-debug-types-section -fvar-tracking-assignments -g2 -Wp,-D_FORTIFY_SOURCE=2 -fstack-protector-strong --param=ssp-buffer-size=4 -Werror=trampolines -fPIC -march=x86-64 -gdwarf-4 -fno-debug-types-section -fvar-tracking-assignments -g2  -fvisibility=hidden  -Wall -Wextra -Winit-self -Wunused-parameter -Wformat -Werror=format-security -Wno-format-nonliteral -Wlogical-op -Wshadow -Werror=vla -Wdate-time -Wnull-dereference -Wduplicated-cond -Wextra-semi -Wfloat-conversion -Wmissing-declarations -Wnon-virtual-dtor -Woverloaded-virtual -fno-operator-names -Wzero-as-null-pointer-constant -Wsuggest-override -Wimplicit-fallthrough  -I. -I.. -I../.. -DGNM_ENABLED -I/tmp/B.lZJ7wH/BUILD/gdal-3.0.4/port -I/usr/include/openjpeg-2.3 -I/usr/include  -DGDAL_COMPILATION -DHAVE_XERCES -I/usr/include -I/usr/include/xercesc -I/tmp/B.lZJ7wH/BUILD/gdal-3.0.4/port -I/usr/include/openjpeg-2.3 -I/usr/include  -DGDAL_COMPILATION -c -o ../o/ogrngwdriver.lo ogrngwdriver.cpp
make[3]: Leaving directory '/tmp/B.lZJ7wH/BUILD/gdal-3.0.4/ogr/ogrsf_frmts/ngw'
make[1]: Entering directory '/tmp/B.lZJ7wH/BUILD/gdal-3.0.4/ogr'
/bin/sh /tmp/B.lZJ7wH/BUILD/gdal-3.0.4/libtool --mode=compile --silent --tag=CXX x86_64-pld-linux-g++ -I/tmp/B.lZJ7wH/BUILD/gdal-3.0.4/port -I/tmp/B.lZJ7wH/BUILD/gdal-3.0.4/gcore -I/tmp/B.lZJ7wH/BUILD/gdal-3.0.4/alg -I/tmp/B.lZJ7wH/BUILD/gdal-3.0.4/ogr -I/tmp/B.lZJ7wH/BUILD/gdal-3.0.4/ogr/ogrsf_frmts -I/tmp/B.lZJ7wH/BUILD/gdal-3.0.4/gnm -I/tmp/B.lZJ7wH/BUILD/gdal-3.0.4/apps -Weffc++ -Wold-style-cast -DHAVE_MITAB -DHAVE_AVX_AT_COMPILE_TIME -DHAVE_SSSE3_AT_COMPILE_TIME -DHAVE_SSE_AT_COMPILE_TIME -O2 -fwrapv -pipe -Wformat -Werror=format-security -gdwarf-4 -fno-debug-types-section -fvar-tracking-assignments -g2 -Wp,-D_FORTIFY_SOURCE=2 -fstack-protector-strong --param=ssp-buffer-size=4 -Werror=trampolines -fPIC -march=x86-64 -gdwarf-4 -fno-debug-types-section -fvar-tracking-assignments -g2  -fvisibility=hidden  -Wall -Wextra -Winit-self -Wunused-parameter -Wformat -Werror=format-security -Wno-format-nonliteral -Wlogical-op -Wshadow -Werror=vla -Wdate-time -Wnull-dereference -Wduplicated-cond -Wextra-semi -Wfloat-conversion -Wmissing-declarations -Wnon-virtual-dtor -Woverloaded-virtual -fno-operator-names -Wzero-as-null-pointer-constant -Wsuggest-override -Wimplicit-fallthrough  -Iogrsf_frmts -Iogrsf_frmts/mem -Iogrsf_frmts/geojson -I/usr/include/json-c -I.    -DHAVE_XERCES -I/usr/include -I/usr/include/xercesc -DHAVE_EXPAT -I/usr/include -DHAVE_GEOS=1 -I/usr/include -DGNM_ENABLED -I/tmp/B.lZJ7wH/BUILD/gdal-3.0.4/port -I/usr/include/openjpeg-2.3 -I/usr/include  -DGDAL_COMPILATION -DHAVE_XERCES -I/usr/include -I/usr/include/xercesc -I/tmp/B.lZJ7wH/BUILD/gdal-3.0.4/port -I/usr/include/openjpeg-2.3 -I/usr/include  -DGDAL_COMPILATION  -c -o ogrgeomfielddefn.lo ogrgeomfielddefn.cpp
make[1]: Leaving directory '/tmp/B.lZJ7wH/BUILD/gdal-3.0.4/ogr'
make[1]: Entering directory '/tmp/B.lZJ7wH/BUILD/gdal-3.0.4/ogr'
/bin/sh /tmp/B.lZJ7wH/BUILD/gdal-3.0.4/libtool --mode=compile --silent --tag=CXX x86_64-pld-linux-g++ -I/tmp/B.lZJ7wH/BUILD/gdal-3.0.4/port -I/tmp/B.lZJ7wH/BUILD/gdal-3.0.4/gcore -I/tmp/B.lZJ7wH/BUILD/gdal-3.0.4/alg -I/tmp/B.lZJ7wH/BUILD/gdal-3.0.4/ogr -I/tmp/B.lZJ7wH/BUILD/gdal-3.0.4/ogr/ogrsf_frmts -I/tmp/B.lZJ7wH/BUILD/gdal-3.0.4/gnm -I/tmp/B.lZJ7wH/BUILD/gdal-3.0.4/apps -Weffc++ -Wold-style-cast -DHAVE_MITAB -DHAVE_AVX_AT_COMPILE_TIME -DHAVE_SSSE3_AT_COMPILE_TIME -DHAVE_SSE_AT_COMPILE_TIME -O2 -fwrapv -pipe -Wformat -Werror=format-security -gdwarf-4 -fno-debug-types-section -fvar-tracking-assignments -g2 -Wp,-D_FORTIFY_SOURCE=2 -fstack-protector-strong --param=ssp-buffer-size=4 -Werror=trampolines -fPIC -march=x86-64 -gdwarf-4 -fno-debug-types-section -fvar-tracking-assignments -g2  -fvisibility=hidden  -Wall -Wextra -Winit-self -Wunused-parameter -Wformat -Werror=format-security -Wno-format-nonliteral -Wlogical-op -Wshadow -Werror=vla -Wdate-time -Wnull-dereference -Wduplicated-cond -Wextra-semi -Wfloat-conversion -Wmissing-declarations -Wnon-virtual-dtor -Woverloaded-virtual -fno-operator-names -Wzero-as-null-pointer-constant -Wsuggest-override -Wimplicit-fallthrough  -Iogrsf_frmts -Iogrsf_frmts/mem -Iogrsf_frmts/geojson -I/usr/include/json-c -I.    -DHAVE_XERCES -I/usr/include -I/usr/include/xercesc -DHAVE_EXPAT -I/usr/include -DHAVE_GEOS=1 -I/usr/include -DGNM_ENABLED -I/tmp/B.lZJ7wH/BUILD/gdal-3.0.4/port -I/usr/include/openjpeg-2.3 -I/usr/include  -DGDAL_COMPILATION -DHAVE_XERCES -I/usr/include -I/usr/include/xercesc -I/tmp/B.lZJ7wH/BUILD/gdal-3.0.4/port -I/usr/include/openjpeg-2.3 -I/usr/include  -DGDAL_COMPILATION  -c -o ograpispy.lo ograpispy.cpp
make[1]: Leaving directory '/tmp/B.lZJ7wH/BUILD/gdal-3.0.4/ogr'
make[1]: Entering directory '/tmp/B.lZJ7wH/BUILD/gdal-3.0.4/ogr'
/bin/sh /tmp/B.lZJ7wH/BUILD/gdal-3.0.4/libtool --mode=compile --silent --tag=CXX x86_64-pld-linux-g++ -I/tmp/B.lZJ7wH/BUILD/gdal-3.0.4/port -I/tmp/B.lZJ7wH/BUILD/gdal-3.0.4/gcore -I/tmp/B.lZJ7wH/BUILD/gdal-3.0.4/alg -I/tmp/B.lZJ7wH/BUILD/gdal-3.0.4/ogr -I/tmp/B.lZJ7wH/BUILD/gdal-3.0.4/ogr/ogrsf_frmts -I/tmp/B.lZJ7wH/BUILD/gdal-3.0.4/gnm -I/tmp/B.lZJ7wH/BUILD/gdal-3.0.4/apps -Weffc++ -Wold-style-cast -DHAVE_MITAB -DHAVE_AVX_AT_COMPILE_TIME -DHAVE_SSSE3_AT_COMPILE_TIME -DHAVE_SSE_AT_COMPILE_TIME -O2 -fwrapv -pipe -Wformat -Werror=format-security -gdwarf-4 -fno-debug-types-section -fvar-tracking-assignments -g2 -Wp,-D_FORTIFY_SOURCE=2 -fstack-protector-strong --param=ssp-buffer-size=4 -Werror=trampolines -fPIC -march=x86-64 -gdwarf-4 -fno-debug-types-section -fvar-tracking-assignments -g2  -fvisibility=hidden  -Wall -Wextra -Winit-self -Wunused-parameter -Wformat -Werror=format-security -Wno-format-nonliteral -Wlogical-op -Wshadow -Werror=vla -Wdate-time -Wnull-dereference -Wduplicated-cond -Wextra-semi -Wfloat-conversion -Wmissing-declarations -Wnon-virtual-dtor -Woverloaded-virtual -fno-operator-names -Wzero-as-null-pointer-constant -Wsuggest-override -Wimplicit-fallthrough  -Iogrsf_frmts -Iogrsf_frmts/mem -Iogrsf_frmts/geojson -I/usr/include/json-c -I.    -DHAVE_XERCES -I/usr/include -I/usr/include/xercesc -DHAVE_EXPAT -I/usr/include -DHAVE_GEOS=1 -I/usr/include -DGNM_ENABLED -I/tmp/B.lZJ7wH/BUILD/gdal-3.0.4/port -I/usr/include/openjpeg-2.3 -I/usr/include  -DGDAL_COMPILATION -DHAVE_XERCES -I/usr/include -I/usr/include/xercesc -I/tmp/B.lZJ7wH/BUILD/gdal-3.0.4/port -I/usr/include/openjpeg-2.3 -I/usr/include  -DGDAL_COMPILATION  -c -o ogrpgeogeometry.lo ogrpgeogeometry.cpp
make[1]: Leaving directory '/tmp/B.lZJ7wH/BUILD/gdal-3.0.4/ogr'
make[3]: Entering directory '/tmp/B.lZJ7wH/BUILD/gdal-3.0.4/ogr/ogrsf_frmts/elastic'
/bin/sh /tmp/B.lZJ7wH/BUILD/gdal-3.0.4/libtool --mode=compile --silent --tag=CXX x86_64-pld-linux-g++ -I/tmp/B.lZJ7wH/BUILD/gdal-3.0.4/port -I/tmp/B.lZJ7wH/BUILD/gdal-3.0.4/gcore -I/tmp/B.lZJ7wH/BUILD/gdal-3.0.4/alg -I/tmp/B.lZJ7wH/BUILD/gdal-3.0.4/ogr -I/tmp/B.lZJ7wH/BUILD/gdal-3.0.4/ogr/ogrsf_frmts -I/tmp/B.lZJ7wH/BUILD/gdal-3.0.4/gnm -I/tmp/B.lZJ7wH/BUILD/gdal-3.0.4/apps -DHAVE_AVX_AT_COMPILE_TIME -DHAVE_SSSE3_AT_COMPILE_TIME -DHAVE_SSE_AT_COMPILE_TIME -O2 -fwrapv -pipe -Wformat -Werror=format-security -gdwarf-4 -fno-debug-types-section -fvar-tracking-assignments -g2 -Wp,-D_FORTIFY_SOURCE=2 -fstack-protector-strong --param=ssp-buffer-size=4 -Werror=trampolines -fPIC -march=x86-64 -gdwarf-4 -fno-debug-types-section -fvar-tracking-assignments -g2  -fvisibility=hidden  -Wall -Wextra -Winit-self -Wunused-parameter -Wformat -Werror=format-security -Wno-format-nonliteral -Wlogical-op -Wshadow -Werror=vla -Wdate-time -Wnull-dereference -Wduplicated-cond -Wextra-semi -Wfloat-conversion -Wmissing-declarations -Wnon-virtual-dtor -Woverloaded-virtual -fno-operator-names -Wzero-as-null-pointer-constant -Wsuggest-override -Wimplicit-fallthrough  -I/usr/include/json-c -I.. -I../.. -I../geojson -DGNM_ENABLED -I/tmp/B.lZJ7wH/BUILD/gdal-3.0.4/port -I/usr/include/openjpeg-2.3 -I/usr/include  -DGDAL_COMPILATION -DHAVE_XERCES -I/usr/include -I/usr/include/xercesc -I/tmp/B.lZJ7wH/BUILD/gdal-3.0.4/port -I/usr/include/openjpeg-2.3 -I/usr/include  -DGDAL_COMPILATION -c -o ../o/ogrelasticlayer.lo ogrelasticlayer.cpp
make[3]: Leaving directory '/tmp/B.lZJ7wH/BUILD/gdal-3.0.4/ogr/ogrsf_frmts/elastic'
make[3]: Entering directory '/tmp/B.lZJ7wH/BUILD/gdal-3.0.4/ogr/ogrsf_frmts/gft'
/bin/sh /tmp/B.lZJ7wH/BUILD/gdal-3.0.4/libtool --mode=compile --silent --tag=CXX x86_64-pld-linux-g++ -I/tmp/B.lZJ7wH/BUILD/gdal-3.0.4/port -I/tmp/B.lZJ7wH/BUILD/gdal-3.0.4/gcore -I/tmp/B.lZJ7wH/BUILD/gdal-3.0.4/alg -I/tmp/B.lZJ7wH/BUILD/gdal-3.0.4/ogr -I/tmp/B.lZJ7wH/BUILD/gdal-3.0.4/ogr/ogrsf_frmts -I/tmp/B.lZJ7wH/BUILD/gdal-3.0.4/gnm -I/tmp/B.lZJ7wH/BUILD/gdal-3.0.4/apps -DHAVE_AVX_AT_COMPILE_TIME -DHAVE_SSSE3_AT_COMPILE_TIME -DHAVE_SSE_AT_COMPILE_TIME -O2 -fwrapv -pipe -Wformat -Werror=format-security -gdwarf-4 -fno-debug-types-section -fvar-tracking-assignments -g2 -Wp,-D_FORTIFY_SOURCE=2 -fstack-protector-strong --param=ssp-buffer-size=4 -Werror=trampolines -fPIC -march=x86-64 -gdwarf-4 -fno-debug-types-section -fvar-tracking-assignments -g2  -fvisibility=hidden  -Wall -Wextra -Winit-self -Wunused-parameter -Wformat -Werror=format-security -Wno-format-nonliteral -Wlogical-op -Wshadow -Werror=vla -Wdate-time -Wnull-dereference -Wduplicated-cond -Wextra-semi -Wfloat-conversion -Wmissing-declarations -Wnon-virtual-dtor -Woverloaded-virtual -fno-operator-names -Wzero-as-null-pointer-constant -Wsuggest-override -Wimplicit-fallthrough  -I.. -I../..  -DGNM_ENABLED -I/tmp/B.lZJ7wH/BUILD/gdal-3.0.4/port -I/usr/include/openjpeg-2.3 -I/usr/include  -DGDAL_COMPILATION -DHAVE_XERCES -I/usr/include -I/usr/include/xercesc -I/tmp/B.lZJ7wH/BUILD/gdal-3.0.4/port -I/usr/include/openjpeg-2.3 -I/usr/include  -DGDAL_COMPILATION -c -o ../o/ogrgfttablelayer.lo ogrgfttablelayer.cpp
make[3]: Leaving directory '/tmp/B.lZJ7wH/BUILD/gdal-3.0.4/ogr/ogrsf_frmts/gft'
make[2]: Entering directory '/tmp/B.lZJ7wH/BUILD/gdal-3.0.4/frmts/pdf'
/bin/sh /tmp/B.lZJ7wH/BUILD/gdal-3.0.4/libtool --mode=compile --silent --tag=CXX x86_64-pld-linux-g++ -I/tmp/B.lZJ7wH/BUILD/gdal-3.0.4/port -I/tmp/B.lZJ7wH/BUILD/gdal-3.0.4/gcore -I/tmp/B.lZJ7wH/BUILD/gdal-3.0.4/alg -I/tmp/B.lZJ7wH/BUILD/gdal-3.0.4/ogr -I/tmp/B.lZJ7wH/BUILD/gdal-3.0.4/ogr/ogrsf_frmts -I/tmp/B.lZJ7wH/BUILD/gdal-3.0.4/gnm -I/tmp/B.lZJ7wH/BUILD/gdal-3.0.4/apps -DHAVE_AVX_AT_COMPILE_TIME -DHAVE_SSSE3_AT_COMPILE_TIME -DHAVE_SSE_AT_COMPILE_TIME -O2 -fwrapv -pipe -Wformat -Werror=format-security -gdwarf-4 -fno-debug-types-section -fvar-tracking-assignments -g2 -Wp,-D_FORTIFY_SOURCE=2 -fstack-protector-strong --param=ssp-buffer-size=4 -Werror=trampolines -fPIC -march=x86-64 -gdwarf-4 -fno-debug-types-section -fvar-tracking-assignments -g2  -fvisibility=hidden  -Wall -Wextra -Winit-self -Wunused-parameter -Wformat -Werror=format-security -Wno-format-nonliteral -Wlogical-op -Wshadow -Werror=vla -Wdate-time -Wnull-dereference -Wduplicated-cond -Wextra-semi -Wfloat-conversion -Wmissing-declarations -Wnon-virtual-dtor -Woverloaded-virtual -fno-operator-names -Wzero-as-null-pointer-constant -Wsuggest-override -Wimplicit-fallthrough  -I../vrt -I../mem -I../../ogr/ogrsf_frmts/mem -DGNM_ENABLED -I/tmp/B.lZJ7wH/BUILD/gdal-3.0.4/port -I/usr/include/openjpeg-2.3 -I/usr/include  -DGDAL_COMPILATION -DHAVE_XERCES -I/usr/include -I/usr/include/xercesc -I/tmp/B.lZJ7wH/BUILD/gdal-3.0.4/port -I/usr/include/openjpeg-2.3 -I/usr/include  -DGDAL_COMPILATION -DHAVE_POPPLER -DPOPPLER_MAJOR_VERSION=20 -DPOPPLER_MINOR_VERSION=10 -I/usr/include -I/usr/include/poppler   -DDO_NOT_USE_DEBUG_BOOL -c -o ../o/pdfcreatefromcomposition.lo pdfcreatefromcomposition.cpp
make[2]: Leaving directory '/tmp/B.lZJ7wH/BUILD/gdal-3.0.4/frmts/pdf'
make: *** [GNUmakefile:103: frmts-target] Error 2
make: *** Waiting for unfinished jobs....
/usr/bin/make -C plscenes
make[1]: Entering directory '/tmp/B.lZJ7wH/BUILD/gdal-3.0.4/ogr'
/bin/sh /tmp/B.lZJ7wH/BUILD/gdal-3.0.4/libtool --mode=compile --silent --tag=CXX x86_64-pld-linux-g++ -I/tmp/B.lZJ7wH/BUILD/gdal-3.0.4/port -I/tmp/B.lZJ7wH/BUILD/gdal-3.0.4/gcore -I/tmp/B.lZJ7wH/BUILD/gdal-3.0.4/alg -I/tmp/B.lZJ7wH/BUILD/gdal-3.0.4/ogr -I/tmp/B.lZJ7wH/BUILD/gdal-3.0.4/ogr/ogrsf_frmts -I/tmp/B.lZJ7wH/BUILD/gdal-3.0.4/gnm -I/tmp/B.lZJ7wH/BUILD/gdal-3.0.4/apps -Weffc++ -Wold-style-cast -DHAVE_MITAB -DHAVE_AVX_AT_COMPILE_TIME -DHAVE_SSSE3_AT_COMPILE_TIME -DHAVE_SSE_AT_COMPILE_TIME -O2 -fwrapv -pipe -Wformat -Werror=format-security -gdwarf-4 -fno-debug-types-section -fvar-tracking-assignments -g2 -Wp,-D_FORTIFY_SOURCE=2 -fstack-protector-strong --param=ssp-buffer-size=4 -Werror=trampolines -fPIC -march=x86-64 -gdwarf-4 -fno-debug-types-section -fvar-tracking-assignments -g2  -fvisibility=hidden  -Wall -Wextra -Winit-self -Wunused-parameter -Wformat -Werror=format-security -Wno-format-nonliteral -Wlogical-op -Wshadow -Werror=vla -Wdate-time -Wnull-dereference -Wduplicated-cond -Wextra-semi -Wfloat-conversion -Wmissing-declarations -Wnon-virtual-dtor -Woverloaded-virtual -fno-operator-names -Wzero-as-null-pointer-constant -Wsuggest-override -Wimplicit-fallthrough  -Iogrsf_frmts -Iogrsf_frmts/mem -Iogrsf_frmts/geojson -I/usr/include/json-c -I.    -DHAVE_XERCES -I/usr/include -I/usr/include/xercesc -DHAVE_EXPAT -I/usr/include -DHAVE_GEOS=1 -I/usr/include -DGNM_ENABLED -I/tmp/B.lZJ7wH/BUILD/gdal-3.0.4/port -I/usr/include/openjpeg-2.3 -I/usr/include  -DGDAL_COMPILATION -DHAVE_XERCES -I/usr/include -I/usr/include/xercesc -I/tmp/B.lZJ7wH/BUILD/gdal-3.0.4/port -I/usr/include/openjpeg-2.3 -I/usr/include  -DGDAL_COMPILATION  -c -o ogr_geocoding.lo ogr_geocoding.cpp
make[1]: Leaving directory '/tmp/B.lZJ7wH/BUILD/gdal-3.0.4/ogr'
make[1]: Entering directory '/tmp/B.lZJ7wH/BUILD/gdal-3.0.4/ogr'
/bin/sh /tmp/B.lZJ7wH/BUILD/gdal-3.0.4/libtool --mode=compile --silent --tag=CXX x86_64-pld-linux-g++ -I/tmp/B.lZJ7wH/BUILD/gdal-3.0.4/port -I/tmp/B.lZJ7wH/BUILD/gdal-3.0.4/gcore -I/tmp/B.lZJ7wH/BUILD/gdal-3.0.4/alg -I/tmp/B.lZJ7wH/BUILD/gdal-3.0.4/ogr -I/tmp/B.lZJ7wH/BUILD/gdal-3.0.4/ogr/ogrsf_frmts -I/tmp/B.lZJ7wH/BUILD/gdal-3.0.4/gnm -I/tmp/B.lZJ7wH/BUILD/gdal-3.0.4/apps -Weffc++ -Wold-style-cast -DHAVE_MITAB -DHAVE_AVX_AT_COMPILE_TIME -DHAVE_SSSE3_AT_COMPILE_TIME -DHAVE_SSE_AT_COMPILE_TIME -O2 -fwrapv -pipe -Wformat -Werror=format-security -gdwarf-4 -fno-debug-types-section -fvar-tracking-assignments -g2 -Wp,-D_FORTIFY_SOURCE=2 -fstack-protector-strong --param=ssp-buffer-size=4 -Werror=trampolines -fPIC -march=x86-64 -gdwarf-4 -fno-debug-types-section -fvar-tracking-assignments -g2  -fvisibility=hidden  -Wall -Wextra -Winit-self -Wunused-parameter -Wformat -Werror=format-security -Wno-format-nonliteral -Wlogical-op -Wshadow -Werror=vla -Wdate-time -Wnull-dereference -Wduplicated-cond -Wextra-semi -Wfloat-conversion -Wmissing-declarations -Wnon-virtual-dtor -Woverloaded-virtual -fno-operator-names -Wzero-as-null-pointer-constant -Wsuggest-override -Wimplicit-fallthrough  -Iogrsf_frmts -Iogrsf_frmts/mem -Iogrsf_frmts/geojson -I/usr/include/json-c -I.    -DHAVE_XERCES -I/usr/include -I/usr/include/xercesc -DHAVE_EXPAT -I/usr/include -DHAVE_GEOS=1 -I/usr/include -DGNM_ENABLED -I/tmp/B.lZJ7wH/BUILD/gdal-3.0.4/port -I/usr/include/openjpeg-2.3 -I/usr/include  -DGDAL_COMPILATION -DHAVE_XERCES -I/usr/include -I/usr/include/xercesc -I/tmp/B.lZJ7wH/BUILD/gdal-3.0.4/port -I/usr/include/openjpeg-2.3 -I/usr/include  -DGDAL_COMPILATION  -c -o ogr_geo_utils.lo ogr_geo_utils.cpp
make[1]: Leaving directory '/tmp/B.lZJ7wH/BUILD/gdal-3.0.4/ogr'
make[1]: Entering directory '/tmp/B.lZJ7wH/BUILD/gdal-3.0.4/ogr'
/bin/sh /tmp/B.lZJ7wH/BUILD/gdal-3.0.4/libtool --mode=compile --silent --tag=CXX x86_64-pld-linux-g++ -I/tmp/B.lZJ7wH/BUILD/gdal-3.0.4/port -I/tmp/B.lZJ7wH/BUILD/gdal-3.0.4/gcore -I/tmp/B.lZJ7wH/BUILD/gdal-3.0.4/alg -I/tmp/B.lZJ7wH/BUILD/gdal-3.0.4/ogr -I/tmp/B.lZJ7wH/BUILD/gdal-3.0.4/ogr/ogrsf_frmts -I/tmp/B.lZJ7wH/BUILD/gdal-3.0.4/gnm -I/tmp/B.lZJ7wH/BUILD/gdal-3.0.4/apps -Weffc++ -Wold-style-cast -DHAVE_MITAB -DHAVE_AVX_AT_COMPILE_TIME -DHAVE_SSSE3_AT_COMPILE_TIME -DHAVE_SSE_AT_COMPILE_TIME -O2 -fwrapv -pipe -Wformat -Werror=format-security -gdwarf-4 -fno-debug-types-section -fvar-tracking-assignments -g2 -Wp,-D_FORTIFY_SOURCE=2 -fstack-protector-strong --param=ssp-buffer-size=4 -Werror=trampolines -fPIC -march=x86-64 -gdwarf-4 -fno-debug-types-section -fvar-tracking-assignments -g2  -fvisibility=hidden  -Wall -Wextra -Winit-self -Wunused-parameter -Wformat -Werror=format-security -Wno-format-nonliteral -Wlogical-op -Wshadow -Werror=vla -Wdate-time -Wnull-dereference -Wduplicated-cond -Wextra-semi -Wfloat-conversion -Wmissing-declarations -Wnon-virtual-dtor -Woverloaded-virtual -fno-operator-names -Wzero-as-null-pointer-constant -Wsuggest-override -Wimplicit-fallthrough  -Iogrsf_frmts -Iogrsf_frmts/mem -Iogrsf_frmts/geojson -I/usr/include/json-c -I.    -DHAVE_XERCES -I/usr/include -I/usr/include/xercesc -DHAVE_EXPAT -I/usr/include -DHAVE_GEOS=1 -I/usr/include -DGNM_ENABLED -I/tmp/B.lZJ7wH/BUILD/gdal-3.0.4/port -I/usr/include/openjpeg-2.3 -I/usr/include  -DGDAL_COMPILATION -DHAVE_XERCES -I/usr/include -I/usr/include/xercesc -I/tmp/B.lZJ7wH/BUILD/gdal-3.0.4/port -I/usr/include/openjpeg-2.3 -I/usr/include  -DGDAL_COMPILATION  -c -o ogr_xerces.lo ogr_xerces.cpp
make[1]: Leaving directory '/tmp/B.lZJ7wH/BUILD/gdal-3.0.4/ogr'
/usr/bin/make -C wfs
make[3]: Entering directory '/tmp/B.lZJ7wH/BUILD/gdal-3.0.4/ogr/ogrsf_frmts/plscenes'
/bin/sh /tmp/B.lZJ7wH/BUILD/gdal-3.0.4/libtool --mode=compile --silent --tag=CXX x86_64-pld-linux-g++ -I/tmp/B.lZJ7wH/BUILD/gdal-3.0.4/port -I/tmp/B.lZJ7wH/BUILD/gdal-3.0.4/gcore -I/tmp/B.lZJ7wH/BUILD/gdal-3.0.4/alg -I/tmp/B.lZJ7wH/BUILD/gdal-3.0.4/ogr -I/tmp/B.lZJ7wH/BUILD/gdal-3.0.4/ogr/ogrsf_frmts -I/tmp/B.lZJ7wH/BUILD/gdal-3.0.4/gnm -I/tmp/B.lZJ7wH/BUILD/gdal-3.0.4/apps -DHAVE_AVX_AT_COMPILE_TIME -DHAVE_SSSE3_AT_COMPILE_TIME -DHAVE_SSE_AT_COMPILE_TIME -O2 -fwrapv -pipe -Wformat -Werror=format-security -gdwarf-4 -fno-debug-types-section -fvar-tracking-assignments -g2 -Wp,-D_FORTIFY_SOURCE=2 -fstack-protector-strong --param=ssp-buffer-size=4 -Werror=trampolines -fPIC -march=x86-64 -gdwarf-4 -fno-debug-types-section -fvar-tracking-assignments -g2  -fvisibility=hidden  -Wall -Wextra -Winit-self -Wunused-parameter -Wformat -Werror=format-security -Wno-format-nonliteral -Wlogical-op -Wshadow -Werror=vla -Wdate-time -Wnull-dereference -Wduplicated-cond -Wextra-semi -Wfloat-conversion -Wmissing-declarations -Wnon-virtual-dtor -Woverloaded-virtual -fno-operator-names -Wzero-as-null-pointer-constant -Wsuggest-override -Wimplicit-fallthrough  -I/usr/include/json-c -I.. -I../.. -I../geojson  -DGNM_ENABLED -I/tmp/B.lZJ7wH/BUILD/gdal-3.0.4/port -I/usr/include/openjpeg-2.3 -I/usr/include  -DGDAL_COMPILATION -DHAVE_XERCES -I/usr/include -I/usr/include/xercesc -I/tmp/B.lZJ7wH/BUILD/gdal-3.0.4/port -I/usr/include/openjpeg-2.3 -I/usr/include  -DGDAL_COMPILATION -c -o ../o/ogrplscenesdriver.lo ogrplscenesdriver.cpp
make[3]: Leaving directory '/tmp/B.lZJ7wH/BUILD/gdal-3.0.4/ogr/ogrsf_frmts/plscenes'
/usr/bin/make -C gpkg
make[3]: Entering directory '/tmp/B.lZJ7wH/BUILD/gdal-3.0.4/ogr/ogrsf_frmts/gft'
/bin/sh /tmp/B.lZJ7wH/BUILD/gdal-3.0.4/libtool --mode=compile --silent --tag=CXX x86_64-pld-linux-g++ -I/tmp/B.lZJ7wH/BUILD/gdal-3.0.4/port -I/tmp/B.lZJ7wH/BUILD/gdal-3.0.4/gcore -I/tmp/B.lZJ7wH/BUILD/gdal-3.0.4/alg -I/tmp/B.lZJ7wH/BUILD/gdal-3.0.4/ogr -I/tmp/B.lZJ7wH/BUILD/gdal-3.0.4/ogr/ogrsf_frmts -I/tmp/B.lZJ7wH/BUILD/gdal-3.0.4/gnm -I/tmp/B.lZJ7wH/BUILD/gdal-3.0.4/apps -DHAVE_AVX_AT_COMPILE_TIME -DHAVE_SSSE3_AT_COMPILE_TIME -DHAVE_SSE_AT_COMPILE_TIME -O2 -fwrapv -pipe -Wformat -Werror=format-security -gdwarf-4 -fno-debug-types-section -fvar-tracking-assignments -g2 -Wp,-D_FORTIFY_SOURCE=2 -fstack-protector-strong --param=ssp-buffer-size=4 -Werror=trampolines -fPIC -march=x86-64 -gdwarf-4 -fno-debug-types-section -fvar-tracking-assignments -g2  -fvisibility=hidden  -Wall -Wextra -Winit-self -Wunused-parameter -Wformat -Werror=format-security -Wno-format-nonliteral -Wlogical-op -Wshadow -Werror=vla -Wdate-time -Wnull-dereference -Wduplicated-cond -Wextra-semi -Wfloat-conversion -Wmissing-declarations -Wnon-virtual-dtor -Woverloaded-virtual -fno-operator-names -Wzero-as-null-pointer-constant -Wsuggest-override -Wimplicit-fallthrough  -I.. -I../..  -DGNM_ENABLED -I/tmp/B.lZJ7wH/BUILD/gdal-3.0.4/port -I/usr/include/openjpeg-2.3 -I/usr/include  -DGDAL_COMPILATION -DHAVE_XERCES -I/usr/include -I/usr/include/xercesc -I/tmp/B.lZJ7wH/BUILD/gdal-3.0.4/port -I/usr/include/openjpeg-2.3 -I/usr/include  -DGDAL_COMPILATION -c -o ../o/ogrgftresultlayer.lo ogrgftresultlayer.cpp
make[3]: Leaving directory '/tmp/B.lZJ7wH/BUILD/gdal-3.0.4/ogr/ogrsf_frmts/gft'
/usr/bin/make -C vfk
make[1]: Entering directory '/tmp/B.lZJ7wH/BUILD/gdal-3.0.4/ogr'
/bin/sh /tmp/B.lZJ7wH/BUILD/gdal-3.0.4/libtool --mode=compile --silent --tag=CXX x86_64-pld-linux-g++ -I/tmp/B.lZJ7wH/BUILD/gdal-3.0.4/port -I/tmp/B.lZJ7wH/BUILD/gdal-3.0.4/gcore -I/tmp/B.lZJ7wH/BUILD/gdal-3.0.4/alg -I/tmp/B.lZJ7wH/BUILD/gdal-3.0.4/ogr -I/tmp/B.lZJ7wH/BUILD/gdal-3.0.4/ogr/ogrsf_frmts -I/tmp/B.lZJ7wH/BUILD/gdal-3.0.4/gnm -I/tmp/B.lZJ7wH/BUILD/gdal-3.0.4/apps -Weffc++ -Wold-style-cast -DHAVE_MITAB -DHAVE_AVX_AT_COMPILE_TIME -DHAVE_SSSE3_AT_COMPILE_TIME -DHAVE_SSE_AT_COMPILE_TIME -O2 -fwrapv -pipe -Wformat -Werror=format-security -gdwarf-4 -fno-debug-types-section -fvar-tracking-assignments -g2 -Wp,-D_FORTIFY_SOURCE=2 -fstack-protector-strong --param=ssp-buffer-size=4 -Werror=trampolines -fPIC -march=x86-64 -gdwarf-4 -fno-debug-types-section -fvar-tracking-assignments -g2  -fvisibility=hidden  -Wall -Wextra -Winit-self -Wunused-parameter -Wformat -Werror=format-security -Wno-format-nonliteral -Wlogical-op -Wshadow -Werror=vla -Wdate-time -Wnull-dereference -Wduplicated-cond -Wextra-semi -Wfloat-conversion -Wmissing-declarations -Wnon-virtual-dtor -Woverloaded-virtual -fno-operator-names -Wzero-as-null-pointer-constant -Wsuggest-override -Wimplicit-fallthrough  -Iogrsf_frmts -Iogrsf_frmts/mem -Iogrsf_frmts/geojson -I/usr/include/json-c -I.    -DHAVE_XERCES -I/usr/include -I/usr/include/xercesc -DHAVE_EXPAT -I/usr/include -DHAVE_GEOS=1 -I/usr/include -DGNM_ENABLED -I/tmp/B.lZJ7wH/BUILD/gdal-3.0.4/port -I/usr/include/openjpeg-2.3 -I/usr/include  -DGDAL_COMPILATION -DHAVE_XERCES -I/usr/include -I/usr/include/xercesc -I/tmp/B.lZJ7wH/BUILD/gdal-3.0.4/port -I/usr/include/openjpeg-2.3 -I/usr/include  -DGDAL_COMPILATION  -c -o ogr_proj_p.lo ogr_proj_p.cpp
make[1]: Leaving directory '/tmp/B.lZJ7wH/BUILD/gdal-3.0.4/ogr'
make[3]: Entering directory '/tmp/B.lZJ7wH/BUILD/gdal-3.0.4/ogr/ogrsf_frmts/wfs'
/bin/sh /tmp/B.lZJ7wH/BUILD/gdal-3.0.4/libtool --mode=compile --silent --tag=CXX x86_64-pld-linux-g++ -I/tmp/B.lZJ7wH/BUILD/gdal-3.0.4/port -I/tmp/B.lZJ7wH/BUILD/gdal-3.0.4/gcore -I/tmp/B.lZJ7wH/BUILD/gdal-3.0.4/alg -I/tmp/B.lZJ7wH/BUILD/gdal-3.0.4/ogr -I/tmp/B.lZJ7wH/BUILD/gdal-3.0.4/ogr/ogrsf_frmts -I/tmp/B.lZJ7wH/BUILD/gdal-3.0.4/gnm -I/tmp/B.lZJ7wH/BUILD/gdal-3.0.4/apps -DHAVE_AVX_AT_COMPILE_TIME -DHAVE_SSSE3_AT_COMPILE_TIME -DHAVE_SSE_AT_COMPILE_TIME -O2 -fwrapv -pipe -Wformat -Werror=format-security -gdwarf-4 -fno-debug-types-section -fvar-tracking-assignments -g2 -Wp,-D_FORTIFY_SOURCE=2 -fstack-protector-strong --param=ssp-buffer-size=4 -Werror=trampolines -fPIC -march=x86-64 -gdwarf-4 -fno-debug-types-section -fvar-tracking-assignments -g2  -fvisibility=hidden  -Wall -Wextra -Winit-self -Wunused-parameter -Wformat -Werror=format-security -Wno-format-nonliteral -Wlogical-op -Wshadow -Werror=vla -Wdate-time -Wnull-dereference -Wduplicated-cond -Wextra-semi -Wfloat-conversion -Wmissing-declarations -Wnon-virtual-dtor -Woverloaded-virtual -fno-operator-names -Wzero-as-null-pointer-constant -Wsuggest-override -Wimplicit-fallthrough  -I.. -I../.. -I../gml  -DGNM_ENABLED -I/tmp/B.lZJ7wH/BUILD/gdal-3.0.4/port -I/usr/include/openjpeg-2.3 -I/usr/include  -DGDAL_COMPILATION -DHAVE_XERCES -I/usr/include -I/usr/include/xercesc -I/tmp/B.lZJ7wH/BUILD/gdal-3.0.4/port -I/usr/include/openjpeg-2.3 -I/usr/include  -DGDAL_COMPILATION -c -o ../o/ogrwfsdriver.lo ogrwfsdriver.cpp
make[3]: Leaving directory '/tmp/B.lZJ7wH/BUILD/gdal-3.0.4/ogr/ogrsf_frmts/wfs'
make[3]: Entering directory '/tmp/B.lZJ7wH/BUILD/gdal-3.0.4/ogr/ogrsf_frmts/ngw'
/bin/sh /tmp/B.lZJ7wH/BUILD/gdal-3.0.4/libtool --mode=compile --silent --tag=CXX x86_64-pld-linux-g++ -I/tmp/B.lZJ7wH/BUILD/gdal-3.0.4/port -I/tmp/B.lZJ7wH/BUILD/gdal-3.0.4/gcore -I/tmp/B.lZJ7wH/BUILD/gdal-3.0.4/alg -I/tmp/B.lZJ7wH/BUILD/gdal-3.0.4/ogr -I/tmp/B.lZJ7wH/BUILD/gdal-3.0.4/ogr/ogrsf_frmts -I/tmp/B.lZJ7wH/BUILD/gdal-3.0.4/gnm -I/tmp/B.lZJ7wH/BUILD/gdal-3.0.4/apps -DHAVE_AVX_AT_COMPILE_TIME -DHAVE_SSSE3_AT_COMPILE_TIME -DHAVE_SSE_AT_COMPILE_TIME -O2 -fwrapv -pipe -Wformat -Werror=format-security -gdwarf-4 -fno-debug-types-section -fvar-tracking-assignments -g2 -Wp,-D_FORTIFY_SOURCE=2 -fstack-protector-strong --param=ssp-buffer-size=4 -Werror=trampolines -fPIC -march=x86-64 -gdwarf-4 -fno-debug-types-section -fvar-tracking-assignments -g2  -fvisibility=hidden  -Wall -Wextra -Winit-self -Wunused-parameter -Wformat -Werror=format-security -Wno-format-nonliteral -Wlogical-op -Wshadow -Werror=vla -Wdate-time -Wnull-dereference -Wduplicated-cond -Wextra-semi -Wfloat-conversion -Wmissing-declarations -Wnon-virtual-dtor -Woverloaded-virtual -fno-operator-names -Wzero-as-null-pointer-constant -Wsuggest-override -Wimplicit-fallthrough  -I. -I.. -I../.. -DGNM_ENABLED -I/tmp/B.lZJ7wH/BUILD/gdal-3.0.4/port -I/usr/include/openjpeg-2.3 -I/usr/include  -DGDAL_COMPILATION -DHAVE_XERCES -I/usr/include -I/usr/include/xercesc -I/tmp/B.lZJ7wH/BUILD/gdal-3.0.4/port -I/usr/include/openjpeg-2.3 -I/usr/include  -DGDAL_COMPILATION -c -o ../o/gdalngwdataset.lo gdalngwdataset.cpp
make[3]: Leaving directory '/tmp/B.lZJ7wH/BUILD/gdal-3.0.4/ogr/ogrsf_frmts/ngw'
make[3]: Entering directory '/tmp/B.lZJ7wH/BUILD/gdal-3.0.4/ogr/ogrsf_frmts/ngw'
/bin/sh /tmp/B.lZJ7wH/BUILD/gdal-3.0.4/libtool --mode=compile --silent --tag=CXX x86_64-pld-linux-g++ -I/tmp/B.lZJ7wH/BUILD/gdal-3.0.4/port -I/tmp/B.lZJ7wH/BUILD/gdal-3.0.4/gcore -I/tmp/B.lZJ7wH/BUILD/gdal-3.0.4/alg -I/tmp/B.lZJ7wH/BUILD/gdal-3.0.4/ogr -I/tmp/B.lZJ7wH/BUILD/gdal-3.0.4/ogr/ogrsf_frmts -I/tmp/B.lZJ7wH/BUILD/gdal-3.0.4/gnm -I/tmp/B.lZJ7wH/BUILD/gdal-3.0.4/apps -DHAVE_AVX_AT_COMPILE_TIME -DHAVE_SSSE3_AT_COMPILE_TIME -DHAVE_SSE_AT_COMPILE_TIME -O2 -fwrapv -pipe -Wformat -Werror=format-security -gdwarf-4 -fno-debug-types-section -fvar-tracking-assignments -g2 -Wp,-D_FORTIFY_SOURCE=2 -fstack-protector-strong --param=ssp-buffer-size=4 -Werror=trampolines -fPIC -march=x86-64 -gdwarf-4 -fno-debug-types-section -fvar-tracking-assignments -g2  -fvisibility=hidden  -Wall -Wextra -Winit-self -Wunused-parameter -Wformat -Werror=format-security -Wno-format-nonliteral -Wlogical-op -Wshadow -Werror=vla -Wdate-time -Wnull-dereference -Wduplicated-cond -Wextra-semi -Wfloat-conversion -Wmissing-declarations -Wnon-virtual-dtor -Woverloaded-virtual -fno-operator-names -Wzero-as-null-pointer-constant -Wsuggest-override -Wimplicit-fallthrough  -I. -I.. -I../.. -DGNM_ENABLED -I/tmp/B.lZJ7wH/BUILD/gdal-3.0.4/port -I/usr/include/openjpeg-2.3 -I/usr/include  -DGDAL_COMPILATION -DHAVE_XERCES -I/usr/include -I/usr/include/xercesc -I/tmp/B.lZJ7wH/BUILD/gdal-3.0.4/port -I/usr/include/openjpeg-2.3 -I/usr/include  -DGDAL_COMPILATION -c -o ../o/ngw_api.lo ngw_api.cpp
make[3]: Leaving directory '/tmp/B.lZJ7wH/BUILD/gdal-3.0.4/ogr/ogrsf_frmts/ngw'
make[3]: Entering directory '/tmp/B.lZJ7wH/BUILD/gdal-3.0.4/ogr/ogrsf_frmts/plscenes'
/bin/sh /tmp/B.lZJ7wH/BUILD/gdal-3.0.4/libtool --mode=compile --silent --tag=CXX x86_64-pld-linux-g++ -I/tmp/B.lZJ7wH/BUILD/gdal-3.0.4/port -I/tmp/B.lZJ7wH/BUILD/gdal-3.0.4/gcore -I/tmp/B.lZJ7wH/BUILD/gdal-3.0.4/alg -I/tmp/B.lZJ7wH/BUILD/gdal-3.0.4/ogr -I/tmp/B.lZJ7wH/BUILD/gdal-3.0.4/ogr/ogrsf_frmts -I/tmp/B.lZJ7wH/BUILD/gdal-3.0.4/gnm -I/tmp/B.lZJ7wH/BUILD/gdal-3.0.4/apps -DHAVE_AVX_AT_COMPILE_TIME -DHAVE_SSSE3_AT_COMPILE_TIME -DHAVE_SSE_AT_COMPILE_TIME -O2 -fwrapv -pipe -Wformat -Werror=format-security -gdwarf-4 -fno-debug-types-section -fvar-tracking-assignments -g2 -Wp,-D_FORTIFY_SOURCE=2 -fstack-protector-strong --param=ssp-buffer-size=4 -Werror=trampolines -fPIC -march=x86-64 -gdwarf-4 -fno-debug-types-section -fvar-tracking-assignments -g2  -fvisibility=hidden  -Wall -Wextra -Winit-self -Wunused-parameter -Wformat -Werror=format-security -Wno-format-nonliteral -Wlogical-op -Wshadow -Werror=vla -Wdate-time -Wnull-dereference -Wduplicated-cond -Wextra-semi -Wfloat-conversion -Wmissing-declarations -Wnon-virtual-dtor -Woverloaded-virtual -fno-operator-names -Wzero-as-null-pointer-constant -Wsuggest-override -Wimplicit-fallthrough  -I/usr/include/json-c -I.. -I../.. -I../geojson  -DGNM_ENABLED -I/tmp/B.lZJ7wH/BUILD/gdal-3.0.4/port -I/usr/include/openjpeg-2.3 -I/usr/include  -DGDAL_COMPILATION -DHAVE_XERCES -I/usr/include -I/usr/include/xercesc -I/tmp/B.lZJ7wH/BUILD/gdal-3.0.4/port -I/usr/include/openjpeg-2.3 -I/usr/include  -DGDAL_COMPILATION -c -o ../o/ogrplscenesdatav1dataset.lo ogrplscenesdatav1dataset.cpp
make[3]: Leaving directory '/tmp/B.lZJ7wH/BUILD/gdal-3.0.4/ogr/ogrsf_frmts/plscenes'
make[3]: Entering directory '/tmp/B.lZJ7wH/BUILD/gdal-3.0.4/ogr/ogrsf_frmts/plscenes'
/bin/sh /tmp/B.lZJ7wH/BUILD/gdal-3.0.4/libtool --mode=compile --silent --tag=CXX x86_64-pld-linux-g++ -I/tmp/B.lZJ7wH/BUILD/gdal-3.0.4/port -I/tmp/B.lZJ7wH/BUILD/gdal-3.0.4/gcore -I/tmp/B.lZJ7wH/BUILD/gdal-3.0.4/alg -I/tmp/B.lZJ7wH/BUILD/gdal-3.0.4/ogr -I/tmp/B.lZJ7wH/BUILD/gdal-3.0.4/ogr/ogrsf_frmts -I/tmp/B.lZJ7wH/BUILD/gdal-3.0.4/gnm -I/tmp/B.lZJ7wH/BUILD/gdal-3.0.4/apps -DHAVE_AVX_AT_COMPILE_TIME -DHAVE_SSSE3_AT_COMPILE_TIME -DHAVE_SSE_AT_COMPILE_TIME -O2 -fwrapv -pipe -Wformat -Werror=format-security -gdwarf-4 -fno-debug-types-section -fvar-tracking-assignments -g2 -Wp,-D_FORTIFY_SOURCE=2 -fstack-protector-strong --param=ssp-buffer-size=4 -Werror=trampolines -fPIC -march=x86-64 -gdwarf-4 -fno-debug-types-section -fvar-tracking-assignments -g2  -fvisibility=hidden  -Wall -Wextra -Winit-self -Wunused-parameter -Wformat -Werror=format-security -Wno-format-nonliteral -Wlogical-op -Wshadow -Werror=vla -Wdate-time -Wnull-dereference -Wduplicated-cond -Wextra-semi -Wfloat-conversion -Wmissing-declarations -Wnon-virtual-dtor -Woverloaded-virtual -fno-operator-names -Wzero-as-null-pointer-constant -Wsuggest-override -Wimplicit-fallthrough  -I/usr/include/json-c -I.. -I../.. -I../geojson  -DGNM_ENABLED -I/tmp/B.lZJ7wH/BUILD/gdal-3.0.4/port -I/usr/include/openjpeg-2.3 -I/usr/include  -DGDAL_COMPILATION -DHAVE_XERCES -I/usr/include -I/usr/include/xercesc -I/tmp/B.lZJ7wH/BUILD/gdal-3.0.4/port -I/usr/include/openjpeg-2.3 -I/usr/include  -DGDAL_COMPILATION -c -o ../o/ogrplscenesdatav1layer.lo ogrplscenesdatav1layer.cpp
make[3]: Leaving directory '/tmp/B.lZJ7wH/BUILD/gdal-3.0.4/ogr/ogrsf_frmts/plscenes'
/usr/bin/make -C osm
make[3]: Entering directory '/tmp/B.lZJ7wH/BUILD/gdal-3.0.4/ogr/ogrsf_frmts/gpkg'
/bin/sh /tmp/B.lZJ7wH/BUILD/gdal-3.0.4/libtool --mode=compile --silent --tag=CXX x86_64-pld-linux-g++ -I/tmp/B.lZJ7wH/BUILD/gdal-3.0.4/port -I/tmp/B.lZJ7wH/BUILD/gdal-3.0.4/gcore -I/tmp/B.lZJ7wH/BUILD/gdal-3.0.4/alg -I/tmp/B.lZJ7wH/BUILD/gdal-3.0.4/ogr -I/tmp/B.lZJ7wH/BUILD/gdal-3.0.4/ogr/ogrsf_frmts -I/tmp/B.lZJ7wH/BUILD/gdal-3.0.4/gnm -I/tmp/B.lZJ7wH/BUILD/gdal-3.0.4/apps -DHAVE_AVX_AT_COMPILE_TIME -DHAVE_SSSE3_AT_COMPILE_TIME -DHAVE_SSE_AT_COMPILE_TIME -O2 -fwrapv -pipe -Wformat -Werror=format-security -gdwarf-4 -fno-debug-types-section -fvar-tracking-assignments -g2 -Wp,-D_FORTIFY_SOURCE=2 -fstack-protector-strong --param=ssp-buffer-size=4 -Werror=trampolines -fPIC -march=x86-64 -gdwarf-4 -fno-debug-types-section -fvar-tracking-assignments -g2  -fvisibility=hidden  -Wall -Wextra -Winit-self -Wunused-parameter -Wformat -Werror=format-security -Wno-format-nonliteral -Wlogical-op -Wshadow -Werror=vla -Wdate-time -Wnull-dereference -Wduplicated-cond -Wextra-semi -Wfloat-conversion -Wmissing-declarations -Wnon-virtual-dtor -Woverloaded-virtual -fno-operator-names -Wzero-as-null-pointer-constant -Wsuggest-override -Wimplicit-fallthrough  -I.. -I../sqlite -I../../../frmts/mem -I../../../frmts -I/usr/include -DGNM_ENABLED -I/tmp/B.lZJ7wH/BUILD/gdal-3.0.4/port -I/usr/include/openjpeg-2.3 -I/usr/include  -DGDAL_COMPILATION -DHAVE_XERCES -I/usr/include -I/usr/include/xercesc -I/tmp/B.lZJ7wH/BUILD/gdal-3.0.4/port -I/usr/include/openjpeg-2.3 -I/usr/include  -DGDAL_COMPILATION -DSQLITE_HAS_COLUMN_METADATA -c -o ../o/ogrgeopackagedriver.lo ogrgeopackagedriver.cpp
make[3]: Leaving directory '/tmp/B.lZJ7wH/BUILD/gdal-3.0.4/ogr/ogrsf_frmts/gpkg'
make[3]: Entering directory '/tmp/B.lZJ7wH/BUILD/gdal-3.0.4/ogr/ogrsf_frmts/vfk'
/bin/sh /tmp/B.lZJ7wH/BUILD/gdal-3.0.4/libtool --mode=compile --silent --tag=CXX x86_64-pld-linux-g++ -I/tmp/B.lZJ7wH/BUILD/gdal-3.0.4/port -I/tmp/B.lZJ7wH/BUILD/gdal-3.0.4/gcore -I/tmp/B.lZJ7wH/BUILD/gdal-3.0.4/alg -I/tmp/B.lZJ7wH/BUILD/gdal-3.0.4/ogr -I/tmp/B.lZJ7wH/BUILD/gdal-3.0.4/ogr/ogrsf_frmts -I/tmp/B.lZJ7wH/BUILD/gdal-3.0.4/gnm -I/tmp/B.lZJ7wH/BUILD/gdal-3.0.4/apps -DHAVE_AVX_AT_COMPILE_TIME -DHAVE_SSSE3_AT_COMPILE_TIME -DHAVE_SSE_AT_COMPILE_TIME -O2 -fwrapv -pipe -Wformat -Werror=format-security -gdwarf-4 -fno-debug-types-section -fvar-tracking-assignments -g2 -Wp,-D_FORTIFY_SOURCE=2 -fstack-protector-strong --param=ssp-buffer-size=4 -Werror=trampolines -fPIC -march=x86-64 -gdwarf-4 -fno-debug-types-section -fvar-tracking-assignments -g2  -fvisibility=hidden  -Wall -Wextra -Winit-self -Wunused-parameter -Wformat -Werror=format-security -Wno-format-nonliteral -Wlogical-op -Wshadow -Werror=vla -Wdate-time -Wnull-dereference -Wduplicated-cond -Wextra-semi -Wfloat-conversion -Wmissing-declarations -Wnon-virtual-dtor -Woverloaded-virtual -fno-operator-names -Wzero-as-null-pointer-constant -Wsuggest-override -Wimplicit-fallthrough  -I.. -I../..  -I/usr/include -DGNM_ENABLED -I/tmp/B.lZJ7wH/BUILD/gdal-3.0.4/port -I/usr/include/openjpeg-2.3 -I/usr/include  -DGDAL_COMPILATION -DHAVE_XERCES -I/usr/include -I/usr/include/xercesc -I/tmp/B.lZJ7wH/BUILD/gdal-3.0.4/port -I/usr/include/openjpeg-2.3 -I/usr/include  -DGDAL_COMPILATION -c -o ../o/vfkreader.lo vfkreader.cpp
In file included from vfkreader.cpp:34:
vfkreader.h: In member function 'virtual IVFKDataBlock* VFKReader::GetDataBlock(const char*) const':
vfkreader.h:263:49: warning: potential null pointer dereference [-Wnull-dereference]
  263 |     const char        *GetName() const { return m_pszName; }
      |                                                 ^~~~~~~~~
make[3]: Leaving directory '/tmp/B.lZJ7wH/BUILD/gdal-3.0.4/ogr/ogrsf_frmts/vfk'
make[3]: Entering directory '/tmp/B.lZJ7wH/BUILD/gdal-3.0.4/ogr/ogrsf_frmts/ngw'
/bin/sh /tmp/B.lZJ7wH/BUILD/gdal-3.0.4/libtool --mode=compile --silent --tag=CXX x86_64-pld-linux-g++ -I/tmp/B.lZJ7wH/BUILD/gdal-3.0.4/port -I/tmp/B.lZJ7wH/BUILD/gdal-3.0.4/gcore -I/tmp/B.lZJ7wH/BUILD/gdal-3.0.4/alg -I/tmp/B.lZJ7wH/BUILD/gdal-3.0.4/ogr -I/tmp/B.lZJ7wH/BUILD/gdal-3.0.4/ogr/ogrsf_frmts -I/tmp/B.lZJ7wH/BUILD/gdal-3.0.4/gnm -I/tmp/B.lZJ7wH/BUILD/gdal-3.0.4/apps -DHAVE_AVX_AT_COMPILE_TIME -DHAVE_SSSE3_AT_COMPILE_TIME -DHAVE_SSE_AT_COMPILE_TIME -O2 -fwrapv -pipe -Wformat -Werror=format-security -gdwarf-4 -fno-debug-types-section -fvar-tracking-assignments -g2 -Wp,-D_FORTIFY_SOURCE=2 -fstack-protector-strong --param=ssp-buffer-size=4 -Werror=trampolines -fPIC -march=x86-64 -gdwarf-4 -fno-debug-types-section -fvar-tracking-assignments -g2  -fvisibility=hidden  -Wall -Wextra -Winit-self -Wunused-parameter -Wformat -Werror=format-security -Wno-format-nonliteral -Wlogical-op -Wshadow -Werror=vla -Wdate-time -Wnull-dereference -Wduplicated-cond -Wextra-semi -Wfloat-conversion -Wmissing-declarations -Wnon-virtual-dtor -Woverloaded-virtual -fno-operator-names -Wzero-as-null-pointer-constant -Wsuggest-override -Wimplicit-fallthrough  -I. -I.. -I../.. -DGNM_ENABLED -I/tmp/B.lZJ7wH/BUILD/gdal-3.0.4/port -I/usr/include/openjpeg-2.3 -I/usr/include  -DGDAL_COMPILATION -DHAVE_XERCES -I/usr/include -I/usr/include/xercesc -I/tmp/B.lZJ7wH/BUILD/gdal-3.0.4/port -I/usr/include/openjpeg-2.3 -I/usr/include  -DGDAL_COMPILATION -c -o ../o/ogrngwlayer.lo ogrngwlayer.cpp
make[3]: Leaving directory '/tmp/B.lZJ7wH/BUILD/gdal-3.0.4/ogr/ogrsf_frmts/ngw'
make[3]: Entering directory '/tmp/B.lZJ7wH/BUILD/gdal-3.0.4/ogr/ogrsf_frmts/vfk'
/bin/sh /tmp/B.lZJ7wH/BUILD/gdal-3.0.4/libtool --mode=compile --silent --tag=CXX x86_64-pld-linux-g++ -I/tmp/B.lZJ7wH/BUILD/gdal-3.0.4/port -I/tmp/B.lZJ7wH/BUILD/gdal-3.0.4/gcore -I/tmp/B.lZJ7wH/BUILD/gdal-3.0.4/alg -I/tmp/B.lZJ7wH/BUILD/gdal-3.0.4/ogr -I/tmp/B.lZJ7wH/BUILD/gdal-3.0.4/ogr/ogrsf_frmts -I/tmp/B.lZJ7wH/BUILD/gdal-3.0.4/gnm -I/tmp/B.lZJ7wH/BUILD/gdal-3.0.4/apps -DHAVE_AVX_AT_COMPILE_TIME -DHAVE_SSSE3_AT_COMPILE_TIME -DHAVE_SSE_AT_COMPILE_TIME -O2 -fwrapv -pipe -Wformat -Werror=format-security -gdwarf-4 -fno-debug-types-section -fvar-tracking-assignments -g2 -Wp,-D_FORTIFY_SOURCE=2 -fstack-protector-strong --param=ssp-buffer-size=4 -Werror=trampolines -fPIC -march=x86-64 -gdwarf-4 -fno-debug-types-section -fvar-tracking-assignments -g2  -fvisibility=hidden  -Wall -Wextra -Winit-self -Wunused-parameter -Wformat -Werror=format-security -Wno-format-nonliteral -Wlogical-op -Wshadow -Werror=vla -Wdate-time -Wnull-dereference -Wduplicated-cond -Wextra-semi -Wfloat-conversion -Wmissing-declarations -Wnon-virtual-dtor -Woverloaded-virtual -fno-operator-names -Wzero-as-null-pointer-constant -Wsuggest-override -Wimplicit-fallthrough  -I.. -I../..  -I/usr/include -DGNM_ENABLED -I/tmp/B.lZJ7wH/BUILD/gdal-3.0.4/port -I/usr/include/openjpeg-2.3 -I/usr/include  -DGDAL_COMPILATION -DHAVE_XERCES -I/usr/include -I/usr/include/xercesc -I/tmp/B.lZJ7wH/BUILD/gdal-3.0.4/port -I/usr/include/openjpeg-2.3 -I/usr/include  -DGDAL_COMPILATION -c -o ../o/vfkreadersqlite.lo vfkreadersqlite.cpp
make[3]: Leaving directory '/tmp/B.lZJ7wH/BUILD/gdal-3.0.4/ogr/ogrsf_frmts/vfk'
make[3]: Entering directory '/tmp/B.lZJ7wH/BUILD/gdal-3.0.4/ogr/ogrsf_frmts/osm'
/bin/sh /tmp/B.lZJ7wH/BUILD/gdal-3.0.4/libtool --mode=compile --silent --tag=CXX x86_64-pld-linux-g++ -I/tmp/B.lZJ7wH/BUILD/gdal-3.0.4/port -I/tmp/B.lZJ7wH/BUILD/gdal-3.0.4/gcore -I/tmp/B.lZJ7wH/BUILD/gdal-3.0.4/alg -I/tmp/B.lZJ7wH/BUILD/gdal-3.0.4/ogr -I/tmp/B.lZJ7wH/BUILD/gdal-3.0.4/ogr/ogrsf_frmts -I/tmp/B.lZJ7wH/BUILD/gdal-3.0.4/gnm -I/tmp/B.lZJ7wH/BUILD/gdal-3.0.4/apps -DHAVE_AVX_AT_COMPILE_TIME -DHAVE_SSSE3_AT_COMPILE_TIME -DHAVE_SSE_AT_COMPILE_TIME -O2 -fwrapv -pipe -Wformat -Werror=format-security -gdwarf-4 -fno-debug-types-section -fvar-tracking-assignments -g2 -Wp,-D_FORTIFY_SOURCE=2 -fstack-protector-strong --param=ssp-buffer-size=4 -Werror=trampolines -fPIC -march=x86-64 -gdwarf-4 -fno-debug-types-section -fvar-tracking-assignments -g2  -fvisibility=hidden  -Wall -Wextra -Winit-self -Wunused-parameter -Wformat -Werror=format-security -Wno-format-nonliteral -Wlogical-op -Wshadow -Werror=vla -Wdate-time -Wnull-dereference -Wduplicated-cond -Wextra-semi -Wfloat-conversion -Wmissing-declarations -Wnon-virtual-dtor -Woverloaded-virtual -fno-operator-names -Wzero-as-null-pointer-constant -Wsuggest-override -Wimplicit-fallthrough  -I.. -I../.. -I../sqlite -I../generic  -I/usr/include -I/usr/include -DGNM_ENABLED -I/tmp/B.lZJ7wH/BUILD/gdal-3.0.4/port -I/usr/include/openjpeg-2.3 -I/usr/include  -DGDAL_COMPILATION -DHAVE_XERCES -I/usr/include -I/usr/include/xercesc -I/tmp/B.lZJ7wH/BUILD/gdal-3.0.4/port -I/usr/include/openjpeg-2.3 -I/usr/include  -DGDAL_COMPILATION -DHAVE_EXPAT -c -o ../o/ogrosmdriver.lo ogrosmdriver.cpp
make[3]: Leaving directory '/tmp/B.lZJ7wH/BUILD/gdal-3.0.4/ogr/ogrsf_frmts/osm'
make[3]: Entering directory '/tmp/B.lZJ7wH/BUILD/gdal-3.0.4/ogr/ogrsf_frmts/vfk'
/bin/sh /tmp/B.lZJ7wH/BUILD/gdal-3.0.4/libtool --mode=compile --silent --tag=CXX x86_64-pld-linux-g++ -I/tmp/B.lZJ7wH/BUILD/gdal-3.0.4/port -I/tmp/B.lZJ7wH/BUILD/gdal-3.0.4/gcore -I/tmp/B.lZJ7wH/BUILD/gdal-3.0.4/alg -I/tmp/B.lZJ7wH/BUILD/gdal-3.0.4/ogr -I/tmp/B.lZJ7wH/BUILD/gdal-3.0.4/ogr/ogrsf_frmts -I/tmp/B.lZJ7wH/BUILD/gdal-3.0.4/gnm -I/tmp/B.lZJ7wH/BUILD/gdal-3.0.4/apps -DHAVE_AVX_AT_COMPILE_TIME -DHAVE_SSSE3_AT_COMPILE_TIME -DHAVE_SSE_AT_COMPILE_TIME -O2 -fwrapv -pipe -Wformat -Werror=format-security -gdwarf-4 -fno-debug-types-section -fvar-tracking-assignments -g2 -Wp,-D_FORTIFY_SOURCE=2 -fstack-protector-strong --param=ssp-buffer-size=4 -Werror=trampolines -fPIC -march=x86-64 -gdwarf-4 -fno-debug-types-section -fvar-tracking-assignments -g2  -fvisibility=hidden  -Wall -Wextra -Winit-self -Wunused-parameter -Wformat -Werror=format-security -Wno-format-nonliteral -Wlogical-op -Wshadow -Werror=vla -Wdate-time -Wnull-dereference -Wduplicated-cond -Wextra-semi -Wfloat-conversion -Wmissing-declarations -Wnon-virtual-dtor -Woverloaded-virtual -fno-operator-names -Wzero-as-null-pointer-constant -Wsuggest-override -Wimplicit-fallthrough  -I.. -I../..  -I/usr/include -DGNM_ENABLED -I/tmp/B.lZJ7wH/BUILD/gdal-3.0.4/port -I/usr/include/openjpeg-2.3 -I/usr/include  -DGDAL_COMPILATION -DHAVE_XERCES -I/usr/include -I/usr/include/xercesc -I/tmp/B.lZJ7wH/BUILD/gdal-3.0.4/port -I/usr/include/openjpeg-2.3 -I/usr/include  -DGDAL_COMPILATION -c -o ../o/vfkdatablock.lo vfkdatablock.cpp
make[3]: Leaving directory '/tmp/B.lZJ7wH/BUILD/gdal-3.0.4/ogr/ogrsf_frmts/vfk'
make[3]: Entering directory '/tmp/B.lZJ7wH/BUILD/gdal-3.0.4/ogr/ogrsf_frmts/vfk'
/bin/sh /tmp/B.lZJ7wH/BUILD/gdal-3.0.4/libtool --mode=compile --silent --tag=CXX x86_64-pld-linux-g++ -I/tmp/B.lZJ7wH/BUILD/gdal-3.0.4/port -I/tmp/B.lZJ7wH/BUILD/gdal-3.0.4/gcore -I/tmp/B.lZJ7wH/BUILD/gdal-3.0.4/alg -I/tmp/B.lZJ7wH/BUILD/gdal-3.0.4/ogr -I/tmp/B.lZJ7wH/BUILD/gdal-3.0.4/ogr/ogrsf_frmts -I/tmp/B.lZJ7wH/BUILD/gdal-3.0.4/gnm -I/tmp/B.lZJ7wH/BUILD/gdal-3.0.4/apps -DHAVE_AVX_AT_COMPILE_TIME -DHAVE_SSSE3_AT_COMPILE_TIME -DHAVE_SSE_AT_COMPILE_TIME -O2 -fwrapv -pipe -Wformat -Werror=format-security -gdwarf-4 -fno-debug-types-section -fvar-tracking-assignments -g2 -Wp,-D_FORTIFY_SOURCE=2 -fstack-protector-strong --param=ssp-buffer-size=4 -Werror=trampolines -fPIC -march=x86-64 -gdwarf-4 -fno-debug-types-section -fvar-tracking-assignments -g2  -fvisibility=hidden  -Wall -Wextra -Winit-self -Wunused-parameter -Wformat -Werror=format-security -Wno-format-nonliteral -Wlogical-op -Wshadow -Werror=vla -Wdate-time -Wnull-dereference -Wduplicated-cond -Wextra-semi -Wfloat-conversion -Wmissing-declarations -Wnon-virtual-dtor -Woverloaded-virtual -fno-operator-names -Wzero-as-null-pointer-constant -Wsuggest-override -Wimplicit-fallthrough  -I.. -I../..  -I/usr/include -DGNM_ENABLED -I/tmp/B.lZJ7wH/BUILD/gdal-3.0.4/port -I/usr/include/openjpeg-2.3 -I/usr/include  -DGDAL_COMPILATION -DHAVE_XERCES -I/usr/include -I/usr/include/xercesc -I/tmp/B.lZJ7wH/BUILD/gdal-3.0.4/port -I/usr/include/openjpeg-2.3 -I/usr/include  -DGDAL_COMPILATION -c -o ../o/vfkdatablocksqlite.lo vfkdatablocksqlite.cpp
make[3]: Leaving directory '/tmp/B.lZJ7wH/BUILD/gdal-3.0.4/ogr/ogrsf_frmts/vfk'
make[3]: Entering directory '/tmp/B.lZJ7wH/BUILD/gdal-3.0.4/ogr/ogrsf_frmts/vfk'
/bin/sh /tmp/B.lZJ7wH/BUILD/gdal-3.0.4/libtool --mode=compile --silent --tag=CXX x86_64-pld-linux-g++ -I/tmp/B.lZJ7wH/BUILD/gdal-3.0.4/port -I/tmp/B.lZJ7wH/BUILD/gdal-3.0.4/gcore -I/tmp/B.lZJ7wH/BUILD/gdal-3.0.4/alg -I/tmp/B.lZJ7wH/BUILD/gdal-3.0.4/ogr -I/tmp/B.lZJ7wH/BUILD/gdal-3.0.4/ogr/ogrsf_frmts -I/tmp/B.lZJ7wH/BUILD/gdal-3.0.4/gnm -I/tmp/B.lZJ7wH/BUILD/gdal-3.0.4/apps -DHAVE_AVX_AT_COMPILE_TIME -DHAVE_SSSE3_AT_COMPILE_TIME -DHAVE_SSE_AT_COMPILE_TIME -O2 -fwrapv -pipe -Wformat -Werror=format-security -gdwarf-4 -fno-debug-types-section -fvar-tracking-assignments -g2 -Wp,-D_FORTIFY_SOURCE=2 -fstack-protector-strong --param=ssp-buffer-size=4 -Werror=trampolines -fPIC -march=x86-64 -gdwarf-4 -fno-debug-types-section -fvar-tracking-assignments -g2  -fvisibility=hidden  -Wall -Wextra -Winit-self -Wunused-parameter -Wformat -Werror=format-security -Wno-format-nonliteral -Wlogical-op -Wshadow -Werror=vla -Wdate-time -Wnull-dereference -Wduplicated-cond -Wextra-semi -Wfloat-conversion -Wmissing-declarations -Wnon-virtual-dtor -Woverloaded-virtual -fno-operator-names -Wzero-as-null-pointer-constant -Wsuggest-override -Wimplicit-fallthrough  -I.. -I../..  -I/usr/include -DGNM_ENABLED -I/tmp/B.lZJ7wH/BUILD/gdal-3.0.4/port -I/usr/include/openjpeg-2.3 -I/usr/include  -DGDAL_COMPILATION -DHAVE_XERCES -I/usr/include -I/usr/include/xercesc -I/tmp/B.lZJ7wH/BUILD/gdal-3.0.4/port -I/usr/include/openjpeg-2.3 -I/usr/include  -DGDAL_COMPILATION -c -o ../o/vfkpropertydefn.lo vfkpropertydefn.cpp
make[3]: Leaving directory '/tmp/B.lZJ7wH/BUILD/gdal-3.0.4/ogr/ogrsf_frmts/vfk'
make[3]: Entering directory '/tmp/B.lZJ7wH/BUILD/gdal-3.0.4/ogr/ogrsf_frmts/wfs'
/bin/sh /tmp/B.lZJ7wH/BUILD/gdal-3.0.4/libtool --mode=compile --silent --tag=CXX x86_64-pld-linux-g++ -I/tmp/B.lZJ7wH/BUILD/gdal-3.0.4/port -I/tmp/B.lZJ7wH/BUILD/gdal-3.0.4/gcore -I/tmp/B.lZJ7wH/BUILD/gdal-3.0.4/alg -I/tmp/B.lZJ7wH/BUILD/gdal-3.0.4/ogr -I/tmp/B.lZJ7wH/BUILD/gdal-3.0.4/ogr/ogrsf_frmts -I/tmp/B.lZJ7wH/BUILD/gdal-3.0.4/gnm -I/tmp/B.lZJ7wH/BUILD/gdal-3.0.4/apps -DHAVE_AVX_AT_COMPILE_TIME -DHAVE_SSSE3_AT_COMPILE_TIME -DHAVE_SSE_AT_COMPILE_TIME -O2 -fwrapv -pipe -Wformat -Werror=format-security -gdwarf-4 -fno-debug-types-section -fvar-tracking-assignments -g2 -Wp,-D_FORTIFY_SOURCE=2 -fstack-protector-strong --param=ssp-buffer-size=4 -Werror=trampolines -fPIC -march=x86-64 -gdwarf-4 -fno-debug-types-section -fvar-tracking-assignments -g2  -fvisibility=hidden  -Wall -Wextra -Winit-self -Wunused-parameter -Wformat -Werror=format-security -Wno-format-nonliteral -Wlogical-op -Wshadow -Werror=vla -Wdate-time -Wnull-dereference -Wduplicated-cond -Wextra-semi -Wfloat-conversion -Wmissing-declarations -Wnon-virtual-dtor -Woverloaded-virtual -fno-operator-names -Wzero-as-null-pointer-constant -Wsuggest-override -Wimplicit-fallthrough  -I.. -I../.. -I../gml  -DGNM_ENABLED -I/tmp/B.lZJ7wH/BUILD/gdal-3.0.4/port -I/usr/include/openjpeg-2.3 -I/usr/include  -DGDAL_COMPILATION -DHAVE_XERCES -I/usr/include -I/usr/include/xercesc -I/tmp/B.lZJ7wH/BUILD/gdal-3.0.4/port -I/usr/include/openjpeg-2.3 -I/usr/include  -DGDAL_COMPILATION -c -o ../o/ogrwfslayer.lo ogrwfslayer.cpp
make[3]: Leaving directory '/tmp/B.lZJ7wH/BUILD/gdal-3.0.4/ogr/ogrsf_frmts/wfs'
make[3]: Entering directory '/tmp/B.lZJ7wH/BUILD/gdal-3.0.4/ogr/ogrsf_frmts/wfs'
/bin/sh /tmp/B.lZJ7wH/BUILD/gdal-3.0.4/libtool --mode=compile --silent --tag=CXX x86_64-pld-linux-g++ -I/tmp/B.lZJ7wH/BUILD/gdal-3.0.4/port -I/tmp/B.lZJ7wH/BUILD/gdal-3.0.4/gcore -I/tmp/B.lZJ7wH/BUILD/gdal-3.0.4/alg -I/tmp/B.lZJ7wH/BUILD/gdal-3.0.4/ogr -I/tmp/B.lZJ7wH/BUILD/gdal-3.0.4/ogr/ogrsf_frmts -I/tmp/B.lZJ7wH/BUILD/gdal-3.0.4/gnm -I/tmp/B.lZJ7wH/BUILD/gdal-3.0.4/apps -DHAVE_AVX_AT_COMPILE_TIME -DHAVE_SSSE3_AT_COMPILE_TIME -DHAVE_SSE_AT_COMPILE_TIME -O2 -fwrapv -pipe -Wformat -Werror=format-security -gdwarf-4 -fno-debug-types-section -fvar-tracking-assignments -g2 -Wp,-D_FORTIFY_SOURCE=2 -fstack-protector-strong --param=ssp-buffer-size=4 -Werror=trampolines -fPIC -march=x86-64 -gdwarf-4 -fno-debug-types-section -fvar-tracking-assignments -g2  -fvisibility=hidden  -Wall -Wextra -Winit-self -Wunused-parameter -Wformat -Werror=format-security -Wno-format-nonliteral -Wlogical-op -Wshadow -Werror=vla -Wdate-time -Wnull-dereference -Wduplicated-cond -Wextra-semi -Wfloat-conversion -Wmissing-declarations -Wnon-virtual-dtor -Woverloaded-virtual -fno-operator-names -Wzero-as-null-pointer-constant -Wsuggest-override -Wimplicit-fallthrough  -I.. -I../.. -I../gml  -DGNM_ENABLED -I/tmp/B.lZJ7wH/BUILD/gdal-3.0.4/port -I/usr/include/openjpeg-2.3 -I/usr/include  -DGDAL_COMPILATION -DHAVE_XERCES -I/usr/include -I/usr/include/xercesc -I/tmp/B.lZJ7wH/BUILD/gdal-3.0.4/port -I/usr/include/openjpeg-2.3 -I/usr/include  -DGDAL_COMPILATION -c -o ../o/ogrwfsdatasource.lo ogrwfsdatasource.cpp
make[3]: Leaving directory '/tmp/B.lZJ7wH/BUILD/gdal-3.0.4/ogr/ogrsf_frmts/wfs'
make[3]: Entering directory '/tmp/B.lZJ7wH/BUILD/gdal-3.0.4/ogr/ogrsf_frmts/vfk'
/bin/sh /tmp/B.lZJ7wH/BUILD/gdal-3.0.4/libtool --mode=compile --silent --tag=CXX x86_64-pld-linux-g++ -I/tmp/B.lZJ7wH/BUILD/gdal-3.0.4/port -I/tmp/B.lZJ7wH/BUILD/gdal-3.0.4/gcore -I/tmp/B.lZJ7wH/BUILD/gdal-3.0.4/alg -I/tmp/B.lZJ7wH/BUILD/gdal-3.0.4/ogr -I/tmp/B.lZJ7wH/BUILD/gdal-3.0.4/ogr/ogrsf_frmts -I/tmp/B.lZJ7wH/BUILD/gdal-3.0.4/gnm -I/tmp/B.lZJ7wH/BUILD/gdal-3.0.4/apps -DHAVE_AVX_AT_COMPILE_TIME -DHAVE_SSSE3_AT_COMPILE_TIME -DHAVE_SSE_AT_COMPILE_TIME -O2 -fwrapv -pipe -Wformat -Werror=format-security -gdwarf-4 -fno-debug-types-section -fvar-tracking-assignments -g2 -Wp,-D_FORTIFY_SOURCE=2 -fstack-protector-strong --param=ssp-buffer-size=4 -Werror=trampolines -fPIC -march=x86-64 -gdwarf-4 -fno-debug-types-section -fvar-tracking-assignments -g2  -fvisibility=hidden  -Wall -Wextra -Winit-self -Wunused-parameter -Wformat -Werror=format-security -Wno-format-nonliteral -Wlogical-op -Wshadow -Werror=vla -Wdate-time -Wnull-dereference -Wduplicated-cond -Wextra-semi -Wfloat-conversion -Wmissing-declarations -Wnon-virtual-dtor -Woverloaded-virtual -fno-operator-names -Wzero-as-null-pointer-constant -Wsuggest-override -Wimplicit-fallthrough  -I.. -I../..  -I/usr/include -DGNM_ENABLED -I/tmp/B.lZJ7wH/BUILD/gdal-3.0.4/port -I/usr/include/openjpeg-2.3 -I/usr/include  -DGDAL_COMPILATION -DHAVE_XERCES -I/usr/include -I/usr/include/xercesc -I/tmp/B.lZJ7wH/BUILD/gdal-3.0.4/port -I/usr/include/openjpeg-2.3 -I/usr/include  -DGDAL_COMPILATION -c -o ../o/vfkfeature.lo vfkfeature.cpp
make[3]: Leaving directory '/tmp/B.lZJ7wH/BUILD/gdal-3.0.4/ogr/ogrsf_frmts/vfk'
make[3]: Entering directory '/tmp/B.lZJ7wH/BUILD/gdal-3.0.4/ogr/ogrsf_frmts/vfk'
/bin/sh /tmp/B.lZJ7wH/BUILD/gdal-3.0.4/libtool --mode=compile --silent --tag=CXX x86_64-pld-linux-g++ -I/tmp/B.lZJ7wH/BUILD/gdal-3.0.4/port -I/tmp/B.lZJ7wH/BUILD/gdal-3.0.4/gcore -I/tmp/B.lZJ7wH/BUILD/gdal-3.0.4/alg -I/tmp/B.lZJ7wH/BUILD/gdal-3.0.4/ogr -I/tmp/B.lZJ7wH/BUILD/gdal-3.0.4/ogr/ogrsf_frmts -I/tmp/B.lZJ7wH/BUILD/gdal-3.0.4/gnm -I/tmp/B.lZJ7wH/BUILD/gdal-3.0.4/apps -DHAVE_AVX_AT_COMPILE_TIME -DHAVE_SSSE3_AT_COMPILE_TIME -DHAVE_SSE_AT_COMPILE_TIME -O2 -fwrapv -pipe -Wformat -Werror=format-security -gdwarf-4 -fno-debug-types-section -fvar-tracking-assignments -g2 -Wp,-D_FORTIFY_SOURCE=2 -fstack-protector-strong --param=ssp-buffer-size=4 -Werror=trampolines -fPIC -march=x86-64 -gdwarf-4 -fno-debug-types-section -fvar-tracking-assignments -g2  -fvisibility=hidden  -Wall -Wextra -Winit-self -Wunused-parameter -Wformat -Werror=format-security -Wno-format-nonliteral -Wlogical-op -Wshadow -Werror=vla -Wdate-time -Wnull-dereference -Wduplicated-cond -Wextra-semi -Wfloat-conversion -Wmissing-declarations -Wnon-virtual-dtor -Woverloaded-virtual -fno-operator-names -Wzero-as-null-pointer-constant -Wsuggest-override -Wimplicit-fallthrough  -I.. -I../..  -I/usr/include -DGNM_ENABLED -I/tmp/B.lZJ7wH/BUILD/gdal-3.0.4/port -I/usr/include/openjpeg-2.3 -I/usr/include  -DGDAL_COMPILATION -DHAVE_XERCES -I/usr/include -I/usr/include/xercesc -I/tmp/B.lZJ7wH/BUILD/gdal-3.0.4/port -I/usr/include/openjpeg-2.3 -I/usr/include  -DGDAL_COMPILATION -c -o ../o/vfkproperty.lo vfkproperty.cpp
make[3]: Leaving directory '/tmp/B.lZJ7wH/BUILD/gdal-3.0.4/ogr/ogrsf_frmts/vfk'
make[3]: Entering directory '/tmp/B.lZJ7wH/BUILD/gdal-3.0.4/ogr/ogrsf_frmts/vfk'
/bin/sh /tmp/B.lZJ7wH/BUILD/gdal-3.0.4/libtool --mode=compile --silent --tag=CXX x86_64-pld-linux-g++ -I/tmp/B.lZJ7wH/BUILD/gdal-3.0.4/port -I/tmp/B.lZJ7wH/BUILD/gdal-3.0.4/gcore -I/tmp/B.lZJ7wH/BUILD/gdal-3.0.4/alg -I/tmp/B.lZJ7wH/BUILD/gdal-3.0.4/ogr -I/tmp/B.lZJ7wH/BUILD/gdal-3.0.4/ogr/ogrsf_frmts -I/tmp/B.lZJ7wH/BUILD/gdal-3.0.4/gnm -I/tmp/B.lZJ7wH/BUILD/gdal-3.0.4/apps -DHAVE_AVX_AT_COMPILE_TIME -DHAVE_SSSE3_AT_COMPILE_TIME -DHAVE_SSE_AT_COMPILE_TIME -O2 -fwrapv -pipe -Wformat -Werror=format-security -gdwarf-4 -fno-debug-types-section -fvar-tracking-assignments -g2 -Wp,-D_FORTIFY_SOURCE=2 -fstack-protector-strong --param=ssp-buffer-size=4 -Werror=trampolines -fPIC -march=x86-64 -gdwarf-4 -fno-debug-types-section -fvar-tracking-assignments -g2  -fvisibility=hidden  -Wall -Wextra -Winit-self -Wunused-parameter -Wformat -Werror=format-security -Wno-format-nonliteral -Wlogical-op -Wshadow -Werror=vla -Wdate-time -Wnull-dereference -Wduplicated-cond -Wextra-semi -Wfloat-conversion -Wmissing-declarations -Wnon-virtual-dtor -Woverloaded-virtual -fno-operator-names -Wzero-as-null-pointer-constant -Wsuggest-override -Wimplicit-fallthrough  -I.. -I../..  -I/usr/include -DGNM_ENABLED -I/tmp/B.lZJ7wH/BUILD/gdal-3.0.4/port -I/usr/include/openjpeg-2.3 -I/usr/include  -DGDAL_COMPILATION -DHAVE_XERCES -I/usr/include -I/usr/include/xercesc -I/tmp/B.lZJ7wH/BUILD/gdal-3.0.4/port -I/usr/include/openjpeg-2.3 -I/usr/include  -DGDAL_COMPILATION -c -o ../o/vfkfeaturesqlite.lo vfkfeaturesqlite.cpp
make[3]: Leaving directory '/tmp/B.lZJ7wH/BUILD/gdal-3.0.4/ogr/ogrsf_frmts/vfk'
make[3]: Entering directory '/tmp/B.lZJ7wH/BUILD/gdal-3.0.4/ogr/ogrsf_frmts/gpkg'
/bin/sh /tmp/B.lZJ7wH/BUILD/gdal-3.0.4/libtool --mode=compile --silent --tag=CXX x86_64-pld-linux-g++ -I/tmp/B.lZJ7wH/BUILD/gdal-3.0.4/port -I/tmp/B.lZJ7wH/BUILD/gdal-3.0.4/gcore -I/tmp/B.lZJ7wH/BUILD/gdal-3.0.4/alg -I/tmp/B.lZJ7wH/BUILD/gdal-3.0.4/ogr -I/tmp/B.lZJ7wH/BUILD/gdal-3.0.4/ogr/ogrsf_frmts -I/tmp/B.lZJ7wH/BUILD/gdal-3.0.4/gnm -I/tmp/B.lZJ7wH/BUILD/gdal-3.0.4/apps -DHAVE_AVX_AT_COMPILE_TIME -DHAVE_SSSE3_AT_COMPILE_TIME -DHAVE_SSE_AT_COMPILE_TIME -O2 -fwrapv -pipe -Wformat -Werror=format-security -gdwarf-4 -fno-debug-types-section -fvar-tracking-assignments -g2 -Wp,-D_FORTIFY_SOURCE=2 -fstack-protector-strong --param=ssp-buffer-size=4 -Werror=trampolines -fPIC -march=x86-64 -gdwarf-4 -fno-debug-types-section -fvar-tracking-assignments -g2  -fvisibility=hidden  -Wall -Wextra -Winit-self -Wunused-parameter -Wformat -Werror=format-security -Wno-format-nonliteral -Wlogical-op -Wshadow -Werror=vla -Wdate-time -Wnull-dereference -Wduplicated-cond -Wextra-semi -Wfloat-conversion -Wmissing-declarations -Wnon-virtual-dtor -Woverloaded-virtual -fno-operator-names -Wzero-as-null-pointer-constant -Wsuggest-override -Wimplicit-fallthrough  -I.. -I../sqlite -I../../../frmts/mem -I../../../frmts -I/usr/include -DGNM_ENABLED -I/tmp/B.lZJ7wH/BUILD/gdal-3.0.4/port -I/usr/include/openjpeg-2.3 -I/usr/include  -DGDAL_COMPILATION -DHAVE_XERCES -I/usr/include -I/usr/include/xercesc -I/tmp/B.lZJ7wH/BUILD/gdal-3.0.4/port -I/usr/include/openjpeg-2.3 -I/usr/include  -DGDAL_COMPILATION -DSQLITE_HAS_COLUMN_METADATA -c -o ../o/ogrgeopackagelayer.lo ogrgeopackagelayer.cpp
make[3]: Leaving directory '/tmp/B.lZJ7wH/BUILD/gdal-3.0.4/ogr/ogrsf_frmts/gpkg'
make[3]: Entering directory '/tmp/B.lZJ7wH/BUILD/gdal-3.0.4/ogr/ogrsf_frmts/osm'
/bin/sh /tmp/B.lZJ7wH/BUILD/gdal-3.0.4/libtool --mode=compile --silent --tag=CXX x86_64-pld-linux-g++ -I/tmp/B.lZJ7wH/BUILD/gdal-3.0.4/port -I/tmp/B.lZJ7wH/BUILD/gdal-3.0.4/gcore -I/tmp/B.lZJ7wH/BUILD/gdal-3.0.4/alg -I/tmp/B.lZJ7wH/BUILD/gdal-3.0.4/ogr -I/tmp/B.lZJ7wH/BUILD/gdal-3.0.4/ogr/ogrsf_frmts -I/tmp/B.lZJ7wH/BUILD/gdal-3.0.4/gnm -I/tmp/B.lZJ7wH/BUILD/gdal-3.0.4/apps -DHAVE_AVX_AT_COMPILE_TIME -DHAVE_SSSE3_AT_COMPILE_TIME -DHAVE_SSE_AT_COMPILE_TIME -O2 -fwrapv -pipe -Wformat -Werror=format-security -gdwarf-4 -fno-debug-types-section -fvar-tracking-assignments -g2 -Wp,-D_FORTIFY_SOURCE=2 -fstack-protector-strong --param=ssp-buffer-size=4 -Werror=trampolines -fPIC -march=x86-64 -gdwarf-4 -fno-debug-types-section -fvar-tracking-assignments -g2  -fvisibility=hidden  -Wall -Wextra -Winit-self -Wunused-parameter -Wformat -Werror=format-security -Wno-format-nonliteral -Wlogical-op -Wshadow -Werror=vla -Wdate-time -Wnull-dereference -Wduplicated-cond -Wextra-semi -Wfloat-conversion -Wmissing-declarations -Wnon-virtual-dtor -Woverloaded-virtual -fno-operator-names -Wzero-as-null-pointer-constant -Wsuggest-override -Wimplicit-fallthrough  -I.. -I../.. -I../sqlite -I../generic  -I/usr/include -I/usr/include -DGNM_ENABLED -I/tmp/B.lZJ7wH/BUILD/gdal-3.0.4/port -I/usr/include/openjpeg-2.3 -I/usr/include  -DGDAL_COMPILATION -DHAVE_XERCES -I/usr/include -I/usr/include/xercesc -I/tmp/B.lZJ7wH/BUILD/gdal-3.0.4/port -I/usr/include/openjpeg-2.3 -I/usr/include  -DGDAL_COMPILATION -DHAVE_EXPAT -c -o ../o/ogrosmlayer.lo ogrosmlayer.cpp
make[3]: Leaving directory '/tmp/B.lZJ7wH/BUILD/gdal-3.0.4/ogr/ogrsf_frmts/osm'
make[3]: Entering directory '/tmp/B.lZJ7wH/BUILD/gdal-3.0.4/ogr/ogrsf_frmts/vfk'
/bin/sh /tmp/B.lZJ7wH/BUILD/gdal-3.0.4/libtool --mode=compile --silent --tag=CXX x86_64-pld-linux-g++ -I/tmp/B.lZJ7wH/BUILD/gdal-3.0.4/port -I/tmp/B.lZJ7wH/BUILD/gdal-3.0.4/gcore -I/tmp/B.lZJ7wH/BUILD/gdal-3.0.4/alg -I/tmp/B.lZJ7wH/BUILD/gdal-3.0.4/ogr -I/tmp/B.lZJ7wH/BUILD/gdal-3.0.4/ogr/ogrsf_frmts -I/tmp/B.lZJ7wH/BUILD/gdal-3.0.4/gnm -I/tmp/B.lZJ7wH/BUILD/gdal-3.0.4/apps -DHAVE_AVX_AT_COMPILE_TIME -DHAVE_SSSE3_AT_COMPILE_TIME -DHAVE_SSE_AT_COMPILE_TIME -O2 -fwrapv -pipe -Wformat -Werror=format-security -gdwarf-4 -fno-debug-types-section -fvar-tracking-assignments -g2 -Wp,-D_FORTIFY_SOURCE=2 -fstack-protector-strong --param=ssp-buffer-size=4 -Werror=trampolines -fPIC -march=x86-64 -gdwarf-4 -fno-debug-types-section -fvar-tracking-assignments -g2  -fvisibility=hidden  -Wall -Wextra -Winit-self -Wunused-parameter -Wformat -Werror=format-security -Wno-format-nonliteral -Wlogical-op -Wshadow -Werror=vla -Wdate-time -Wnull-dereference -Wduplicated-cond -Wextra-semi -Wfloat-conversion -Wmissing-declarations -Wnon-virtual-dtor -Woverloaded-virtual -fno-operator-names -Wzero-as-null-pointer-constant -Wsuggest-override -Wimplicit-fallthrough  -I.. -I../..  -I/usr/include -DGNM_ENABLED -I/tmp/B.lZJ7wH/BUILD/gdal-3.0.4/port -I/usr/include/openjpeg-2.3 -I/usr/include  -DGDAL_COMPILATION -DHAVE_XERCES -I/usr/include -I/usr/include/xercesc -I/tmp/B.lZJ7wH/BUILD/gdal-3.0.4/port -I/usr/include/openjpeg-2.3 -I/usr/include  -DGDAL_COMPILATION -c -o ../o/ogrvfkdriver.lo ogrvfkdriver.cpp
make[3]: Leaving directory '/tmp/B.lZJ7wH/BUILD/gdal-3.0.4/ogr/ogrsf_frmts/vfk'
make[3]: Entering directory '/tmp/B.lZJ7wH/BUILD/gdal-3.0.4/ogr/ogrsf_frmts/wfs'
/bin/sh /tmp/B.lZJ7wH/BUILD/gdal-3.0.4/libtool --mode=compile --silent --tag=CXX x86_64-pld-linux-g++ -I/tmp/B.lZJ7wH/BUILD/gdal-3.0.4/port -I/tmp/B.lZJ7wH/BUILD/gdal-3.0.4/gcore -I/tmp/B.lZJ7wH/BUILD/gdal-3.0.4/alg -I/tmp/B.lZJ7wH/BUILD/gdal-3.0.4/ogr -I/tmp/B.lZJ7wH/BUILD/gdal-3.0.4/ogr/ogrsf_frmts -I/tmp/B.lZJ7wH/BUILD/gdal-3.0.4/gnm -I/tmp/B.lZJ7wH/BUILD/gdal-3.0.4/apps -DHAVE_AVX_AT_COMPILE_TIME -DHAVE_SSSE3_AT_COMPILE_TIME -DHAVE_SSE_AT_COMPILE_TIME -O2 -fwrapv -pipe -Wformat -Werror=format-security -gdwarf-4 -fno-debug-types-section -fvar-tracking-assignments -g2 -Wp,-D_FORTIFY_SOURCE=2 -fstack-protector-strong --param=ssp-buffer-size=4 -Werror=trampolines -fPIC -march=x86-64 -gdwarf-4 -fno-debug-types-section -fvar-tracking-assignments -g2  -fvisibility=hidden  -Wall -Wextra -Winit-self -Wunused-parameter -Wformat -Werror=format-security -Wno-format-nonliteral -Wlogical-op -Wshadow -Werror=vla -Wdate-time -Wnull-dereference -Wduplicated-cond -Wextra-semi -Wfloat-conversion -Wmissing-declarations -Wnon-virtual-dtor -Woverloaded-virtual -fno-operator-names -Wzero-as-null-pointer-constant -Wsuggest-override -Wimplicit-fallthrough  -I.. -I../.. -I../gml  -DGNM_ENABLED -I/tmp/B.lZJ7wH/BUILD/gdal-3.0.4/port -I/usr/include/openjpeg-2.3 -I/usr/include  -DGDAL_COMPILATION -DHAVE_XERCES -I/usr/include -I/usr/include/xercesc -I/tmp/B.lZJ7wH/BUILD/gdal-3.0.4/port -I/usr/include/openjpeg-2.3 -I/usr/include  -DGDAL_COMPILATION -c -o ../o/ogrwfsfilter.lo ogrwfsfilter.cpp
make[3]: Leaving directory '/tmp/B.lZJ7wH/BUILD/gdal-3.0.4/ogr/ogrsf_frmts/wfs'
make[3]: Entering directory '/tmp/B.lZJ7wH/BUILD/gdal-3.0.4/ogr/ogrsf_frmts/vfk'
/bin/sh /tmp/B.lZJ7wH/BUILD/gdal-3.0.4/libtool --mode=compile --silent --tag=CXX x86_64-pld-linux-g++ -I/tmp/B.lZJ7wH/BUILD/gdal-3.0.4/port -I/tmp/B.lZJ7wH/BUILD/gdal-3.0.4/gcore -I/tmp/B.lZJ7wH/BUILD/gdal-3.0.4/alg -I/tmp/B.lZJ7wH/BUILD/gdal-3.0.4/ogr -I/tmp/B.lZJ7wH/BUILD/gdal-3.0.4/ogr/ogrsf_frmts -I/tmp/B.lZJ7wH/BUILD/gdal-3.0.4/gnm -I/tmp/B.lZJ7wH/BUILD/gdal-3.0.4/apps -DHAVE_AVX_AT_COMPILE_TIME -DHAVE_SSSE3_AT_COMPILE_TIME -DHAVE_SSE_AT_COMPILE_TIME -O2 -fwrapv -pipe -Wformat -Werror=format-security -gdwarf-4 -fno-debug-types-section -fvar-tracking-assignments -g2 -Wp,-D_FORTIFY_SOURCE=2 -fstack-protector-strong --param=ssp-buffer-size=4 -Werror=trampolines -fPIC -march=x86-64 -gdwarf-4 -fno-debug-types-section -fvar-tracking-assignments -g2  -fvisibility=hidden  -Wall -Wextra -Winit-self -Wunused-parameter -Wformat -Werror=format-security -Wno-format-nonliteral -Wlogical-op -Wshadow -Werror=vla -Wdate-time -Wnull-dereference -Wduplicated-cond -Wextra-semi -Wfloat-conversion -Wmissing-declarations -Wnon-virtual-dtor -Woverloaded-virtual -fno-operator-names -Wzero-as-null-pointer-constant -Wsuggest-override -Wimplicit-fallthrough  -I.. -I../..  -I/usr/include -DGNM_ENABLED -I/tmp/B.lZJ7wH/BUILD/gdal-3.0.4/port -I/usr/include/openjpeg-2.3 -I/usr/include  -DGDAL_COMPILATION -DHAVE_XERCES -I/usr/include -I/usr/include/xercesc -I/tmp/B.lZJ7wH/BUILD/gdal-3.0.4/port -I/usr/include/openjpeg-2.3 -I/usr/include  -DGDAL_COMPILATION -c -o ../o/ogrvfkdatasource.lo ogrvfkdatasource.cpp
make[3]: Leaving directory '/tmp/B.lZJ7wH/BUILD/gdal-3.0.4/ogr/ogrsf_frmts/vfk'
make[3]: Entering directory '/tmp/B.lZJ7wH/BUILD/gdal-3.0.4/ogr/ogrsf_frmts/osm'
/bin/sh /tmp/B.lZJ7wH/BUILD/gdal-3.0.4/libtool --mode=compile --silent --tag=CXX x86_64-pld-linux-g++ -I/tmp/B.lZJ7wH/BUILD/gdal-3.0.4/port -I/tmp/B.lZJ7wH/BUILD/gdal-3.0.4/gcore -I/tmp/B.lZJ7wH/BUILD/gdal-3.0.4/alg -I/tmp/B.lZJ7wH/BUILD/gdal-3.0.4/ogr -I/tmp/B.lZJ7wH/BUILD/gdal-3.0.4/ogr/ogrsf_frmts -I/tmp/B.lZJ7wH/BUILD/gdal-3.0.4/gnm -I/tmp/B.lZJ7wH/BUILD/gdal-3.0.4/apps -DHAVE_AVX_AT_COMPILE_TIME -DHAVE_SSSE3_AT_COMPILE_TIME -DHAVE_SSE_AT_COMPILE_TIME -O2 -fwrapv -pipe -Wformat -Werror=format-security -gdwarf-4 -fno-debug-types-section -fvar-tracking-assignments -g2 -Wp,-D_FORTIFY_SOURCE=2 -fstack-protector-strong --param=ssp-buffer-size=4 -Werror=trampolines -fPIC -march=x86-64 -gdwarf-4 -fno-debug-types-section -fvar-tracking-assignments -g2  -fvisibility=hidden  -Wall -Wextra -Winit-self -Wunused-parameter -Wformat -Werror=format-security -Wno-format-nonliteral -Wlogical-op -Wshadow -Werror=vla -Wdate-time -Wnull-dereference -Wduplicated-cond -Wextra-semi -Wfloat-conversion -Wmissing-declarations -Wnon-virtual-dtor -Woverloaded-virtual -fno-operator-names -Wzero-as-null-pointer-constant -Wsuggest-override -Wimplicit-fallthrough  -I.. -I../.. -I../sqlite -I../generic  -I/usr/include -I/usr/include -DGNM_ENABLED -I/tmp/B.lZJ7wH/BUILD/gdal-3.0.4/port -I/usr/include/openjpeg-2.3 -I/usr/include  -DGDAL_COMPILATION -DHAVE_XERCES -I/usr/include -I/usr/include/xercesc -I/tmp/B.lZJ7wH/BUILD/gdal-3.0.4/port -I/usr/include/openjpeg-2.3 -I/usr/include  -DGDAL_COMPILATION -DHAVE_EXPAT -c -o ../o/ogrosmdatasource.lo ogrosmdatasource.cpp
make[3]: Leaving directory '/tmp/B.lZJ7wH/BUILD/gdal-3.0.4/ogr/ogrsf_frmts/osm'
make[3]: Entering directory '/tmp/B.lZJ7wH/BUILD/gdal-3.0.4/ogr/ogrsf_frmts/wfs'
/bin/sh /tmp/B.lZJ7wH/BUILD/gdal-3.0.4/libtool --mode=compile --silent --tag=CXX x86_64-pld-linux-g++ -I/tmp/B.lZJ7wH/BUILD/gdal-3.0.4/port -I/tmp/B.lZJ7wH/BUILD/gdal-3.0.4/gcore -I/tmp/B.lZJ7wH/BUILD/gdal-3.0.4/alg -I/tmp/B.lZJ7wH/BUILD/gdal-3.0.4/ogr -I/tmp/B.lZJ7wH/BUILD/gdal-3.0.4/ogr/ogrsf_frmts -I/tmp/B.lZJ7wH/BUILD/gdal-3.0.4/gnm -I/tmp/B.lZJ7wH/BUILD/gdal-3.0.4/apps -DHAVE_AVX_AT_COMPILE_TIME -DHAVE_SSSE3_AT_COMPILE_TIME -DHAVE_SSE_AT_COMPILE_TIME -O2 -fwrapv -pipe -Wformat -Werror=format-security -gdwarf-4 -fno-debug-types-section -fvar-tracking-assignments -g2 -Wp,-D_FORTIFY_SOURCE=2 -fstack-protector-strong --param=ssp-buffer-size=4 -Werror=trampolines -fPIC -march=x86-64 -gdwarf-4 -fno-debug-types-section -fvar-tracking-assignments -g2  -fvisibility=hidden  -Wall -Wextra -Winit-self -Wunused-parameter -Wformat -Werror=format-security -Wno-format-nonliteral -Wlogical-op -Wshadow -Werror=vla -Wdate-time -Wnull-dereference -Wduplicated-cond -Wextra-semi -Wfloat-conversion -Wmissing-declarations -Wnon-virtual-dtor -Woverloaded-virtual -fno-operator-names -Wzero-as-null-pointer-constant -Wsuggest-override -Wimplicit-fallthrough  -I.. -I../.. -I../gml  -DGNM_ENABLED -I/tmp/B.lZJ7wH/BUILD/gdal-3.0.4/port -I/usr/include/openjpeg-2.3 -I/usr/include  -DGDAL_COMPILATION -DHAVE_XERCES -I/usr/include -I/usr/include/xercesc -I/tmp/B.lZJ7wH/BUILD/gdal-3.0.4/port -I/usr/include/openjpeg-2.3 -I/usr/include  -DGDAL_COMPILATION -c -o ../o/ogrwfsjoinlayer.lo ogrwfsjoinlayer.cpp
make[3]: Leaving directory '/tmp/B.lZJ7wH/BUILD/gdal-3.0.4/ogr/ogrsf_frmts/wfs'
/usr/bin/make -C dods
make[3]: Entering directory '/tmp/B.lZJ7wH/BUILD/gdal-3.0.4/ogr/ogrsf_frmts/gpkg'
/bin/sh /tmp/B.lZJ7wH/BUILD/gdal-3.0.4/libtool --mode=compile --silent --tag=CXX x86_64-pld-linux-g++ -I/tmp/B.lZJ7wH/BUILD/gdal-3.0.4/port -I/tmp/B.lZJ7wH/BUILD/gdal-3.0.4/gcore -I/tmp/B.lZJ7wH/BUILD/gdal-3.0.4/alg -I/tmp/B.lZJ7wH/BUILD/gdal-3.0.4/ogr -I/tmp/B.lZJ7wH/BUILD/gdal-3.0.4/ogr/ogrsf_frmts -I/tmp/B.lZJ7wH/BUILD/gdal-3.0.4/gnm -I/tmp/B.lZJ7wH/BUILD/gdal-3.0.4/apps -DHAVE_AVX_AT_COMPILE_TIME -DHAVE_SSSE3_AT_COMPILE_TIME -DHAVE_SSE_AT_COMPILE_TIME -O2 -fwrapv -pipe -Wformat -Werror=format-security -gdwarf-4 -fno-debug-types-section -fvar-tracking-assignments -g2 -Wp,-D_FORTIFY_SOURCE=2 -fstack-protector-strong --param=ssp-buffer-size=4 -Werror=trampolines -fPIC -march=x86-64 -gdwarf-4 -fno-debug-types-section -fvar-tracking-assignments -g2  -fvisibility=hidden  -Wall -Wextra -Winit-self -Wunused-parameter -Wformat -Werror=format-security -Wno-format-nonliteral -Wlogical-op -Wshadow -Werror=vla -Wdate-time -Wnull-dereference -Wduplicated-cond -Wextra-semi -Wfloat-conversion -Wmissing-declarations -Wnon-virtual-dtor -Woverloaded-virtual -fno-operator-names -Wzero-as-null-pointer-constant -Wsuggest-override -Wimplicit-fallthrough  -I.. -I../sqlite -I../../../frmts/mem -I../../../frmts -I/usr/include -DGNM_ENABLED -I/tmp/B.lZJ7wH/BUILD/gdal-3.0.4/port -I/usr/include/openjpeg-2.3 -I/usr/include  -DGDAL_COMPILATION -DHAVE_XERCES -I/usr/include -I/usr/include/xercesc -I/tmp/B.lZJ7wH/BUILD/gdal-3.0.4/port -I/usr/include/openjpeg-2.3 -I/usr/include  -DGDAL_COMPILATION -DSQLITE_HAS_COLUMN_METADATA -c -o ../o/ogrgeopackagedatasource.lo ogrgeopackagedatasource.cpp
make[3]: Leaving directory '/tmp/B.lZJ7wH/BUILD/gdal-3.0.4/ogr/ogrsf_frmts/gpkg'
make[3]: Entering directory '/tmp/B.lZJ7wH/BUILD/gdal-3.0.4/ogr/ogrsf_frmts/vfk'
/bin/sh /tmp/B.lZJ7wH/BUILD/gdal-3.0.4/libtool --mode=compile --silent --tag=CXX x86_64-pld-linux-g++ -I/tmp/B.lZJ7wH/BUILD/gdal-3.0.4/port -I/tmp/B.lZJ7wH/BUILD/gdal-3.0.4/gcore -I/tmp/B.lZJ7wH/BUILD/gdal-3.0.4/alg -I/tmp/B.lZJ7wH/BUILD/gdal-3.0.4/ogr -I/tmp/B.lZJ7wH/BUILD/gdal-3.0.4/ogr/ogrsf_frmts -I/tmp/B.lZJ7wH/BUILD/gdal-3.0.4/gnm -I/tmp/B.lZJ7wH/BUILD/gdal-3.0.4/apps -DHAVE_AVX_AT_COMPILE_TIME -DHAVE_SSSE3_AT_COMPILE_TIME -DHAVE_SSE_AT_COMPILE_TIME -O2 -fwrapv -pipe -Wformat -Werror=format-security -gdwarf-4 -fno-debug-types-section -fvar-tracking-assignments -g2 -Wp,-D_FORTIFY_SOURCE=2 -fstack-protector-strong --param=ssp-buffer-size=4 -Werror=trampolines -fPIC -march=x86-64 -gdwarf-4 -fno-debug-types-section -fvar-tracking-assignments -g2  -fvisibility=hidden  -Wall -Wextra -Winit-self -Wunused-parameter -Wformat -Werror=format-security -Wno-format-nonliteral -Wlogical-op -Wshadow -Werror=vla -Wdate-time -Wnull-dereference -Wduplicated-cond -Wextra-semi -Wfloat-conversion -Wmissing-declarations -Wnon-virtual-dtor -Woverloaded-virtual -fno-operator-names -Wzero-as-null-pointer-constant -Wsuggest-override -Wimplicit-fallthrough  -I.. -I../..  -I/usr/include -DGNM_ENABLED -I/tmp/B.lZJ7wH/BUILD/gdal-3.0.4/port -I/usr/include/openjpeg-2.3 -I/usr/include  -DGDAL_COMPILATION -DHAVE_XERCES -I/usr/include -I/usr/include/xercesc -I/tmp/B.lZJ7wH/BUILD/gdal-3.0.4/port -I/usr/include/openjpeg-2.3 -I/usr/include  -DGDAL_COMPILATION -c -o ../o/ogrvfklayer.lo ogrvfklayer.cpp
make[3]: Leaving directory '/tmp/B.lZJ7wH/BUILD/gdal-3.0.4/ogr/ogrsf_frmts/vfk'
/usr/bin/make -C mysql
make[3]: Entering directory '/tmp/B.lZJ7wH/BUILD/gdal-3.0.4/ogr/ogrsf_frmts/gpkg'
/bin/sh /tmp/B.lZJ7wH/BUILD/gdal-3.0.4/libtool --mode=compile --silent --tag=CXX x86_64-pld-linux-g++ -I/tmp/B.lZJ7wH/BUILD/gdal-3.0.4/port -I/tmp/B.lZJ7wH/BUILD/gdal-3.0.4/gcore -I/tmp/B.lZJ7wH/BUILD/gdal-3.0.4/alg -I/tmp/B.lZJ7wH/BUILD/gdal-3.0.4/ogr -I/tmp/B.lZJ7wH/BUILD/gdal-3.0.4/ogr/ogrsf_frmts -I/tmp/B.lZJ7wH/BUILD/gdal-3.0.4/gnm -I/tmp/B.lZJ7wH/BUILD/gdal-3.0.4/apps -DHAVE_AVX_AT_COMPILE_TIME -DHAVE_SSSE3_AT_COMPILE_TIME -DHAVE_SSE_AT_COMPILE_TIME -O2 -fwrapv -pipe -Wformat -Werror=format-security -gdwarf-4 -fno-debug-types-section -fvar-tracking-assignments -g2 -Wp,-D_FORTIFY_SOURCE=2 -fstack-protector-strong --param=ssp-buffer-size=4 -Werror=trampolines -fPIC -march=x86-64 -gdwarf-4 -fno-debug-types-section -fvar-tracking-assignments -g2  -fvisibility=hidden  -Wall -Wextra -Winit-self -Wunused-parameter -Wformat -Werror=format-security -Wno-format-nonliteral -Wlogical-op -Wshadow -Werror=vla -Wdate-time -Wnull-dereference -Wduplicated-cond -Wextra-semi -Wfloat-conversion -Wmissing-declarations -Wnon-virtual-dtor -Woverloaded-virtual -fno-operator-names -Wzero-as-null-pointer-constant -Wsuggest-override -Wimplicit-fallthrough  -I.. -I../sqlite -I../../../frmts/mem -I../../../frmts -I/usr/include -DGNM_ENABLED -I/tmp/B.lZJ7wH/BUILD/gdal-3.0.4/port -I/usr/include/openjpeg-2.3 -I/usr/include  -DGDAL_COMPILATION -DHAVE_XERCES -I/usr/include -I/usr/include/xercesc -I/tmp/B.lZJ7wH/BUILD/gdal-3.0.4/port -I/usr/include/openjpeg-2.3 -I/usr/include  -DGDAL_COMPILATION -DSQLITE_HAS_COLUMN_METADATA -c -o ../o/ogrgeopackageselectlayer.lo ogrgeopackageselectlayer.cpp
make[3]: Leaving directory '/tmp/B.lZJ7wH/BUILD/gdal-3.0.4/ogr/ogrsf_frmts/gpkg'
/usr/bin/make -C ogdi
make[3]: Entering directory '/tmp/B.lZJ7wH/BUILD/gdal-3.0.4/ogr/ogrsf_frmts/ogdi'
/bin/sh /tmp/B.lZJ7wH/BUILD/gdal-3.0.4/libtool --mode=compile --silent --tag=CXX x86_64-pld-linux-g++ -I/tmp/B.lZJ7wH/BUILD/gdal-3.0.4/port -I/tmp/B.lZJ7wH/BUILD/gdal-3.0.4/gcore -I/tmp/B.lZJ7wH/BUILD/gdal-3.0.4/alg -I/tmp/B.lZJ7wH/BUILD/gdal-3.0.4/ogr -I/tmp/B.lZJ7wH/BUILD/gdal-3.0.4/ogr/ogrsf_frmts -I/tmp/B.lZJ7wH/BUILD/gdal-3.0.4/gnm -I/tmp/B.lZJ7wH/BUILD/gdal-3.0.4/apps -DHAVE_AVX_AT_COMPILE_TIME -DHAVE_SSSE3_AT_COMPILE_TIME -DHAVE_SSE_AT_COMPILE_TIME -O2 -fwrapv -pipe -Wformat -Werror=format-security -gdwarf-4 -fno-debug-types-section -fvar-tracking-assignments -g2 -Wp,-D_FORTIFY_SOURCE=2 -fstack-protector-strong --param=ssp-buffer-size=4 -Werror=trampolines -fPIC -march=x86-64 -gdwarf-4 -fno-debug-types-section -fvar-tracking-assignments -g2  -fvisibility=hidden  -Wall -Wextra -Winit-self -Wunused-parameter -Wformat -Werror=format-security -Wno-format-nonliteral -Wlogical-op -Wshadow -Werror=vla -Wdate-time -Wnull-dereference -Wduplicated-cond -Wextra-semi -Wfloat-conversion -Wmissing-declarations -Wnon-virtual-dtor -Woverloaded-virtual -fno-operator-names -Wzero-as-null-pointer-constant -Wsuggest-override -Wimplicit-fallthrough  -I/usr/include/ogdi  -DGNM_ENABLED -I/tmp/B.lZJ7wH/BUILD/gdal-3.0.4/port -I/usr/include/openjpeg-2.3 -I/usr/include  -DGDAL_COMPILATION -DHAVE_XERCES -I/usr/include -I/usr/include/xercesc -I/tmp/B.lZJ7wH/BUILD/gdal-3.0.4/port -I/usr/include/openjpeg-2.3 -I/usr/include  -DGDAL_COMPILATION -c -o ../o/ogrogdidriver.lo ogrogdidriver.cpp
In file included from ogrogdi.h:40,
                 from ogrogdidriver.cpp:30:
/usr/include/ecs.h:9:10: fatal error: rpc/rpc.h: No such file or directory
    9 | #include <rpc/rpc.h>
      |          ^~~~~~~~~~~
compilation terminated.
make[3]: *** [../../../GDALmake.opt:637: ../o/ogrogdidriver.lo] Error 1
make[3]: Leaving directory '/tmp/B.lZJ7wH/BUILD/gdal-3.0.4/ogr/ogrsf_frmts/ogdi'
make[2]: *** [../../GDALmake.opt:650: ogdi-target] Error 2
make[2]: *** Waiting for unfinished jobs....
make[3]: Entering directory '/tmp/B.lZJ7wH/BUILD/gdal-3.0.4/ogr/ogrsf_frmts/gpkg'
/bin/sh /tmp/B.lZJ7wH/BUILD/gdal-3.0.4/libtool --mode=compile --silent --tag=CXX x86_64-pld-linux-g++ -I/tmp/B.lZJ7wH/BUILD/gdal-3.0.4/port -I/tmp/B.lZJ7wH/BUILD/gdal-3.0.4/gcore -I/tmp/B.lZJ7wH/BUILD/gdal-3.0.4/alg -I/tmp/B.lZJ7wH/BUILD/gdal-3.0.4/ogr -I/tmp/B.lZJ7wH/BUILD/gdal-3.0.4/ogr/ogrsf_frmts -I/tmp/B.lZJ7wH/BUILD/gdal-3.0.4/gnm -I/tmp/B.lZJ7wH/BUILD/gdal-3.0.4/apps -DHAVE_AVX_AT_COMPILE_TIME -DHAVE_SSSE3_AT_COMPILE_TIME -DHAVE_SSE_AT_COMPILE_TIME -O2 -fwrapv -pipe -Wformat -Werror=format-security -gdwarf-4 -fno-debug-types-section -fvar-tracking-assignments -g2 -Wp,-D_FORTIFY_SOURCE=2 -fstack-protector-strong --param=ssp-buffer-size=4 -Werror=trampolines -fPIC -march=x86-64 -gdwarf-4 -fno-debug-types-section -fvar-tracking-assignments -g2  -fvisibility=hidden  -Wall -Wextra -Winit-self -Wunused-parameter -Wformat -Werror=format-security -Wno-format-nonliteral -Wlogical-op -Wshadow -Werror=vla -Wdate-time -Wnull-dereference -Wduplicated-cond -Wextra-semi -Wfloat-conversion -Wmissing-declarations -Wnon-virtual-dtor -Woverloaded-virtual -fno-operator-names -Wzero-as-null-pointer-constant -Wsuggest-override -Wimplicit-fallthrough  -I.. -I../sqlite -I../../../frmts/mem -I../../../frmts -I/usr/include -DGNM_ENABLED -I/tmp/B.lZJ7wH/BUILD/gdal-3.0.4/port -I/usr/include/openjpeg-2.3 -I/usr/include  -DGDAL_COMPILATION -DHAVE_XERCES -I/usr/include -I/usr/include/xercesc -I/tmp/B.lZJ7wH/BUILD/gdal-3.0.4/port -I/usr/include/openjpeg-2.3 -I/usr/include  -DGDAL_COMPILATION -DSQLITE_HAS_COLUMN_METADATA -c -o ../o/ogrgeopackageutility.lo ogrgeopackageutility.cpp
make[3]: Leaving directory '/tmp/B.lZJ7wH/BUILD/gdal-3.0.4/ogr/ogrsf_frmts/gpkg'
make[3]: Entering directory '/tmp/B.lZJ7wH/BUILD/gdal-3.0.4/ogr/ogrsf_frmts/gpkg'
/bin/sh /tmp/B.lZJ7wH/BUILD/gdal-3.0.4/libtool --mode=compile --silent --tag=CXX x86_64-pld-linux-g++ -I/tmp/B.lZJ7wH/BUILD/gdal-3.0.4/port -I/tmp/B.lZJ7wH/BUILD/gdal-3.0.4/gcore -I/tmp/B.lZJ7wH/BUILD/gdal-3.0.4/alg -I/tmp/B.lZJ7wH/BUILD/gdal-3.0.4/ogr -I/tmp/B.lZJ7wH/BUILD/gdal-3.0.4/ogr/ogrsf_frmts -I/tmp/B.lZJ7wH/BUILD/gdal-3.0.4/gnm -I/tmp/B.lZJ7wH/BUILD/gdal-3.0.4/apps -DHAVE_AVX_AT_COMPILE_TIME -DHAVE_SSSE3_AT_COMPILE_TIME -DHAVE_SSE_AT_COMPILE_TIME -O2 -fwrapv -pipe -Wformat -Werror=format-security -gdwarf-4 -fno-debug-types-section -fvar-tracking-assignments -g2 -Wp,-D_FORTIFY_SOURCE=2 -fstack-protector-strong --param=ssp-buffer-size=4 -Werror=trampolines -fPIC -march=x86-64 -gdwarf-4 -fno-debug-types-section -fvar-tracking-assignments -g2  -fvisibility=hidden  -Wall -Wextra -Winit-self -Wunused-parameter -Wformat -Werror=format-security -Wno-format-nonliteral -Wlogical-op -Wshadow -Werror=vla -Wdate-time -Wnull-dereference -Wduplicated-cond -Wextra-semi -Wfloat-conversion -Wmissing-declarations -Wnon-virtual-dtor -Woverloaded-virtual -fno-operator-names -Wzero-as-null-pointer-constant -Wsuggest-override -Wimplicit-fallthrough  -I.. -I../sqlite -I../../../frmts/mem -I../../../frmts -I/usr/include -DGNM_ENABLED -I/tmp/B.lZJ7wH/BUILD/gdal-3.0.4/port -I/usr/include/openjpeg-2.3 -I/usr/include  -DGDAL_COMPILATION -DHAVE_XERCES -I/usr/include -I/usr/include/xercesc -I/tmp/B.lZJ7wH/BUILD/gdal-3.0.4/port -I/usr/include/openjpeg-2.3 -I/usr/include  -DGDAL_COMPILATION -DSQLITE_HAS_COLUMN_METADATA -c -o ../o/ogrgeopackagetablelayer.lo ogrgeopackagetablelayer.cpp
make[3]: Leaving directory '/tmp/B.lZJ7wH/BUILD/gdal-3.0.4/ogr/ogrsf_frmts/gpkg'
make[3]: Entering directory '/tmp/B.lZJ7wH/BUILD/gdal-3.0.4/ogr/ogrsf_frmts/wfs'
/bin/sh /tmp/B.lZJ7wH/BUILD/gdal-3.0.4/libtool --mode=compile --silent --tag=CXX x86_64-pld-linux-g++ -I/tmp/B.lZJ7wH/BUILD/gdal-3.0.4/port -I/tmp/B.lZJ7wH/BUILD/gdal-3.0.4/gcore -I/tmp/B.lZJ7wH/BUILD/gdal-3.0.4/alg -I/tmp/B.lZJ7wH/BUILD/gdal-3.0.4/ogr -I/tmp/B.lZJ7wH/BUILD/gdal-3.0.4/ogr/ogrsf_frmts -I/tmp/B.lZJ7wH/BUILD/gdal-3.0.4/gnm -I/tmp/B.lZJ7wH/BUILD/gdal-3.0.4/apps -DHAVE_AVX_AT_COMPILE_TIME -DHAVE_SSSE3_AT_COMPILE_TIME -DHAVE_SSE_AT_COMPILE_TIME -O2 -fwrapv -pipe -Wformat -Werror=format-security -gdwarf-4 -fno-debug-types-section -fvar-tracking-assignments -g2 -Wp,-D_FORTIFY_SOURCE=2 -fstack-protector-strong --param=ssp-buffer-size=4 -Werror=trampolines -fPIC -march=x86-64 -gdwarf-4 -fno-debug-types-section -fvar-tracking-assignments -g2  -fvisibility=hidden  -Wall -Wextra -Winit-self -Wunused-parameter -Wformat -Werror=format-security -Wno-format-nonliteral -Wlogical-op -Wshadow -Werror=vla -Wdate-time -Wnull-dereference -Wduplicated-cond -Wextra-semi -Wfloat-conversion -Wmissing-declarations -Wnon-virtual-dtor -Woverloaded-virtual -fno-operator-names -Wzero-as-null-pointer-constant -Wsuggest-override -Wimplicit-fallthrough  -I.. -I../.. -I../gml  -DGNM_ENABLED -I/tmp/B.lZJ7wH/BUILD/gdal-3.0.4/port -I/usr/include/openjpeg-2.3 -I/usr/include  -DGDAL_COMPILATION -DHAVE_XERCES -I/usr/include -I/usr/include/xercesc -I/tmp/B.lZJ7wH/BUILD/gdal-3.0.4/port -I/usr/include/openjpeg-2.3 -I/usr/include  -DGDAL_COMPILATION -c -o ../o/ogroapifdriver.lo ogroapifdriver.cpp
make[3]: Leaving directory '/tmp/B.lZJ7wH/BUILD/gdal-3.0.4/ogr/ogrsf_frmts/wfs'
make[3]: Entering directory '/tmp/B.lZJ7wH/BUILD/gdal-3.0.4/ogr/ogrsf_frmts/mysql'
/bin/sh /tmp/B.lZJ7wH/BUILD/gdal-3.0.4/libtool --mode=compile --silent --tag=CXX x86_64-pld-linux-g++ -I/tmp/B.lZJ7wH/BUILD/gdal-3.0.4/port -I/tmp/B.lZJ7wH/BUILD/gdal-3.0.4/gcore -I/tmp/B.lZJ7wH/BUILD/gdal-3.0.4/alg -I/tmp/B.lZJ7wH/BUILD/gdal-3.0.4/ogr -I/tmp/B.lZJ7wH/BUILD/gdal-3.0.4/ogr/ogrsf_frmts -I/tmp/B.lZJ7wH/BUILD/gdal-3.0.4/gnm -I/tmp/B.lZJ7wH/BUILD/gdal-3.0.4/apps -DHAVE_AVX_AT_COMPILE_TIME -DHAVE_SSSE3_AT_COMPILE_TIME -DHAVE_SSE_AT_COMPILE_TIME -O2 -fwrapv -pipe -Wformat -Werror=format-security -gdwarf-4 -fno-debug-types-section -fvar-tracking-assignments -g2 -Wp,-D_FORTIFY_SOURCE=2 -fstack-protector-strong --param=ssp-buffer-size=4 -Werror=trampolines -fPIC -march=x86-64 -gdwarf-4 -fno-debug-types-section -fvar-tracking-assignments -g2  -fvisibility=hidden  -Wall -Wextra -Winit-self -Wunused-parameter -Wformat -Werror=format-security -Wno-format-nonliteral -Wlogical-op -Wshadow -Werror=vla -Wdate-time -Wnull-dereference -Wduplicated-cond -Wextra-semi -Wfloat-conversion -Wmissing-declarations -Wnon-virtual-dtor -Woverloaded-virtual -fno-operator-names -Wzero-as-null-pointer-constant -Wsuggest-override -Wimplicit-fallthrough  -I.. -I../..  -I/usr/include/mysql -DGNM_ENABLED -I/tmp/B.lZJ7wH/BUILD/gdal-3.0.4/port -I/usr/include/openjpeg-2.3 -I/usr/include  -DGDAL_COMPILATION -DHAVE_XERCES -I/usr/include -I/usr/include/xercesc -I/tmp/B.lZJ7wH/BUILD/gdal-3.0.4/port -I/usr/include/openjpeg-2.3 -I/usr/include  -DGDAL_COMPILATION -c -o ../o/ogrmysqldriver.lo ogrmysqldriver.cpp
make[3]: Leaving directory '/tmp/B.lZJ7wH/BUILD/gdal-3.0.4/ogr/ogrsf_frmts/mysql'
make[3]: Entering directory '/tmp/B.lZJ7wH/BUILD/gdal-3.0.4/ogr/ogrsf_frmts/dods'
/bin/sh /tmp/B.lZJ7wH/BUILD/gdal-3.0.4/libtool --mode=compile --silent --tag=CXX x86_64-pld-linux-g++ -I/tmp/B.lZJ7wH/BUILD/gdal-3.0.4/port -I/tmp/B.lZJ7wH/BUILD/gdal-3.0.4/gcore -I/tmp/B.lZJ7wH/BUILD/gdal-3.0.4/alg -I/tmp/B.lZJ7wH/BUILD/gdal-3.0.4/ogr -I/tmp/B.lZJ7wH/BUILD/gdal-3.0.4/ogr/ogrsf_frmts -I/tmp/B.lZJ7wH/BUILD/gdal-3.0.4/gnm -I/tmp/B.lZJ7wH/BUILD/gdal-3.0.4/apps -DHAVE_AVX_AT_COMPILE_TIME -DHAVE_SSSE3_AT_COMPILE_TIME -DHAVE_SSE_AT_COMPILE_TIME -O2 -fwrapv -pipe -Wformat -Werror=format-security -gdwarf-4 -fno-debug-types-section -fvar-tracking-assignments -g2 -Wp,-D_FORTIFY_SOURCE=2 -fstack-protector-strong --param=ssp-buffer-size=4 -Werror=trampolines -fPIC -march=x86-64 -gdwarf-4 -fno-debug-types-section -fvar-tracking-assignments -g2  -fvisibility=hidden  -Wall -Wextra -Winit-self -Wunused-parameter -Wformat -Werror=format-security -Wno-format-nonliteral -Wlogical-op -Wshadow -Werror=vla -Wdate-time -Wnull-dereference -Wduplicated-cond -Wextra-semi -Wfloat-conversion -Wmissing-declarations -Wnon-virtual-dtor -Woverloaded-virtual -fno-operator-names -Wzero-as-null-pointer-constant -Wsuggest-override -Wimplicit-fallthrough  -I..  -DGNM_ENABLED -I/tmp/B.lZJ7wH/BUILD/gdal-3.0.4/port -I/usr/include/openjpeg-2.3 -I/usr/include  -DGDAL_COMPILATION -DHAVE_XERCES -I/usr/include -I/usr/include/xercesc -I/tmp/B.lZJ7wH/BUILD/gdal-3.0.4/port -I/usr/include/openjpeg-2.3 -I/usr/include  -DGDAL_COMPILATION -I/usr/include/libdap -I/usr/include/libxml2 -I/usr/include/libdap -I/usr/include/libxml2  -DLIBDAP_310 -DLIBDAP_39 -DDO_NOT_USE_DEBUG_BOOL -I/usr/include/tirpc -c -o ../o/ogrdodsdriver.lo ogrdodsdriver.cpp
make[3]: Leaving directory '/tmp/B.lZJ7wH/BUILD/gdal-3.0.4/ogr/ogrsf_frmts/dods'
make[3]: Entering directory '/tmp/B.lZJ7wH/BUILD/gdal-3.0.4/ogr/ogrsf_frmts/dods'
/bin/sh /tmp/B.lZJ7wH/BUILD/gdal-3.0.4/libtool --mode=compile --silent --tag=CXX x86_64-pld-linux-g++ -I/tmp/B.lZJ7wH/BUILD/gdal-3.0.4/port -I/tmp/B.lZJ7wH/BUILD/gdal-3.0.4/gcore -I/tmp/B.lZJ7wH/BUILD/gdal-3.0.4/alg -I/tmp/B.lZJ7wH/BUILD/gdal-3.0.4/ogr -I/tmp/B.lZJ7wH/BUILD/gdal-3.0.4/ogr/ogrsf_frmts -I/tmp/B.lZJ7wH/BUILD/gdal-3.0.4/gnm -I/tmp/B.lZJ7wH/BUILD/gdal-3.0.4/apps -DHAVE_AVX_AT_COMPILE_TIME -DHAVE_SSSE3_AT_COMPILE_TIME -DHAVE_SSE_AT_COMPILE_TIME -O2 -fwrapv -pipe -Wformat -Werror=format-security -gdwarf-4 -fno-debug-types-section -fvar-tracking-assignments -g2 -Wp,-D_FORTIFY_SOURCE=2 -fstack-protector-strong --param=ssp-buffer-size=4 -Werror=trampolines -fPIC -march=x86-64 -gdwarf-4 -fno-debug-types-section -fvar-tracking-assignments -g2  -fvisibility=hidden  -Wall -Wextra -Winit-self -Wunused-parameter -Wformat -Werror=format-security -Wno-format-nonliteral -Wlogical-op -Wshadow -Werror=vla -Wdate-time -Wnull-dereference -Wduplicated-cond -Wextra-semi -Wfloat-conversion -Wmissing-declarations -Wnon-virtual-dtor -Woverloaded-virtual -fno-operator-names -Wzero-as-null-pointer-constant -Wsuggest-override -Wimplicit-fallthrough  -I..  -DGNM_ENABLED -I/tmp/B.lZJ7wH/BUILD/gdal-3.0.4/port -I/usr/include/openjpeg-2.3 -I/usr/include  -DGDAL_COMPILATION -DHAVE_XERCES -I/usr/include -I/usr/include/xercesc -I/tmp/B.lZJ7wH/BUILD/gdal-3.0.4/port -I/usr/include/openjpeg-2.3 -I/usr/include  -DGDAL_COMPILATION -I/usr/include/libdap -I/usr/include/libxml2 -I/usr/include/libdap -I/usr/include/libxml2  -DLIBDAP_310 -DLIBDAP_39 -DDO_NOT_USE_DEBUG_BOOL -I/usr/include/tirpc -c -o ../o/ogrdodsdatasource.lo ogrdodsdatasource.cpp
make[3]: Leaving directory '/tmp/B.lZJ7wH/BUILD/gdal-3.0.4/ogr/ogrsf_frmts/dods'
make[3]: Entering directory '/tmp/B.lZJ7wH/BUILD/gdal-3.0.4/ogr/ogrsf_frmts/dods'
/bin/sh /tmp/B.lZJ7wH/BUILD/gdal-3.0.4/libtool --mode=compile --silent --tag=CXX x86_64-pld-linux-g++ -I/tmp/B.lZJ7wH/BUILD/gdal-3.0.4/port -I/tmp/B.lZJ7wH/BUILD/gdal-3.0.4/gcore -I/tmp/B.lZJ7wH/BUILD/gdal-3.0.4/alg -I/tmp/B.lZJ7wH/BUILD/gdal-3.0.4/ogr -I/tmp/B.lZJ7wH/BUILD/gdal-3.0.4/ogr/ogrsf_frmts -I/tmp/B.lZJ7wH/BUILD/gdal-3.0.4/gnm -I/tmp/B.lZJ7wH/BUILD/gdal-3.0.4/apps -DHAVE_AVX_AT_COMPILE_TIME -DHAVE_SSSE3_AT_COMPILE_TIME -DHAVE_SSE_AT_COMPILE_TIME -O2 -fwrapv -pipe -Wformat -Werror=format-security -gdwarf-4 -fno-debug-types-section -fvar-tracking-assignments -g2 -Wp,-D_FORTIFY_SOURCE=2 -fstack-protector-strong --param=ssp-buffer-size=4 -Werror=trampolines -fPIC -march=x86-64 -gdwarf-4 -fno-debug-types-section -fvar-tracking-assignments -g2  -fvisibility=hidden  -Wall -Wextra -Winit-self -Wunused-parameter -Wformat -Werror=format-security -Wno-format-nonliteral -Wlogical-op -Wshadow -Werror=vla -Wdate-time -Wnull-dereference -Wduplicated-cond -Wextra-semi -Wfloat-conversion -Wmissing-declarations -Wnon-virtual-dtor -Woverloaded-virtual -fno-operator-names -Wzero-as-null-pointer-constant -Wsuggest-override -Wimplicit-fallthrough  -I..  -DGNM_ENABLED -I/tmp/B.lZJ7wH/BUILD/gdal-3.0.4/port -I/usr/include/openjpeg-2.3 -I/usr/include  -DGDAL_COMPILATION -DHAVE_XERCES -I/usr/include -I/usr/include/xercesc -I/tmp/B.lZJ7wH/BUILD/gdal-3.0.4/port -I/usr/include/openjpeg-2.3 -I/usr/include  -DGDAL_COMPILATION -I/usr/include/libdap -I/usr/include/libxml2 -I/usr/include/libdap -I/usr/include/libxml2  -DLIBDAP_310 -DLIBDAP_39 -DDO_NOT_USE_DEBUG_BOOL -I/usr/include/tirpc -c -o ../o/ogrdodslayer.lo ogrdodslayer.cpp
make[3]: Leaving directory '/tmp/B.lZJ7wH/BUILD/gdal-3.0.4/ogr/ogrsf_frmts/dods'
make[3]: Entering directory '/tmp/B.lZJ7wH/BUILD/gdal-3.0.4/ogr/ogrsf_frmts/osm'
/bin/sh /tmp/B.lZJ7wH/BUILD/gdal-3.0.4/libtool --mode=compile --silent --tag=CXX x86_64-pld-linux-g++ -I/tmp/B.lZJ7wH/BUILD/gdal-3.0.4/port -I/tmp/B.lZJ7wH/BUILD/gdal-3.0.4/gcore -I/tmp/B.lZJ7wH/BUILD/gdal-3.0.4/alg -I/tmp/B.lZJ7wH/BUILD/gdal-3.0.4/ogr -I/tmp/B.lZJ7wH/BUILD/gdal-3.0.4/ogr/ogrsf_frmts -I/tmp/B.lZJ7wH/BUILD/gdal-3.0.4/gnm -I/tmp/B.lZJ7wH/BUILD/gdal-3.0.4/apps -DHAVE_AVX_AT_COMPILE_TIME -DHAVE_SSSE3_AT_COMPILE_TIME -DHAVE_SSE_AT_COMPILE_TIME -O2 -fwrapv -pipe -Wformat -Werror=format-security -gdwarf-4 -fno-debug-types-section -fvar-tracking-assignments -g2 -Wp,-D_FORTIFY_SOURCE=2 -fstack-protector-strong --param=ssp-buffer-size=4 -Werror=trampolines -fPIC -march=x86-64 -gdwarf-4 -fno-debug-types-section -fvar-tracking-assignments -g2  -fvisibility=hidden  -Wall -Wextra -Winit-self -Wunused-parameter -Wformat -Werror=format-security -Wno-format-nonliteral -Wlogical-op -Wshadow -Werror=vla -Wdate-time -Wnull-dereference -Wduplicated-cond -Wextra-semi -Wfloat-conversion -Wmissing-declarations -Wnon-virtual-dtor -Woverloaded-virtual -fno-operator-names -Wzero-as-null-pointer-constant -Wsuggest-override -Wimplicit-fallthrough  -I.. -I../.. -I../sqlite -I../generic  -I/usr/include -I/usr/include -DGNM_ENABLED -I/tmp/B.lZJ7wH/BUILD/gdal-3.0.4/port -I/usr/include/openjpeg-2.3 -I/usr/include  -DGDAL_COMPILATION -DHAVE_XERCES -I/usr/include -I/usr/include/xercesc -I/tmp/B.lZJ7wH/BUILD/gdal-3.0.4/port -I/usr/include/openjpeg-2.3 -I/usr/include  -DGDAL_COMPILATION -DHAVE_EXPAT -c -o ../o/osm_parser.lo osm_parser.cpp
make[3]: Leaving directory '/tmp/B.lZJ7wH/BUILD/gdal-3.0.4/ogr/ogrsf_frmts/osm'
make[3]: Entering directory '/tmp/B.lZJ7wH/BUILD/gdal-3.0.4/ogr/ogrsf_frmts/gpkg'
/bin/sh /tmp/B.lZJ7wH/BUILD/gdal-3.0.4/libtool --mode=compile --silent --tag=CXX x86_64-pld-linux-g++ -I/tmp/B.lZJ7wH/BUILD/gdal-3.0.4/port -I/tmp/B.lZJ7wH/BUILD/gdal-3.0.4/gcore -I/tmp/B.lZJ7wH/BUILD/gdal-3.0.4/alg -I/tmp/B.lZJ7wH/BUILD/gdal-3.0.4/ogr -I/tmp/B.lZJ7wH/BUILD/gdal-3.0.4/ogr/ogrsf_frmts -I/tmp/B.lZJ7wH/BUILD/gdal-3.0.4/gnm -I/tmp/B.lZJ7wH/BUILD/gdal-3.0.4/apps -DHAVE_AVX_AT_COMPILE_TIME -DHAVE_SSSE3_AT_COMPILE_TIME -DHAVE_SSE_AT_COMPILE_TIME -O2 -fwrapv -pipe -Wformat -Werror=format-security -gdwarf-4 -fno-debug-types-section -fvar-tracking-assignments -g2 -Wp,-D_FORTIFY_SOURCE=2 -fstack-protector-strong --param=ssp-buffer-size=4 -Werror=trampolines -fPIC -march=x86-64 -gdwarf-4 -fno-debug-types-section -fvar-tracking-assignments -g2  -fvisibility=hidden  -Wall -Wextra -Winit-self -Wunused-parameter -Wformat -Werror=format-security -Wno-format-nonliteral -Wlogical-op -Wshadow -Werror=vla -Wdate-time -Wnull-dereference -Wduplicated-cond -Wextra-semi -Wfloat-conversion -Wmissing-declarations -Wnon-virtual-dtor -Woverloaded-virtual -fno-operator-names -Wzero-as-null-pointer-constant -Wsuggest-override -Wimplicit-fallthrough  -I.. -I../sqlite -I../../../frmts/mem -I../../../frmts -I/usr/include -DGNM_ENABLED -I/tmp/B.lZJ7wH/BUILD/gdal-3.0.4/port -I/usr/include/openjpeg-2.3 -I/usr/include  -DGDAL_COMPILATION -DHAVE_XERCES -I/usr/include -I/usr/include/xercesc -I/tmp/B.lZJ7wH/BUILD/gdal-3.0.4/port -I/usr/include/openjpeg-2.3 -I/usr/include  -DGDAL_COMPILATION -DSQLITE_HAS_COLUMN_METADATA -c -o ../o/gdalgeopackagerasterband.lo gdalgeopackagerasterband.cpp
make[3]: Leaving directory '/tmp/B.lZJ7wH/BUILD/gdal-3.0.4/ogr/ogrsf_frmts/gpkg'
make[3]: Entering directory '/tmp/B.lZJ7wH/BUILD/gdal-3.0.4/ogr/ogrsf_frmts/dods'
/bin/sh /tmp/B.lZJ7wH/BUILD/gdal-3.0.4/libtool --mode=compile --silent --tag=CXX x86_64-pld-linux-g++ -I/tmp/B.lZJ7wH/BUILD/gdal-3.0.4/port -I/tmp/B.lZJ7wH/BUILD/gdal-3.0.4/gcore -I/tmp/B.lZJ7wH/BUILD/gdal-3.0.4/alg -I/tmp/B.lZJ7wH/BUILD/gdal-3.0.4/ogr -I/tmp/B.lZJ7wH/BUILD/gdal-3.0.4/ogr/ogrsf_frmts -I/tmp/B.lZJ7wH/BUILD/gdal-3.0.4/gnm -I/tmp/B.lZJ7wH/BUILD/gdal-3.0.4/apps -DHAVE_AVX_AT_COMPILE_TIME -DHAVE_SSSE3_AT_COMPILE_TIME -DHAVE_SSE_AT_COMPILE_TIME -O2 -fwrapv -pipe -Wformat -Werror=format-security -gdwarf-4 -fno-debug-types-section -fvar-tracking-assignments -g2 -Wp,-D_FORTIFY_SOURCE=2 -fstack-protector-strong --param=ssp-buffer-size=4 -Werror=trampolines -fPIC -march=x86-64 -gdwarf-4 -fno-debug-types-section -fvar-tracking-assignments -g2  -fvisibility=hidden  -Wall -Wextra -Winit-self -Wunused-parameter -Wformat -Werror=format-security -Wno-format-nonliteral -Wlogical-op -Wshadow -Werror=vla -Wdate-time -Wnull-dereference -Wduplicated-cond -Wextra-semi -Wfloat-conversion -Wmissing-declarations -Wnon-virtual-dtor -Woverloaded-virtual -fno-operator-names -Wzero-as-null-pointer-constant -Wsuggest-override -Wimplicit-fallthrough  -I..  -DGNM_ENABLED -I/tmp/B.lZJ7wH/BUILD/gdal-3.0.4/port -I/usr/include/openjpeg-2.3 -I/usr/include  -DGDAL_COMPILATION -DHAVE_XERCES -I/usr/include -I/usr/include/xercesc -I/tmp/B.lZJ7wH/BUILD/gdal-3.0.4/port -I/usr/include/openjpeg-2.3 -I/usr/include  -DGDAL_COMPILATION -I/usr/include/libdap -I/usr/include/libxml2 -I/usr/include/libdap -I/usr/include/libxml2  -DLIBDAP_310 -DLIBDAP_39 -DDO_NOT_USE_DEBUG_BOOL -I/usr/include/tirpc -c -o ../o/ogrdodssequencelayer.lo ogrdodssequencelayer.cpp
make[3]: Leaving directory '/tmp/B.lZJ7wH/BUILD/gdal-3.0.4/ogr/ogrsf_frmts/dods'
make[3]: Entering directory '/tmp/B.lZJ7wH/BUILD/gdal-3.0.4/ogr/ogrsf_frmts/dods'
/bin/sh /tmp/B.lZJ7wH/BUILD/gdal-3.0.4/libtool --mode=compile --silent --tag=CXX x86_64-pld-linux-g++ -I/tmp/B.lZJ7wH/BUILD/gdal-3.0.4/port -I/tmp/B.lZJ7wH/BUILD/gdal-3.0.4/gcore -I/tmp/B.lZJ7wH/BUILD/gdal-3.0.4/alg -I/tmp/B.lZJ7wH/BUILD/gdal-3.0.4/ogr -I/tmp/B.lZJ7wH/BUILD/gdal-3.0.4/ogr/ogrsf_frmts -I/tmp/B.lZJ7wH/BUILD/gdal-3.0.4/gnm -I/tmp/B.lZJ7wH/BUILD/gdal-3.0.4/apps -DHAVE_AVX_AT_COMPILE_TIME -DHAVE_SSSE3_AT_COMPILE_TIME -DHAVE_SSE_AT_COMPILE_TIME -O2 -fwrapv -pipe -Wformat -Werror=format-security -gdwarf-4 -fno-debug-types-section -fvar-tracking-assignments -g2 -Wp,-D_FORTIFY_SOURCE=2 -fstack-protector-strong --param=ssp-buffer-size=4 -Werror=trampolines -fPIC -march=x86-64 -gdwarf-4 -fno-debug-types-section -fvar-tracking-assignments -g2  -fvisibility=hidden  -Wall -Wextra -Winit-self -Wunused-parameter -Wformat -Werror=format-security -Wno-format-nonliteral -Wlogical-op -Wshadow -Werror=vla -Wdate-time -Wnull-dereference -Wduplicated-cond -Wextra-semi -Wfloat-conversion -Wmissing-declarations -Wnon-virtual-dtor -Woverloaded-virtual -fno-operator-names -Wzero-as-null-pointer-constant -Wsuggest-override -Wimplicit-fallthrough  -I..  -DGNM_ENABLED -I/tmp/B.lZJ7wH/BUILD/gdal-3.0.4/port -I/usr/include/openjpeg-2.3 -I/usr/include  -DGDAL_COMPILATION -DHAVE_XERCES -I/usr/include -I/usr/include/xercesc -I/tmp/B.lZJ7wH/BUILD/gdal-3.0.4/port -I/usr/include/openjpeg-2.3 -I/usr/include  -DGDAL_COMPILATION -I/usr/include/libdap -I/usr/include/libxml2 -I/usr/include/libdap -I/usr/include/libxml2  -DLIBDAP_310 -DLIBDAP_39 -DDO_NOT_USE_DEBUG_BOOL -I/usr/include/tirpc -c -o ../o/ogrdodsfielddefn.lo ogrdodsfielddefn.cpp
make[3]: Leaving directory '/tmp/B.lZJ7wH/BUILD/gdal-3.0.4/ogr/ogrsf_frmts/dods'
make[3]: Entering directory '/tmp/B.lZJ7wH/BUILD/gdal-3.0.4/ogr/ogrsf_frmts/mysql'
/bin/sh /tmp/B.lZJ7wH/BUILD/gdal-3.0.4/libtool --mode=compile --silent --tag=CXX x86_64-pld-linux-g++ -I/tmp/B.lZJ7wH/BUILD/gdal-3.0.4/port -I/tmp/B.lZJ7wH/BUILD/gdal-3.0.4/gcore -I/tmp/B.lZJ7wH/BUILD/gdal-3.0.4/alg -I/tmp/B.lZJ7wH/BUILD/gdal-3.0.4/ogr -I/tmp/B.lZJ7wH/BUILD/gdal-3.0.4/ogr/ogrsf_frmts -I/tmp/B.lZJ7wH/BUILD/gdal-3.0.4/gnm -I/tmp/B.lZJ7wH/BUILD/gdal-3.0.4/apps -DHAVE_AVX_AT_COMPILE_TIME -DHAVE_SSSE3_AT_COMPILE_TIME -DHAVE_SSE_AT_COMPILE_TIME -O2 -fwrapv -pipe -Wformat -Werror=format-security -gdwarf-4 -fno-debug-types-section -fvar-tracking-assignments -g2 -Wp,-D_FORTIFY_SOURCE=2 -fstack-protector-strong --param=ssp-buffer-size=4 -Werror=trampolines -fPIC -march=x86-64 -gdwarf-4 -fno-debug-types-section -fvar-tracking-assignments -g2  -fvisibility=hidden  -Wall -Wextra -Winit-self -Wunused-parameter -Wformat -Werror=format-security -Wno-format-nonliteral -Wlogical-op -Wshadow -Werror=vla -Wdate-time -Wnull-dereference -Wduplicated-cond -Wextra-semi -Wfloat-conversion -Wmissing-declarations -Wnon-virtual-dtor -Woverloaded-virtual -fno-operator-names -Wzero-as-null-pointer-constant -Wsuggest-override -Wimplicit-fallthrough  -I.. -I../..  -I/usr/include/mysql -DGNM_ENABLED -I/tmp/B.lZJ7wH/BUILD/gdal-3.0.4/port -I/usr/include/openjpeg-2.3 -I/usr/include  -DGDAL_COMPILATION -DHAVE_XERCES -I/usr/include -I/usr/include/xercesc -I/tmp/B.lZJ7wH/BUILD/gdal-3.0.4/port -I/usr/include/openjpeg-2.3 -I/usr/include  -DGDAL_COMPILATION -c -o ../o/ogrmysqldatasource.lo ogrmysqldatasource.cpp
make[3]: Leaving directory '/tmp/B.lZJ7wH/BUILD/gdal-3.0.4/ogr/ogrsf_frmts/mysql'
make[3]: Entering directory '/tmp/B.lZJ7wH/BUILD/gdal-3.0.4/ogr/ogrsf_frmts/mysql'
/bin/sh /tmp/B.lZJ7wH/BUILD/gdal-3.0.4/libtool --mode=compile --silent --tag=CXX x86_64-pld-linux-g++ -I/tmp/B.lZJ7wH/BUILD/gdal-3.0.4/port -I/tmp/B.lZJ7wH/BUILD/gdal-3.0.4/gcore -I/tmp/B.lZJ7wH/BUILD/gdal-3.0.4/alg -I/tmp/B.lZJ7wH/BUILD/gdal-3.0.4/ogr -I/tmp/B.lZJ7wH/BUILD/gdal-3.0.4/ogr/ogrsf_frmts -I/tmp/B.lZJ7wH/BUILD/gdal-3.0.4/gnm -I/tmp/B.lZJ7wH/BUILD/gdal-3.0.4/apps -DHAVE_AVX_AT_COMPILE_TIME -DHAVE_SSSE3_AT_COMPILE_TIME -DHAVE_SSE_AT_COMPILE_TIME -O2 -fwrapv -pipe -Wformat -Werror=format-security -gdwarf-4 -fno-debug-types-section -fvar-tracking-assignments -g2 -Wp,-D_FORTIFY_SOURCE=2 -fstack-protector-strong --param=ssp-buffer-size=4 -Werror=trampolines -fPIC -march=x86-64 -gdwarf-4 -fno-debug-types-section -fvar-tracking-assignments -g2  -fvisibility=hidden  -Wall -Wextra -Winit-self -Wunused-parameter -Wformat -Werror=format-security -Wno-format-nonliteral -Wlogical-op -Wshadow -Werror=vla -Wdate-time -Wnull-dereference -Wduplicated-cond -Wextra-semi -Wfloat-conversion -Wmissing-declarations -Wnon-virtual-dtor -Woverloaded-virtual -fno-operator-names -Wzero-as-null-pointer-constant -Wsuggest-override -Wimplicit-fallthrough  -I.. -I../..  -I/usr/include/mysql -DGNM_ENABLED -I/tmp/B.lZJ7wH/BUILD/gdal-3.0.4/port -I/usr/include/openjpeg-2.3 -I/usr/include  -DGDAL_COMPILATION -DHAVE_XERCES -I/usr/include -I/usr/include/xercesc -I/tmp/B.lZJ7wH/BUILD/gdal-3.0.4/port -I/usr/include/openjpeg-2.3 -I/usr/include  -DGDAL_COMPILATION -c -o ../o/ogrmysqllayer.lo ogrmysqllayer.cpp
make[3]: Leaving directory '/tmp/B.lZJ7wH/BUILD/gdal-3.0.4/ogr/ogrsf_frmts/mysql'
make[3]: Entering directory '/tmp/B.lZJ7wH/BUILD/gdal-3.0.4/ogr/ogrsf_frmts/dods'
/bin/sh /tmp/B.lZJ7wH/BUILD/gdal-3.0.4/libtool --mode=compile --silent --tag=CXX x86_64-pld-linux-g++ -I/tmp/B.lZJ7wH/BUILD/gdal-3.0.4/port -I/tmp/B.lZJ7wH/BUILD/gdal-3.0.4/gcore -I/tmp/B.lZJ7wH/BUILD/gdal-3.0.4/alg -I/tmp/B.lZJ7wH/BUILD/gdal-3.0.4/ogr -I/tmp/B.lZJ7wH/BUILD/gdal-3.0.4/ogr/ogrsf_frmts -I/tmp/B.lZJ7wH/BUILD/gdal-3.0.4/gnm -I/tmp/B.lZJ7wH/BUILD/gdal-3.0.4/apps -DHAVE_AVX_AT_COMPILE_TIME -DHAVE_SSSE3_AT_COMPILE_TIME -DHAVE_SSE_AT_COMPILE_TIME -O2 -fwrapv -pipe -Wformat -Werror=format-security -gdwarf-4 -fno-debug-types-section -fvar-tracking-assignments -g2 -Wp,-D_FORTIFY_SOURCE=2 -fstack-protector-strong --param=ssp-buffer-size=4 -Werror=trampolines -fPIC -march=x86-64 -gdwarf-4 -fno-debug-types-section -fvar-tracking-assignments -g2  -fvisibility=hidden  -Wall -Wextra -Winit-self -Wunused-parameter -Wformat -Werror=format-security -Wno-format-nonliteral -Wlogical-op -Wshadow -Werror=vla -Wdate-time -Wnull-dereference -Wduplicated-cond -Wextra-semi -Wfloat-conversion -Wmissing-declarations -Wnon-virtual-dtor -Woverloaded-virtual -fno-operator-names -Wzero-as-null-pointer-constant -Wsuggest-override -Wimplicit-fallthrough  -I..  -DGNM_ENABLED -I/tmp/B.lZJ7wH/BUILD/gdal-3.0.4/port -I/usr/include/openjpeg-2.3 -I/usr/include  -DGDAL_COMPILATION -DHAVE_XERCES -I/usr/include -I/usr/include/xercesc -I/tmp/B.lZJ7wH/BUILD/gdal-3.0.4/port -I/usr/include/openjpeg-2.3 -I/usr/include  -DGDAL_COMPILATION -I/usr/include/libdap -I/usr/include/libxml2 -I/usr/include/libdap -I/usr/include/libxml2  -DLIBDAP_310 -DLIBDAP_39 -DDO_NOT_USE_DEBUG_BOOL -I/usr/include/tirpc -c -o ../o/ogrdodsgrid.lo ogrdodsgrid.cpp
make[3]: Leaving directory '/tmp/B.lZJ7wH/BUILD/gdal-3.0.4/ogr/ogrsf_frmts/dods'
make[3]: Entering directory '/tmp/B.lZJ7wH/BUILD/gdal-3.0.4/ogr/ogrsf_frmts/mysql'
/bin/sh /tmp/B.lZJ7wH/BUILD/gdal-3.0.4/libtool --mode=compile --silent --tag=CXX x86_64-pld-linux-g++ -I/tmp/B.lZJ7wH/BUILD/gdal-3.0.4/port -I/tmp/B.lZJ7wH/BUILD/gdal-3.0.4/gcore -I/tmp/B.lZJ7wH/BUILD/gdal-3.0.4/alg -I/tmp/B.lZJ7wH/BUILD/gdal-3.0.4/ogr -I/tmp/B.lZJ7wH/BUILD/gdal-3.0.4/ogr/ogrsf_frmts -I/tmp/B.lZJ7wH/BUILD/gdal-3.0.4/gnm -I/tmp/B.lZJ7wH/BUILD/gdal-3.0.4/apps -DHAVE_AVX_AT_COMPILE_TIME -DHAVE_SSSE3_AT_COMPILE_TIME -DHAVE_SSE_AT_COMPILE_TIME -O2 -fwrapv -pipe -Wformat -Werror=format-security -gdwarf-4 -fno-debug-types-section -fvar-tracking-assignments -g2 -Wp,-D_FORTIFY_SOURCE=2 -fstack-protector-strong --param=ssp-buffer-size=4 -Werror=trampolines -fPIC -march=x86-64 -gdwarf-4 -fno-debug-types-section -fvar-tracking-assignments -g2  -fvisibility=hidden  -Wall -Wextra -Winit-self -Wunused-parameter -Wformat -Werror=format-security -Wno-format-nonliteral -Wlogical-op -Wshadow -Werror=vla -Wdate-time -Wnull-dereference -Wduplicated-cond -Wextra-semi -Wfloat-conversion -Wmissing-declarations -Wnon-virtual-dtor -Woverloaded-virtual -fno-operator-names -Wzero-as-null-pointer-constant -Wsuggest-override -Wimplicit-fallthrough  -I.. -I../..  -I/usr/include/mysql -DGNM_ENABLED -I/tmp/B.lZJ7wH/BUILD/gdal-3.0.4/port -I/usr/include/openjpeg-2.3 -I/usr/include  -DGDAL_COMPILATION -DHAVE_XERCES -I/usr/include -I/usr/include/xercesc -I/tmp/B.lZJ7wH/BUILD/gdal-3.0.4/port -I/usr/include/openjpeg-2.3 -I/usr/include  -DGDAL_COMPILATION -c -o ../o/ogrmysqltablelayer.lo ogrmysqltablelayer.cpp
make[3]: Leaving directory '/tmp/B.lZJ7wH/BUILD/gdal-3.0.4/ogr/ogrsf_frmts/mysql'
make[3]: Entering directory '/tmp/B.lZJ7wH/BUILD/gdal-3.0.4/ogr/ogrsf_frmts/mysql'
/bin/sh /tmp/B.lZJ7wH/BUILD/gdal-3.0.4/libtool --mode=compile --silent --tag=CXX x86_64-pld-linux-g++ -I/tmp/B.lZJ7wH/BUILD/gdal-3.0.4/port -I/tmp/B.lZJ7wH/BUILD/gdal-3.0.4/gcore -I/tmp/B.lZJ7wH/BUILD/gdal-3.0.4/alg -I/tmp/B.lZJ7wH/BUILD/gdal-3.0.4/ogr -I/tmp/B.lZJ7wH/BUILD/gdal-3.0.4/ogr/ogrsf_frmts -I/tmp/B.lZJ7wH/BUILD/gdal-3.0.4/gnm -I/tmp/B.lZJ7wH/BUILD/gdal-3.0.4/apps -DHAVE_AVX_AT_COMPILE_TIME -DHAVE_SSSE3_AT_COMPILE_TIME -DHAVE_SSE_AT_COMPILE_TIME -O2 -fwrapv -pipe -Wformat -Werror=format-security -gdwarf-4 -fno-debug-types-section -fvar-tracking-assignments -g2 -Wp,-D_FORTIFY_SOURCE=2 -fstack-protector-strong --param=ssp-buffer-size=4 -Werror=trampolines -fPIC -march=x86-64 -gdwarf-4 -fno-debug-types-section -fvar-tracking-assignments -g2  -fvisibility=hidden  -Wall -Wextra -Winit-self -Wunused-parameter -Wformat -Werror=format-security -Wno-format-nonliteral -Wlogical-op -Wshadow -Werror=vla -Wdate-time -Wnull-dereference -Wduplicated-cond -Wextra-semi -Wfloat-conversion -Wmissing-declarations -Wnon-virtual-dtor -Woverloaded-virtual -fno-operator-names -Wzero-as-null-pointer-constant -Wsuggest-override -Wimplicit-fallthrough  -I.. -I../..  -I/usr/include/mysql -DGNM_ENABLED -I/tmp/B.lZJ7wH/BUILD/gdal-3.0.4/port -I/usr/include/openjpeg-2.3 -I/usr/include  -DGDAL_COMPILATION -DHAVE_XERCES -I/usr/include -I/usr/include/xercesc -I/tmp/B.lZJ7wH/BUILD/gdal-3.0.4/port -I/usr/include/openjpeg-2.3 -I/usr/include  -DGDAL_COMPILATION -c -o ../o/ogrmysqlresultlayer.lo ogrmysqlresultlayer.cpp
make[3]: Leaving directory '/tmp/B.lZJ7wH/BUILD/gdal-3.0.4/ogr/ogrsf_frmts/mysql'
make[1]: *** [GNUmakefile:58: sublibs] Error 2
make: *** [GNUmakefile:89: ogr-target] Error 2
error: Bad exit status from /tmp/B.lZJ7wH/BUILD/tmp/rpm-tmp.95903 (%build)


RPM build errors:
    Bad exit status from /tmp/B.lZJ7wH/BUILD/tmp/rpm-tmp.95903 (%build)
ended at: Sun Nov 22 00:56:45 2020, done in 0:11:55.505735
error: No files produced.
+ chmod -R u+rwX /tmp/B.lZJ7wH/BUILD
+ rm -rf /tmp/B.lZJ7wH/tmp /tmp/B.lZJ7wH/BUILD
+ rm -rf /tmp/B.lZJ7wH
Begin-PLD-Builder-Info
Build-Time: user:4983.87s sys:421.70s real:720.10s (faults io:41 non-io:105314003)

End-PLD-Builder-Info
[Back to list of logs] [View rpm -qa of builder]