FailedOk

th/SRPMS[OK]
th/x32[OK]
th/i686[OK]
th/x86_64[OK]

ac/SRPMS[OK]
ac/i386[OK]
ac/i586[OK]
ac/i686[OK]
ac/alpha[OK]
ac/amd64[OK]
ac/athlon[OK]
ac/ppc[OK]
ac/sparc[OK]
ac/sparc64[OK]

Advanced Search
main()
Powered by PLD Linux
(c) 2002-2017 PLD Team
$Revision: 1.37 $
Powered by The Right Thing.
Your IP: 54.158.212.93

git-core af12dda6-5035-481e-bf83-d9feb5275335

Status:Failed
Source URL:ftp://buildlogs.pld-linux.org/th/x86_64/FAIL/git-core,af12dda6-5035-481e-bf83-d9feb5275335.bz2
text/plain URL:View!
full text:View!
rpm -qa of builder:View!
Date:2017/08/05 11:31:20
Runtime:0:14:29.119778

Toc:

  • error 1
  • error: Bad exit status from /tmp/B.K4MkkI/BUILD/tmp/rpm-tmp.212 (%build)
  • error 2
  • RPM build errors:
  • error 3
  • error: No files produced.

Content:

1..4
make[2]: Leaving directory '/tmp/B.K4MkkI/BUILD/git-2.14.0/t'
make[2]: Entering directory '/tmp/B.K4MkkI/BUILD/git-2.14.0/t'
*** t9128-git-svn-cmd-branch.sh ***
ok 1 - initialize svnrepo
ok 2 - import into git
not ok 3 - git svn branch tests
#	
#		git svn branch a &&
#		base=$(git rev-parse HEAD:) &&
#		test $base = $(git rev-parse remotes/origin/a:) &&
#		git svn branch -m "created branch b blah" b &&
#		test $base = $(git rev-parse remotes/origin/b:) &&
#		test_must_fail git branch -m "no branchname" &&
#		git svn branch -n c &&
#		test_must_fail git rev-parse remotes/origin/c &&
#		test_must_fail git svn branch a &&
#		git svn branch -t tag1 &&
#		test $base = $(git rev-parse remotes/origin/tags/tag1:) &&
#		git svn branch --tag tag2 &&
#		test $base = $(git rev-parse remotes/origin/tags/tag2:) &&
#		git svn tag tag3 &&
#		test $base = $(git rev-parse remotes/origin/tags/tag3:) &&
#		git svn tag -m "created tag4 foo" tag4 &&
#		test $base = $(git rev-parse remotes/origin/tags/tag4:) &&
#		test_must_fail git svn tag -m "no tagname" &&
#		git svn tag -n tag5 &&
#		test_must_fail git rev-parse remotes/origin/tags/tag5 &&
#		test_must_fail git svn tag tag1
#	
ok 4 - branch uses correct svn-remote
# failed 1 among 4 test(s)
1..4
make[2]: *** [Makefile:49: t9128-git-svn-cmd-branch.sh] Error 1
make[2]: Leaving directory '/tmp/B.K4MkkI/BUILD/git-2.14.0/t'
make[2]: *** Waiting for unfinished jobs....
make[2]: Entering directory '/tmp/B.K4MkkI/BUILD/git-2.14.0/t'
*** t9132-git-svn-broken-symlink.sh ***
ok 1 - load svn dumpfile
ok 2 - clone using git svn
ok 3 - "bar" is a symlink that points to "asdf"
ok 4 - get "bar" => symlink fix from svn
ok 5 - "bar" remains a proper symlink
# passed all 5 test(s)
1..5
make[2]: Leaving directory '/tmp/B.K4MkkI/BUILD/git-2.14.0/t'
make[2]: Entering directory '/tmp/B.K4MkkI/BUILD/git-2.14.0/t'
*** t9129-git-svn-i18n-commitencoding.sh ***
ok 1 - ISO8859-1 setup
ok 2 - eucJP setup
ok 3 - ISO-2022-JP setup
ok 4 - ISO8859-1 commit on git side
ok 5 - eucJP commit on git side
ok 6 - ISO-2022-JP commit on git side
ok 7 - ISO8859-1 dcommit to svn
ok 8 - eucJP dcommit to svn
ok 9 - ISO-2022-JP dcommit to svn
ok 10 - ISO-8859-1 should match UTF-8 in svn
ok 11 - eucJP should match UTF-8 in svn
ok 12 - ISO-2022-JP should match UTF-8 in svn
# passed all 12 test(s)
1..12
make[2]: Leaving directory '/tmp/B.K4MkkI/BUILD/git-2.14.0/t'
make[2]: Entering directory '/tmp/B.K4MkkI/BUILD/git-2.14.0/t'
*** t9131-git-svn-empty-symlink.sh ***
ok 1 - load svn dumpfile
ok 2 - clone using git svn
ok 3 - enable broken symlink workaround
ok 4 - "bar" is an empty file
ok 5 - get "bar" => symlink fix from svn
ok 6 - "bar" becomes a symlink
ok 7 - clone using git svn
ok 8 - disable broken symlink workaround
ok 9 - "bar" is an empty file
ok 10 - get "bar" => symlink fix from svn
ok 11 - "bar" does not become a symlink
ok 12 - clone using git svn
ok 13 - "bar" is an empty file
ok 14 - get "bar" => symlink fix from svn
ok 15 - "bar" does not become a symlink
# passed all 15 test(s)
1..15
make[2]: Leaving directory '/tmp/B.K4MkkI/BUILD/git-2.14.0/t'
make[2]: Entering directory '/tmp/B.K4MkkI/BUILD/git-2.14.0/t'
*** t9130-git-svn-authors-file.sh ***
ok 1 - setup svnrepo
ok 2 - start import with incomplete authors file
ok 3 - imported 2 revisions successfully
ok 4 - continues to import once authors have been added
ok 5 - authors-file against globs
ok 6 - fetch fails on ee
ok 7 - failure happened without negative side effects
ok 8 - fetch continues after authors-file is fixed
ok 9 - fresh clone with svn.authors-file in config
# passed all 9 test(s)
1..9
make[2]: Leaving directory '/tmp/B.K4MkkI/BUILD/git-2.14.0/t'
make[1]: *** [Makefile:36: test] Error 2
make: *** [Makefile:2415: test] Error 2
error: Bad exit status from /tmp/B.K4MkkI/BUILD/tmp/rpm-tmp.212 (%build)


RPM build errors:
    Bad exit status from /tmp/B.K4MkkI/BUILD/tmp/rpm-tmp.212 (%build)
ended at: Sat Aug  5 11:31:19 2017, done in 0:14:29.119778
error: No files produced.
mesg: ttyname failed: Inappropriate ioctl for device
+ chmod -R u+rwX /tmp/B.K4MkkI/BUILD
+ rm -rf /tmp/B.K4MkkI/tmp /tmp/B.K4MkkI/BUILD
mesg: ttyname failed: Inappropriate ioctl for device
+ rm -rf /tmp/B.K4MkkI
Begin-PLD-Builder-Info
Build-Time: user:786.02s sys:191.46s real:873.63s (faults io:45 non-io:108528996)

End-PLD-Builder-Info
[Back to list of logs] [View rpm -qa of builder]