FailedOk

th/SRPMS[OK]
th/x32[OK]
th/i686[OK]
th/x86_64[OK]

ac/SRPMS[OK]
ac/i386[OK]
ac/i586[OK]
ac/i686[OK]
ac/alpha[OK]
ac/amd64[OK]
ac/athlon[OK]
ac/ppc[OK]
ac/sparc[OK]
ac/sparc64[OK]

Advanced Search
main()
Powered by PLD Linux
(c) 2002-2018 PLD Team
$Revision: 1.37 $
Powered by overclock.
Your IP: 54.224.216.155

git-core d5178680-e1e4-4598-8448-34249cc7a7d7

Status:Failed
Source URL:ftp://buildlogs.pld-linux.org/th/x86_64/FAIL/git-core,d5178680-e1e4-4598-8448-34249cc7a7d7.bz2
text/plain URL:View!
full text:View!
rpm -qa of builder:View!
Date:2017/08/12 13:34:03
Runtime:0:17:03.839813

Toc:

  • error 1
  • make[2]: *** [Makefile:49: t9167-git-svn-cmd-branch-subproject.sh] Error 1
  • error 2
  • make[1]: *** [Makefile:36: test] Error 2
  • error 3
  • error: Bad exit status from /tmp/B.Z0kB9b/BUILD/tmp/rpm-tmp.40852 (%build)
  • error 4
  • RPM build errors:
  • error 5
  • error: No files produced.

Content:

ok 8 - add lots of commits and notes
ok 9 - verify that lots of notes trigger a fanout scheme
ok 10 - verify that importing a notes tree respects the fanout scheme
ok 11 - verify that non-notes are untouched by a fanout change
ok 12 - change a few existing notes
ok 13 - verify that changing notes respect existing fanout
ok 14 - remove lots of notes
ok 15 - verify that removing notes trigger fanout consolidation
ok 16 - verify that non-notes are untouched by a fanout change
ok 17 - add notes to 16 commits in each of 10 refs
# passed all 17 test(s)
1..17
make[2]: Leaving directory '/tmp/B.Z0kB9b/BUILD/git-2.14.1/t'
make[2]: Entering directory '/tmp/B.Z0kB9b/BUILD/git-2.14.1/t'
*** t9302-fast-import-unpack-limit.sh ***
ok 1 - create loose objects on import
ok 2 - bigger packs are preserved
ok 3 - lookups after checkpoint works
# passed all 3 test(s)
1..3
make[2]: Leaving directory '/tmp/B.Z0kB9b/BUILD/git-2.14.1/t'
make[2]: Entering directory '/tmp/B.Z0kB9b/BUILD/git-2.14.1/t'
*** t9303-fast-import-compression.sh ***
ok 1 - fast-import (packed) with -c core.compression=0
ok 2 - fast-import (packed) with -c core.compression=9
ok 3 - fast-import (packed) with -c core.compression=0 -c pack.compression=0
ok 4 - fast-import (packed) with -c core.compression=9 -c pack.compression=0
ok 5 - fast-import (packed) with -c core.compression=0 -c pack.compression=9
ok 6 - fast-import (packed) with -c core.compression=9 -c pack.compression=9
ok 7 - fast-import (packed) with -c pack.compression=0
ok 8 - fast-import (packed) with -c pack.compression=9
ok 9 - fast-import (loose) with -c core.compression=0
ok 10 - fast-import (loose) with -c core.compression=9
ok 11 - fast-import (loose) with -c core.compression=0 -c core.loosecompression=0
ok 12 - fast-import (loose) with -c core.compression=9 -c core.loosecompression=0
ok 13 - fast-import (loose) with -c core.compression=0 -c core.loosecompression=9
ok 14 - fast-import (loose) with -c core.compression=9 -c core.loosecompression=9
ok 15 - fast-import (loose) with -c core.loosecompression=0
ok 16 - fast-import (loose) with -c core.loosecompression=9
# passed all 16 test(s)
1..16
make[2]: Leaving directory '/tmp/B.Z0kB9b/BUILD/git-2.14.1/t'
make[2]: Entering directory '/tmp/B.Z0kB9b/BUILD/git-2.14.1/t'
*** t9350-fast-export.sh ***
ok 1 - setup
ok 2 - fast-export | fast-import
ok 3 - fast-export master~2..master
ok 4 - iso-8859-1
ok 5 - import/export-marks
ok 6 - set up faked signed tag
ok 7 - signed-tags=abort
ok 8 - signed-tags=verbatim
ok 9 - signed-tags=strip
ok 10 - signed-tags=warn-strip
ok 11 - setup submodule
ok 12 - submodule fast-export | fast-import
ok 13 - setup copies
ok 14 - fast-export -C -C | fast-import
ok 15 - fast-export | fast-import when master is tagged
ok 16 - cope with tagger-less tags
ok 17 - setup for limiting exports by PATH
ok 18 - dropping tag of filtered out object
ok 19 - rewriting tag of filtered out object
not ok 20 - no exact-ref revisions included # TODO known breakage
ok 21 - path limiting with import-marks does not lose unmodified files
ok 22 - full-tree re-shows unmodified files
ok 23 - set-up a few more tags for tag export tests
ok 24 - tree_tag
ok 25 - tree_tag-obj
ok 26 - tag-obj_tag
ok 27 - tag-obj_tag-obj
ok 28 - directory becomes symlink
ok 29 - fast-export quotes pathnames
ok 30 - test bidirectionality
ok 31 - avoid uninteresting refs
ok 32 - refs are updated even if no commits need to be exported
ok 33 - use refspec
ok 34 - delete refspec
# still have 1 known breakage(s)
# passed all remaining 33 test(s)
1..34
make[2]: Leaving directory '/tmp/B.Z0kB9b/BUILD/git-2.14.1/t'
make[2]: Entering directory '/tmp/B.Z0kB9b/BUILD/git-2.14.1/t'
*** t9167-git-svn-cmd-branch-subproject.sh ***
ok 1 - initialize svnrepo
ok 2 - import into git
not ok 3 - git svn branch tests
#	
#		test_must_fail git svn branch a &&
#		git svn branch --parents a &&
#		test_must_fail git svn branch -t tag1 &&
#		git svn branch --parents -t tag1 &&
#		test_must_fail git svn branch --tag tag2 &&
#		git svn branch --parents --tag tag2 &&
#		test_must_fail git svn tag tag3 &&
#		git svn tag --parents tag3
#	
# failed 1 among 3 test(s)
1..3
make[2]: *** [Makefile:49: t9167-git-svn-cmd-branch-subproject.sh] Error 1
make[2]: Leaving directory '/tmp/B.Z0kB9b/BUILD/git-2.14.1/t'
make[2]: *** Waiting for unfinished jobs....
make[2]: Entering directory '/tmp/B.Z0kB9b/BUILD/git-2.14.1/t'
*** t9351-fast-export-anonymize.sh ***
ok 1 - setup simple repo
ok 2 - export anonymized stream
ok 3 - stream omits path names
ok 4 - stream allows master as refname
ok 5 - stream omits other refnames
ok 6 - stream omits identities
ok 7 - stream omits tag message
ok 8 - import stream to new repository
ok 9 - result has two branches
ok 10 - repo has original shape and timestamps
ok 11 - root tree has original shape
ok 12 - paths in subdir ended up in one tree
ok 13 - tag points to branch tip
ok 14 - idents are shared
# passed all 14 test(s)
1..14
make[2]: Leaving directory '/tmp/B.Z0kB9b/BUILD/git-2.14.1/t'
make[2]: Entering directory '/tmp/B.Z0kB9b/BUILD/git-2.14.1/t'
*** t9300-fast-import.sh ***
ok 1 - empty stream succeeds
ok 2 - truncated stream complains
ok 3 - A: create pack from stdin
ok 4 - A: verify pack
ok 5 - A: verify commit
ok 6 - A: verify tree
ok 7 - A: verify file2
ok 8 - A: verify file3
ok 9 - A: verify file4
ok 10 - A: verify tag/series-A
ok 11 - A: verify tag/series-A-blob
ok 12 - A: verify marks output
ok 13 - A: verify marks import
ok 14 - A: tag blob by sha1
ok 15 - A: verify marks import does not crash
ok 16 - A: verify pack
ok 17 - A: verify diff
ok 18 - A: export marks with large values
ok 19 - B: fail on invalid blob sha1
ok 20 - B: accept branch name "TEMP_TAG"
ok 21 - B: accept empty committer
ok 22 - B: accept and fixup committer with no name
ok 23 - B: fail on invalid committer (1)
ok 24 - B: fail on invalid committer (2)
ok 25 - B: fail on invalid committer (3)
ok 26 - B: fail on invalid committer (4)
ok 27 - B: fail on invalid committer (5)
ok 28 - C: incremental import create pack from stdin
ok 29 - C: verify pack
ok 30 - C: validate reuse existing blob
ok 31 - C: verify commit
ok 32 - C: validate rename result
ok 33 - D: inline data in commit
ok 34 - D: verify pack
ok 35 - D: validate new files added
ok 36 - D: verify file5
ok 37 - D: verify file6
ok 38 - E: rfc2822 date, --date-format=raw
ok 39 - E: rfc2822 date, --date-format=rfc2822
ok 40 - E: verify pack
ok 41 - E: verify commit
ok 42 - F: non-fast-forward update skips
ok 43 - F: verify pack
ok 44 - F: verify other commit
ok 45 - G: non-fast-forward update forced
ok 46 - G: verify pack
ok 47 - G: branch changed, but logged
ok 48 - H: deletall, add 1
ok 49 - H: verify pack
ok 50 - H: validate old files removed, new files added
ok 51 - H: verify file
ok 52 - I: export-pack-edges
ok 53 - I: verify edge list
ok 54 - J: reset existing branch creates empty commit
ok 55 - J: branch has 1 commit, empty tree
ok 56 - J: tag must fail on empty branch
ok 57 - K: reinit branch with from
ok 58 - K: verify K^1 = branch^1
ok 59 - L: verify internal tree sorting
ok 60 - L: nested tree copy does not corrupt deltas
ok 61 - M: rename file in same subdirectory
ok 62 - M: rename file to new subdirectory
ok 63 - M: rename subdirectory to new subdirectory
ok 64 - M: rename root to subdirectory
ok 65 - N: copy file in same subdirectory
ok 66 - N: copy then modify subdirectory
ok 67 - N: copy dirty subdirectory
ok 68 - N: copy directory by id
ok 69 - N: read and copy directory
ok 70 - N: empty directory reads as missing
ok 71 - N: copy root directory by tree hash
ok 72 - N: copy root by path
ok 73 - N: delete directory by copying
ok 74 - N: modify copied tree
ok 75 - N: reject foo/ syntax
ok 76 - N: reject foo/ syntax in copy source
ok 77 - N: reject foo/ syntax in rename source
ok 78 - N: reject foo/ syntax in ls argument
ok 79 - N: copy to root by id and modify
ok 80 - N: extract subtree
ok 81 - N: modify subtree, extract it, and modify again
ok 82 - O: comments are all skipped
ok 83 - O: blank lines not necessary after data commands
ok 84 - O: repack before next test
ok 85 - O: blank lines not necessary after other commands
ok 86 - O: progress outputs as requested by input
ok 87 - P: superproject & submodule mix
ok 88 - P: verbatim SHA gitlinks
ok 89 - P: fail on inline gitlink
ok 90 - P: fail on blob mark in gitlink
ok 91 - Q: commit notes
ok 92 - Q: verify pack
ok 93 - Q: verify first commit
ok 94 - Q: verify second commit
ok 95 - Q: verify third commit
ok 96 - Q: verify first notes commit
ok 97 - Q: verify first notes tree
ok 98 - Q: verify first note for first commit
ok 99 - Q: verify first note for second commit
ok 100 - Q: verify first note for third commit
ok 101 - Q: verify second notes commit
ok 102 - Q: verify second notes tree
ok 103 - Q: verify second note for first commit
ok 104 - Q: verify first note for second commit
ok 105 - Q: verify first note for third commit
ok 106 - Q: verify third notes commit
ok 107 - Q: verify third notes tree
ok 108 - Q: verify third note for first commit
ok 109 - Q: verify fourth notes commit
ok 110 - Q: verify fourth notes tree
ok 111 - Q: verify second note for second commit
ok 112 - Q: deny note on empty branch
ok 113 - R: abort on unsupported feature
ok 114 - R: supported feature is accepted
ok 115 - R: abort on receiving feature after data command
ok 116 - R: only one import-marks feature allowed per stream
ok 117 - R: export-marks feature results in a marks file being created
ok 118 - R: export-marks options can be overridden by commandline options
ok 119 - R: catch typo in marks file name
ok 120 - R: import and output marks can be the same file
ok 121 - R: --import-marks=foo --output-marks=foo to create foo fails
ok 122 - R: --import-marks-if-exists
ok 123 - R: feature import-marks-if-exists
ok 124 - R: import to output marks works without any content
ok 125 - R: import marks prefers commandline marks file over the stream
ok 126 - R: multiple --import-marks= should be honoured
ok 127 - R: feature relative-marks should be honoured
ok 128 - R: feature no-relative-marks should be honoured
ok 129 - R: feature ls supported
ok 130 - R: feature cat-blob supported
ok 131 - R: cat-blob-fd must be a nonnegative integer
ok 132 - R: print old blob
ok 133 - R: in-stream cat-blob-fd not respected
ok 134 - R: print mark for new blob
ok 135 - R: print new blob
ok 136 - R: print new blob by sha1
ok 137 - setup: big file
ok 138 - R: print two blobs to stdout
ok 139 - R: copy using cat-file
ok 140 - R: print blob mid-commit
ok 141 - R: print staged blob within commit
ok 142 - R: quiet option results in no stats being output
ok 143 - R: feature done means terminating "done" is mandatory
ok 144 - R: terminating "done" with trailing gibberish is ok
ok 145 - R: terminating "done" within commit
ok 146 - R: die on unknown option
ok 147 - R: unknown commandline options are rejected
ok 148 - R: die on invalid option argument
ok 149 - R: ignore non-git options
ok 150 - R: corrupt lines do not mess marks file
ok 151 - R: blob bigger than threshold
ok 152 - R: verify created pack
ok 153 - R: verify written objects
ok 154 - R: blob appears only once
ok 155 - S: initialize for S tests
ok 156 - S: filemodify with garbage after mark must fail
ok 157 - S: filemodify with garbage after inline must fail
ok 158 - S: filemodify with garbage after sha1 must fail
ok 159 - S: notemodify with garbage after mark dataref must fail
ok 160 - S: notemodify with garbage after inline dataref must fail
ok 161 - S: notemodify with garbage after sha1 dataref must fail
ok 162 - S: notemodify with garbage after mark commit-ish must fail
ok 163 - S: from with garbage after mark must fail
ok 164 - S: merge with garbage after mark must fail
ok 165 - S: tag with garbage after mark must fail
ok 166 - S: cat-blob with garbage after mark must fail
ok 167 - S: ls with garbage after mark must fail
ok 168 - S: ls with garbage after sha1 must fail
ok 169 - T: ls root tree
ok 170 - T: delete branch
ok 171 - T: empty reset doesnt delete branch
ok 172 - U: initialize for U tests
ok 173 - U: filedelete file succeeds
ok 174 - U: validate file delete result
ok 175 - U: filedelete directory succeeds
ok 176 - U: validate directory delete result
ok 177 - U: filedelete root succeeds
ok 178 - U: validate root delete result
# passed all 178 test(s)
1..178
make[2]: Leaving directory '/tmp/B.Z0kB9b/BUILD/git-2.14.1/t'
make[2]: Entering directory '/tmp/B.Z0kB9b/BUILD/git-2.14.1/t'
*** t9164-git-svn-dcommit-concurrent.sh ***
ok 1 - setup svn repository
ok 2 - check if post-commit hook creates a concurrent commit
ok 3 - check if pre-commit hook fails
ok 4 - dcommit error handling
ok 5 - dcommit concurrent change in non-changed file
ok 6 - dcommit concurrent non-conflicting change
ok 7 - dcommit --no-rebase concurrent non-conflicting change
ok 8 - dcommit fails on concurrent conflicting change
# passed all 8 test(s)
1..8
make[2]: Leaving directory '/tmp/B.Z0kB9b/BUILD/git-2.14.1/t'
make[2]: Entering directory '/tmp/B.Z0kB9b/BUILD/git-2.14.1/t'
*** t9168-git-svn-partially-globbed-names.sh ***
ok 1 - prepare test refspec prefixed globbing
ok 2 - test refspec prefixed globbing
ok 3 - prepare test left-hand-side only prefixed globbing
ok 4 - test left-hand-side only prefixed globbing
ok 5 - prepare test prefixed globs match just prefix
ok 6 - test prefixed globs match just prefix
ok 7 - prepare test disallow prefixed multi-globs
ok 8 - test disallow prefixed multi-globs
ok 9 - prepare test globbing in the middle of the word
ok 10 - test globbing in the middle of the word
ok 11 - prepare test disallow multiple asterisks in one word
ok 12 - test disallow multiple asterisks in one word
# passed all 12 test(s)
1..12
make[2]: Leaving directory '/tmp/B.Z0kB9b/BUILD/git-2.14.1/t'
make[1]: *** [Makefile:36: test] Error 2
make: *** [Makefile:2415: test] Error 2
error: Bad exit status from /tmp/B.Z0kB9b/BUILD/tmp/rpm-tmp.40852 (%build)


RPM build errors:
    Bad exit status from /tmp/B.Z0kB9b/BUILD/tmp/rpm-tmp.40852 (%build)
ended at: Sat Aug 12 13:34:02 2017, done in 0:17:03.839813
error: No files produced.
mesg: ttyname failed: Inappropriate ioctl for device
+ chmod -R u+rwX /tmp/B.Z0kB9b/BUILD
+ rm -rf /tmp/B.Z0kB9b/tmp /tmp/B.Z0kB9b/BUILD
mesg: ttyname failed: Inappropriate ioctl for device
+ rm -rf /tmp/B.Z0kB9b
Begin-PLD-Builder-Info
Build-Time: user:840.73s sys:238.92s real:1030.88s (faults io:36 non-io:120554091)

End-PLD-Builder-Info
[Back to list of logs] [View rpm -qa of builder]