FailedOk

th/SRPMS[OK]
th/x32[OK]
th/i686[OK]
th/x86_64[OK]

ac/SRPMS[OK]
ac/i386[OK]
ac/i586[OK]
ac/i686[OK]
ac/alpha[OK]
ac/amd64[OK]
ac/athlon[OK]
ac/ppc[OK]
ac/sparc[OK]
ac/sparc64[OK]

Advanced Search
main()
Powered by PLD Linux
(c) 2002-2022 PLD Team
$Revision: 1.37 $
Powered by X.
Your IP: 3.236.121.117

gl2ps 85670c26-4b0d-417b-9840-d412d710b9db

Status:Failed
Source URL:https://buildlogs.pld-linux.org/pld/th/x86_64/FAIL/gl2ps,85670c26-4b0d-417b-9840-d412d710b9db.bz2
text/plain URL:View!
full text:View!
rpm -qa of builder:View!
Date:2022/09/12 06:28:52
Runtime:0:00:03.804594

Toc:

  • error 1
  • ! LaTeX Error: File `ifxetex.sty' not found.
  • error 2
  • make[2]: *** [CMakeFiles/pdf.dir/build.make:76: gl2ps.pdf] Error 1
  • error 3
  • make[1]: *** [CMakeFiles/Makefile2:198: CMakeFiles/pdf.dir/all] Error 2
  • error 4
  • error: Bad exit status from /tmp/B.sg0cekrw/BUILD/tmp/rpm-tmp.E7w68t (%build)
  • error 5
  • RPM build errors:
  • error 6
  • error: No files produced.

Content:

-- Check for working C compiler: /usr/bin/x86_64-pld-linux-gcc - skipped
-- Detecting C compile features
-- Detecting C compile features - done
-- Looking for vsnprintf
-- Looking for vsnprintf - found
CMake Warning (dev) at /usr/share/cmake/Modules/FindOpenGL.cmake:315 (message):
  Policy CMP0072 is not set: FindOpenGL prefers GLVND by default when
  available.  Run "cmake --help-policy CMP0072" for policy details.  Use the
  cmake_policy command to set the policy and suppress this warning.

  FindOpenGL found both a legacy GL library:

    OPENGL_gl_LIBRARY: /usr/lib64/libGL.so

  and GLVND libraries for OpenGL and GLX:

    OPENGL_opengl_LIBRARY: /usr/lib64/libOpenGL.so
    OPENGL_glx_LIBRARY: /usr/lib64/libGLX.so

  OpenGL_GL_PREFERENCE has not been set to "GLVND" or "LEGACY", so for
  compatibility with CMake 3.10 and below the legacy GL library will be used.
Call Stack (most recent call first):
  CMakeLists.txt:94 (find_package)
This warning is for project developers.  Use -Wno-dev to suppress it.

-- Found OpenGL: /usr/lib64/libOpenGL.so   
-- Found GLUT: TRUE  
-- Found ZLIB: /usr/lib64/libz.so (found version "1.2.12") 
-- Found PNG: /usr/lib64/libpng.so (found version "1.6.37") 
-- Found LATEX: /usr/bin/latex   
-- Configuring done
-- Generating done
CMake Warning:
  Manually-specified variables were not used by the project:

    CMAKE_CXX_FLAGS_PLD
    CMAKE_Fortran_FLAGS_PLD
    CMAKE_INSTALL_BINDIR
    CMAKE_INSTALL_DATADIR
    CMAKE_INSTALL_DATAROOTDIR
    CMAKE_INSTALL_DOCDIR
    CMAKE_INSTALL_INCLUDEDIR
    CMAKE_INSTALL_INFODIR
    CMAKE_INSTALL_LIBDIR
    CMAKE_INSTALL_LIBEXECDIR
    CMAKE_INSTALL_LOCALEDIR
    CMAKE_INSTALL_LOCALSTATEDIRPATH
    CMAKE_INSTALL_MANDIR
    CMAKE_INSTALL_OLDINCLUDEDIR
    CMAKE_INSTALL_SBINDIR
    CMAKE_INSTALL_SHAREDSTATEDIRPATH
    CMAKE_INSTALL_SYSCONFDIR
    SYSCONF_INSTALL_DIR


-- Build files have been written to: /tmp/B.sg0cekrw/BUILD/gl2ps-1.4.2/build
+ /usr/bin/make -Otarget -j9
/usr/bin/cmake -S/tmp/B.sg0cekrw/BUILD/gl2ps-1.4.2 -B/tmp/B.sg0cekrw/BUILD/gl2ps-1.4.2/build --check-build-system CMakeFiles/Makefile.cmake 0
/usr/bin/cmake -E cmake_progress_start /tmp/B.sg0cekrw/BUILD/gl2ps-1.4.2/build/CMakeFiles /tmp/B.sg0cekrw/BUILD/gl2ps-1.4.2/build//CMakeFiles/progress.marks
/usr/bin/make  -f CMakeFiles/Makefile2 all
/usr/bin/make  -f CMakeFiles/lib.dir/build.make CMakeFiles/lib.dir/depend
/usr/bin/make  -f CMakeFiles/shared.dir/build.make CMakeFiles/shared.dir/depend
/usr/bin/make  -f CMakeFiles/pdf.dir/build.make CMakeFiles/pdf.dir/depend
make[2]: Entering directory '/tmp/B.sg0cekrw/BUILD/gl2ps-1.4.2/build'
cd /tmp/B.sg0cekrw/BUILD/gl2ps-1.4.2/build && /usr/bin/cmake -E cmake_depends "Unix Makefiles" /tmp/B.sg0cekrw/BUILD/gl2ps-1.4.2 /tmp/B.sg0cekrw/BUILD/gl2ps-1.4.2 /tmp/B.sg0cekrw/BUILD/gl2ps-1.4.2/build /tmp/B.sg0cekrw/BUILD/gl2ps-1.4.2/build /tmp/B.sg0cekrw/BUILD/gl2ps-1.4.2/build/CMakeFiles/lib.dir/DependInfo.cmake --color=
make[2]: Leaving directory '/tmp/B.sg0cekrw/BUILD/gl2ps-1.4.2/build'
make[2]: Entering directory '/tmp/B.sg0cekrw/BUILD/gl2ps-1.4.2/build'
cd /tmp/B.sg0cekrw/BUILD/gl2ps-1.4.2/build && /usr/bin/cmake -E cmake_depends "Unix Makefiles" /tmp/B.sg0cekrw/BUILD/gl2ps-1.4.2 /tmp/B.sg0cekrw/BUILD/gl2ps-1.4.2 /tmp/B.sg0cekrw/BUILD/gl2ps-1.4.2/build /tmp/B.sg0cekrw/BUILD/gl2ps-1.4.2/build /tmp/B.sg0cekrw/BUILD/gl2ps-1.4.2/build/CMakeFiles/shared.dir/DependInfo.cmake --color=
make[2]: Leaving directory '/tmp/B.sg0cekrw/BUILD/gl2ps-1.4.2/build'
make[2]: Entering directory '/tmp/B.sg0cekrw/BUILD/gl2ps-1.4.2/build'
cd /tmp/B.sg0cekrw/BUILD/gl2ps-1.4.2/build && /usr/bin/cmake -E cmake_depends "Unix Makefiles" /tmp/B.sg0cekrw/BUILD/gl2ps-1.4.2 /tmp/B.sg0cekrw/BUILD/gl2ps-1.4.2 /tmp/B.sg0cekrw/BUILD/gl2ps-1.4.2/build /tmp/B.sg0cekrw/BUILD/gl2ps-1.4.2/build /tmp/B.sg0cekrw/BUILD/gl2ps-1.4.2/build/CMakeFiles/pdf.dir/DependInfo.cmake --color=
make[2]: Leaving directory '/tmp/B.sg0cekrw/BUILD/gl2ps-1.4.2/build'
/usr/bin/make  -f CMakeFiles/lib.dir/build.make CMakeFiles/lib.dir/build
/usr/bin/make  -f CMakeFiles/shared.dir/build.make CMakeFiles/shared.dir/build
/usr/bin/make  -f CMakeFiles/pdf.dir/build.make CMakeFiles/pdf.dir/build
make[2]: Entering directory '/tmp/B.sg0cekrw/BUILD/gl2ps-1.4.2/build'
[ 22%] Generating gl2ps.pdf
/usr/bin/pdflatex /tmp/B.sg0cekrw/BUILD/gl2ps-1.4.2/gl2ps.tex
This is pdfTeXk, Version 3.1415926-1.40.9 (Web2C 7.5.7)
 %&-line parsing enabled.
entering extended mode
(/tmp/B.sg0cekrw/BUILD/gl2ps-1.4.2/gl2ps.tex
LaTeX2e <2005/12/01>
Babel <v3.8l> and hyphenation patterns for english, usenglishmax, dumylang, noh
yphenation, german-x-2008-06-18, ngerman-x-2008-06-18, ancientgreek, ibycus, ar
abic, basque, bulgarian, catalan, pinyin, coptic, croatian, czech, danish, dutc
h, esperanto, estonian, farsi, finnish, french, galician, german, ngerman, mono
greek, greek, hungarian, icelandic, indonesian, interlingua, irish, italian, la
tin, mongolian, mongolian2a, bokmal, nynorsk, polish, portuguese, romanian, rus
sian, sanskrit, serbian, slovak, slovenian, spanish, swedish, turkish, ukenglis
h, ukrainian, uppersorbian, welsh, loaded.
(/usr/share/texmf-dist/tex/latex/base/article.cls
Document Class: article 2005/09/16 v1.4f Standard LaTeX document class
(/usr/share/texmf-dist/tex/latex/base/size10.clo))
(/usr/share/texmf-dist/tex/latex/hyperref/hyperref.sty
(/usr/share/texmf-dist/tex/latex/graphics/keyval.sty)
(/usr/share/texmf-dist/tex/generic/oberdiek/ifpdf.sty)
(/usr/share/texmf-dist/tex/generic/oberdiek/ifvtex.sty)

! LaTeX Error: File `ifxetex.sty' not found.

Type X to quit or <RETURN> to proceed,
or enter new name. (Default extension: sty)

Enter file name: 
! Emergency stop.
<read *> 
         
l.100 \RequirePackage{ifxetex}[2006/08/21]
                                          ^^M
!  ==> Fatal error occurred, no output PDF file produced!
Transcript written on gl2ps.log.
make[2]: *** [CMakeFiles/pdf.dir/build.make:76: gl2ps.pdf] Error 1
make[2]: Leaving directory '/tmp/B.sg0cekrw/BUILD/gl2ps-1.4.2/build'
make[1]: *** [CMakeFiles/Makefile2:198: CMakeFiles/pdf.dir/all] Error 2
make[1]: *** Waiting for unfinished jobs....
make[2]: Entering directory '/tmp/B.sg0cekrw/BUILD/gl2ps-1.4.2/build'
[ 33%] Building C object CMakeFiles/lib.dir/gl2ps.c.o
/usr/bin/x86_64-pld-linux-gcc -DHAVE_PNG -DHAVE_ZLIB  -O2 -fwrapv -pipe -Wformat -Werror=format-security -gdwarf-4 -fno-debug-types-section -fvar-tracking-assignments -g2 -Wp,-D_FORTIFY_SOURCE=2 -fstack-protector-strong --param=ssp-buffer-size=4 -Werror=trampolines -fPIC -march=x86-64 -mtune=generic -gdwarf-4 -fno-debug-types-section -fvar-tracking-assignments -g2  -DNDEBUG -DQT_NO_DEBUG -MD -MT CMakeFiles/lib.dir/gl2ps.c.o -MF CMakeFiles/lib.dir/gl2ps.c.o.d -o CMakeFiles/lib.dir/gl2ps.c.o -c /tmp/B.sg0cekrw/BUILD/gl2ps-1.4.2/gl2ps.c
make[2]: Leaving directory '/tmp/B.sg0cekrw/BUILD/gl2ps-1.4.2/build'
make[2]: Entering directory '/tmp/B.sg0cekrw/BUILD/gl2ps-1.4.2/build'
[ 22%] Building C object CMakeFiles/shared.dir/gl2ps.c.o
/usr/bin/x86_64-pld-linux-gcc -DHAVE_PNG -DHAVE_ZLIB -Dshared_EXPORTS  -O2 -fwrapv -pipe -Wformat -Werror=format-security -gdwarf-4 -fno-debug-types-section -fvar-tracking-assignments -g2 -Wp,-D_FORTIFY_SOURCE=2 -fstack-protector-strong --param=ssp-buffer-size=4 -Werror=trampolines -fPIC -march=x86-64 -mtune=generic -gdwarf-4 -fno-debug-types-section -fvar-tracking-assignments -g2  -DNDEBUG -DQT_NO_DEBUG -fPIC -MD -MT CMakeFiles/shared.dir/gl2ps.c.o -MF CMakeFiles/shared.dir/gl2ps.c.o.d -o CMakeFiles/shared.dir/gl2ps.c.o -c /tmp/B.sg0cekrw/BUILD/gl2ps-1.4.2/gl2ps.c
make[2]: Leaving directory '/tmp/B.sg0cekrw/BUILD/gl2ps-1.4.2/build'
make[2]: Entering directory '/tmp/B.sg0cekrw/BUILD/gl2ps-1.4.2/build'
[ 44%] Linking C static library libgl2ps.a
/usr/bin/cmake -P CMakeFiles/lib.dir/cmake_clean_target.cmake
/usr/bin/cmake -E cmake_link_script CMakeFiles/lib.dir/link.txt --verbose=1
/usr/bin/ar qc libgl2ps.a CMakeFiles/lib.dir/gl2ps.c.o
/usr/bin/ranlib libgl2ps.a
make[2]: Leaving directory '/tmp/B.sg0cekrw/BUILD/gl2ps-1.4.2/build'
make[1]: Entering directory '/tmp/B.sg0cekrw/BUILD/gl2ps-1.4.2/build'
[ 55%] Built target lib
make[1]: Leaving directory '/tmp/B.sg0cekrw/BUILD/gl2ps-1.4.2/build'
make[2]: Entering directory '/tmp/B.sg0cekrw/BUILD/gl2ps-1.4.2/build'
[ 55%] Linking C shared library libgl2ps.so
/usr/bin/cmake -E cmake_link_script CMakeFiles/shared.dir/link.txt --verbose=1
/usr/bin/x86_64-pld-linux-gcc -fPIC -O2 -fwrapv -pipe -Wformat -Werror=format-security -gdwarf-4 -fno-debug-types-section -fvar-tracking-assignments -g2 -Wp,-D_FORTIFY_SOURCE=2 -fstack-protector-strong --param=ssp-buffer-size=4 -Werror=trampolines -fPIC -march=x86-64 -mtune=generic -gdwarf-4 -fno-debug-types-section -fvar-tracking-assignments -g2  -DNDEBUG -DQT_NO_DEBUG -Wl,--as-needed -Wl,--no-copy-dt-needed-entries -Wl,-z,relro -Wl,-z,combreloc -shared -Wl,-soname,libgl2ps.so.1 -o libgl2ps.so.1.4.2 CMakeFiles/shared.dir/gl2ps.c.o  -lGL -lGLU -lglut -lz -lpng -lz -lm -lm -lpng -lm -lm 
/usr/bin/cmake -E cmake_symlink_library libgl2ps.so.1.4.2 libgl2ps.so.1 libgl2ps.so
make[2]: Leaving directory '/tmp/B.sg0cekrw/BUILD/gl2ps-1.4.2/build'
make[1]: Entering directory '/tmp/B.sg0cekrw/BUILD/gl2ps-1.4.2/build'
[ 55%] Built target shared
make[1]: Leaving directory '/tmp/B.sg0cekrw/BUILD/gl2ps-1.4.2/build'
make: *** [Makefile:159: all] Error 2
error: Bad exit status from /tmp/B.sg0cekrw/BUILD/tmp/rpm-tmp.E7w68t (%build)

RPM build warnings:
    Could not canonicalize hostname: ymir

RPM build errors:
    Bad exit status from /tmp/B.sg0cekrw/BUILD/tmp/rpm-tmp.E7w68t (%build)
ended at: Mon Sep 12 06:28:52 2022, done in 0:00:03.804594
error: No files produced.
+ chmod -R u+rwX /tmp/B.sg0cekrw/BUILD
+ rm -rf /tmp/B.sg0cekrw/tmp /tmp/B.sg0cekrw/BUILD
+ rm -rf /tmp/B.sg0cekrw
Begin-PLD-Builder-Info
Build-Time: user:7.35s sys:1.15s real:5.75s (faults io:16 non-io:235457)

End-PLD-Builder-Info
[Back to list of logs] [View rpm -qa of builder]