FailedOk

th/SRPMS[OK]
th/x32[OK]
th/i686[OK]
th/x86_64[OK]

ac/SRPMS[OK]
ac/i386[OK]
ac/i586[OK]
ac/i686[OK]
ac/alpha[OK]
ac/amd64[OK]
ac/athlon[OK]
ac/ppc[OK]
ac/sparc[OK]
ac/sparc64[OK]

Advanced Search
main()
Powered by PLD Linux
(c) 2002-2018 PLD Team
$Revision: 1.37 $
Powered by The Right Thing.
Your IP: 54.80.208.105

glog 94523a9a-0154-4b07-8834-6101ae3c6d88

Status:Failed
Source URL:ftp://buildlogs.pld-linux.org/th/x86_64/FAIL/glog,94523a9a-0154-4b07-8834-6101ae3c6d88.bz2
text/plain URL:View!
full text:View!
rpm -qa of builder:View!
Date:2018/02/13 21:30:53
Runtime:0:00:24.032003

Toc:

  • error 1
  • collect2: error: ld returned 1 exit status
  • error 2
  • collect2: error: ld returned 1 exit status
  • error 3
  • collect2: error: ld returned 1 exit status
  • error 4
  • error: Bad exit status from /tmp/B.UCvtAk/BUILD/tmp/rpm-tmp.60532 (%build)
  • error 5
  • RPM build errors:
  • error 6
  • error: No files produced.

Content:

config.status: creating src/glog/vlog_is_on.h
config.status: creating src/glog/stl_logging.h
config.status: creating libglog.pc
config.status: creating src/config.h
config.status: executing depfiles commands
config.status: executing libtool commands
+ /usr/bin/make -Otarget -j5
/bin/sh ./libtool  --tag=CXX   --mode=compile x86_64-pld-linux-g++ -DHAVE_CONFIG_H -I. -I./src  -I./src     -Wall -Wwrite-strings -Woverloaded-virtual -Wno-sign-compare  -DNO_FRAME_POINTER  -DNDEBUG -O2 -fwrapv -pipe -Wformat -Werror=format-security -gdwarf-4 -fno-debug-types-section -fvar-tracking-assignments -g2 -Wp,-D_FORTIFY_SOURCE=2 -fstack-protector-strong --param=ssp-buffer-size=4 -fPIC -march=x86-64 -gdwarf-4 -fno-debug-types-section -fvar-tracking-assignments -g2  -MT src/libglog_la-raw_logging.lo -MD -MP -MF src/.deps/libglog_la-raw_logging.Tpo -c -o src/libglog_la-raw_logging.lo `test -f 'src/raw_logging.cc' || echo './'`src/raw_logging.cc
libtool: compile:  x86_64-pld-linux-g++ -DHAVE_CONFIG_H -I. -I./src -I./src -Wall -Wwrite-strings -Woverloaded-virtual -Wno-sign-compare -DNO_FRAME_POINTER -DNDEBUG -O2 -fwrapv -pipe -Wformat -Werror=format-security -gdwarf-4 -fno-debug-types-section -fvar-tracking-assignments -g2 -Wp,-D_FORTIFY_SOURCE=2 -fstack-protector-strong --param=ssp-buffer-size=4 -fPIC -march=x86-64 -gdwarf-4 -fno-debug-types-section -fvar-tracking-assignments -g2 -MT src/libglog_la-raw_logging.lo -MD -MP -MF src/.deps/libglog_la-raw_logging.Tpo -c src/raw_logging.cc  -fPIC -DPIC -o src/.libs/libglog_la-raw_logging.o
libtool: compile:  x86_64-pld-linux-g++ -DHAVE_CONFIG_H -I. -I./src -I./src -Wall -Wwrite-strings -Woverloaded-virtual -Wno-sign-compare -DNO_FRAME_POINTER -DNDEBUG -O2 -fwrapv -pipe -Wformat -Werror=format-security -gdwarf-4 -fno-debug-types-section -fvar-tracking-assignments -g2 -Wp,-D_FORTIFY_SOURCE=2 -fstack-protector-strong --param=ssp-buffer-size=4 -fPIC -march=x86-64 -gdwarf-4 -fno-debug-types-section -fvar-tracking-assignments -g2 -MT src/libglog_la-raw_logging.lo -MD -MP -MF src/.deps/libglog_la-raw_logging.Tpo -c src/raw_logging.cc -o src/libglog_la-raw_logging.o >/dev/null 2>&1
mv -f src/.deps/libglog_la-raw_logging.Tpo src/.deps/libglog_la-raw_logging.Plo
/bin/sh ./libtool  --tag=CXX   --mode=compile x86_64-pld-linux-g++ -DHAVE_CONFIG_H -I. -I./src  -I./src     -Wall -Wwrite-strings -Woverloaded-virtual -Wno-sign-compare  -DNO_FRAME_POINTER  -DNDEBUG -O2 -fwrapv -pipe -Wformat -Werror=format-security -gdwarf-4 -fno-debug-types-section -fvar-tracking-assignments -g2 -Wp,-D_FORTIFY_SOURCE=2 -fstack-protector-strong --param=ssp-buffer-size=4 -fPIC -march=x86-64 -gdwarf-4 -fno-debug-types-section -fvar-tracking-assignments -g2  -MT src/libglog_la-utilities.lo -MD -MP -MF src/.deps/libglog_la-utilities.Tpo -c -o src/libglog_la-utilities.lo `test -f 'src/utilities.cc' || echo './'`src/utilities.cc
libtool: compile:  x86_64-pld-linux-g++ -DHAVE_CONFIG_H -I. -I./src -I./src -Wall -Wwrite-strings -Woverloaded-virtual -Wno-sign-compare -DNO_FRAME_POINTER -DNDEBUG -O2 -fwrapv -pipe -Wformat -Werror=format-security -gdwarf-4 -fno-debug-types-section -fvar-tracking-assignments -g2 -Wp,-D_FORTIFY_SOURCE=2 -fstack-protector-strong --param=ssp-buffer-size=4 -fPIC -march=x86-64 -gdwarf-4 -fno-debug-types-section -fvar-tracking-assignments -g2 -MT src/libglog_la-utilities.lo -MD -MP -MF src/.deps/libglog_la-utilities.Tpo -c src/utilities.cc  -fPIC -DPIC -o src/.libs/libglog_la-utilities.o
libtool: compile:  x86_64-pld-linux-g++ -DHAVE_CONFIG_H -I. -I./src -I./src -Wall -Wwrite-strings -Woverloaded-virtual -Wno-sign-compare -DNO_FRAME_POINTER -DNDEBUG -O2 -fwrapv -pipe -Wformat -Werror=format-security -gdwarf-4 -fno-debug-types-section -fvar-tracking-assignments -g2 -Wp,-D_FORTIFY_SOURCE=2 -fstack-protector-strong --param=ssp-buffer-size=4 -fPIC -march=x86-64 -gdwarf-4 -fno-debug-types-section -fvar-tracking-assignments -g2 -MT src/libglog_la-utilities.lo -MD -MP -MF src/.deps/libglog_la-utilities.Tpo -c src/utilities.cc -o src/libglog_la-utilities.o >/dev/null 2>&1
mv -f src/.deps/libglog_la-utilities.Tpo src/.deps/libglog_la-utilities.Plo
/bin/sh ./libtool  --tag=CXX   --mode=compile x86_64-pld-linux-g++ -DHAVE_CONFIG_H -I. -I./src  -I./src     -Wall -Wwrite-strings -Woverloaded-virtual -Wno-sign-compare  -DNO_FRAME_POINTER  -DNDEBUG -O2 -fwrapv -pipe -Wformat -Werror=format-security -gdwarf-4 -fno-debug-types-section -fvar-tracking-assignments -g2 -Wp,-D_FORTIFY_SOURCE=2 -fstack-protector-strong --param=ssp-buffer-size=4 -fPIC -march=x86-64 -gdwarf-4 -fno-debug-types-section -fvar-tracking-assignments -g2  -MT src/libglog_la-vlog_is_on.lo -MD -MP -MF src/.deps/libglog_la-vlog_is_on.Tpo -c -o src/libglog_la-vlog_is_on.lo `test -f 'src/vlog_is_on.cc' || echo './'`src/vlog_is_on.cc
libtool: compile:  x86_64-pld-linux-g++ -DHAVE_CONFIG_H -I. -I./src -I./src -Wall -Wwrite-strings -Woverloaded-virtual -Wno-sign-compare -DNO_FRAME_POINTER -DNDEBUG -O2 -fwrapv -pipe -Wformat -Werror=format-security -gdwarf-4 -fno-debug-types-section -fvar-tracking-assignments -g2 -Wp,-D_FORTIFY_SOURCE=2 -fstack-protector-strong --param=ssp-buffer-size=4 -fPIC -march=x86-64 -gdwarf-4 -fno-debug-types-section -fvar-tracking-assignments -g2 -MT src/libglog_la-vlog_is_on.lo -MD -MP -MF src/.deps/libglog_la-vlog_is_on.Tpo -c src/vlog_is_on.cc  -fPIC -DPIC -o src/.libs/libglog_la-vlog_is_on.o
libtool: compile:  x86_64-pld-linux-g++ -DHAVE_CONFIG_H -I. -I./src -I./src -Wall -Wwrite-strings -Woverloaded-virtual -Wno-sign-compare -DNO_FRAME_POINTER -DNDEBUG -O2 -fwrapv -pipe -Wformat -Werror=format-security -gdwarf-4 -fno-debug-types-section -fvar-tracking-assignments -g2 -Wp,-D_FORTIFY_SOURCE=2 -fstack-protector-strong --param=ssp-buffer-size=4 -fPIC -march=x86-64 -gdwarf-4 -fno-debug-types-section -fvar-tracking-assignments -g2 -MT src/libglog_la-vlog_is_on.lo -MD -MP -MF src/.deps/libglog_la-vlog_is_on.Tpo -c src/vlog_is_on.cc -o src/libglog_la-vlog_is_on.o >/dev/null 2>&1
mv -f src/.deps/libglog_la-vlog_is_on.Tpo src/.deps/libglog_la-vlog_is_on.Plo
/bin/sh ./libtool  --tag=CXX   --mode=compile x86_64-pld-linux-g++ -DHAVE_CONFIG_H -I. -I./src  -I./src     -Wall -Wwrite-strings -Woverloaded-virtual -Wno-sign-compare  -DNO_FRAME_POINTER  -DNDEBUG -O2 -fwrapv -pipe -Wformat -Werror=format-security -gdwarf-4 -fno-debug-types-section -fvar-tracking-assignments -g2 -Wp,-D_FORTIFY_SOURCE=2 -fstack-protector-strong --param=ssp-buffer-size=4 -fPIC -march=x86-64 -gdwarf-4 -fno-debug-types-section -fvar-tracking-assignments -g2  -MT src/libglog_la-demangle.lo -MD -MP -MF src/.deps/libglog_la-demangle.Tpo -c -o src/libglog_la-demangle.lo `test -f 'src/demangle.cc' || echo './'`src/demangle.cc
libtool: compile:  x86_64-pld-linux-g++ -DHAVE_CONFIG_H -I. -I./src -I./src -Wall -Wwrite-strings -Woverloaded-virtual -Wno-sign-compare -DNO_FRAME_POINTER -DNDEBUG -O2 -fwrapv -pipe -Wformat -Werror=format-security -gdwarf-4 -fno-debug-types-section -fvar-tracking-assignments -g2 -Wp,-D_FORTIFY_SOURCE=2 -fstack-protector-strong --param=ssp-buffer-size=4 -fPIC -march=x86-64 -gdwarf-4 -fno-debug-types-section -fvar-tracking-assignments -g2 -MT src/libglog_la-demangle.lo -MD -MP -MF src/.deps/libglog_la-demangle.Tpo -c src/demangle.cc  -fPIC -DPIC -o src/.libs/libglog_la-demangle.o
libtool: compile:  x86_64-pld-linux-g++ -DHAVE_CONFIG_H -I. -I./src -I./src -Wall -Wwrite-strings -Woverloaded-virtual -Wno-sign-compare -DNO_FRAME_POINTER -DNDEBUG -O2 -fwrapv -pipe -Wformat -Werror=format-security -gdwarf-4 -fno-debug-types-section -fvar-tracking-assignments -g2 -Wp,-D_FORTIFY_SOURCE=2 -fstack-protector-strong --param=ssp-buffer-size=4 -fPIC -march=x86-64 -gdwarf-4 -fno-debug-types-section -fvar-tracking-assignments -g2 -MT src/libglog_la-demangle.lo -MD -MP -MF src/.deps/libglog_la-demangle.Tpo -c src/demangle.cc -o src/libglog_la-demangle.o >/dev/null 2>&1
mv -f src/.deps/libglog_la-demangle.Tpo src/.deps/libglog_la-demangle.Plo
/bin/sh ./libtool  --tag=CXX   --mode=compile x86_64-pld-linux-g++ -DHAVE_CONFIG_H -I. -I./src  -I./src     -Wall -Wwrite-strings -Woverloaded-virtual -Wno-sign-compare  -DNO_FRAME_POINTER  -DNDEBUG -O2 -fwrapv -pipe -Wformat -Werror=format-security -gdwarf-4 -fno-debug-types-section -fvar-tracking-assignments -g2 -Wp,-D_FORTIFY_SOURCE=2 -fstack-protector-strong --param=ssp-buffer-size=4 -fPIC -march=x86-64 -gdwarf-4 -fno-debug-types-section -fvar-tracking-assignments -g2  -MT src/libglog_la-signalhandler.lo -MD -MP -MF src/.deps/libglog_la-signalhandler.Tpo -c -o src/libglog_la-signalhandler.lo `test -f 'src/signalhandler.cc' || echo './'`src/signalhandler.cc
libtool: compile:  x86_64-pld-linux-g++ -DHAVE_CONFIG_H -I. -I./src -I./src -Wall -Wwrite-strings -Woverloaded-virtual -Wno-sign-compare -DNO_FRAME_POINTER -DNDEBUG -O2 -fwrapv -pipe -Wformat -Werror=format-security -gdwarf-4 -fno-debug-types-section -fvar-tracking-assignments -g2 -Wp,-D_FORTIFY_SOURCE=2 -fstack-protector-strong --param=ssp-buffer-size=4 -fPIC -march=x86-64 -gdwarf-4 -fno-debug-types-section -fvar-tracking-assignments -g2 -MT src/libglog_la-signalhandler.lo -MD -MP -MF src/.deps/libglog_la-signalhandler.Tpo -c src/signalhandler.cc  -fPIC -DPIC -o src/.libs/libglog_la-signalhandler.o
libtool: compile:  x86_64-pld-linux-g++ -DHAVE_CONFIG_H -I. -I./src -I./src -Wall -Wwrite-strings -Woverloaded-virtual -Wno-sign-compare -DNO_FRAME_POINTER -DNDEBUG -O2 -fwrapv -pipe -Wformat -Werror=format-security -gdwarf-4 -fno-debug-types-section -fvar-tracking-assignments -g2 -Wp,-D_FORTIFY_SOURCE=2 -fstack-protector-strong --param=ssp-buffer-size=4 -fPIC -march=x86-64 -gdwarf-4 -fno-debug-types-section -fvar-tracking-assignments -g2 -MT src/libglog_la-signalhandler.lo -MD -MP -MF src/.deps/libglog_la-signalhandler.Tpo -c src/signalhandler.cc -o src/libglog_la-signalhandler.o >/dev/null 2>&1
mv -f src/.deps/libglog_la-signalhandler.Tpo src/.deps/libglog_la-signalhandler.Plo
/bin/sh ./libtool  --tag=CXX   --mode=compile x86_64-pld-linux-g++ -DHAVE_CONFIG_H -I. -I./src  -I./src     -Wall -Wwrite-strings -Woverloaded-virtual -Wno-sign-compare  -DNO_FRAME_POINTER  -DNDEBUG -O2 -fwrapv -pipe -Wformat -Werror=format-security -gdwarf-4 -fno-debug-types-section -fvar-tracking-assignments -g2 -Wp,-D_FORTIFY_SOURCE=2 -fstack-protector-strong --param=ssp-buffer-size=4 -fPIC -march=x86-64 -gdwarf-4 -fno-debug-types-section -fvar-tracking-assignments -g2  -MT src/libglog_la-symbolize.lo -MD -MP -MF src/.deps/libglog_la-symbolize.Tpo -c -o src/libglog_la-symbolize.lo `test -f 'src/symbolize.cc' || echo './'`src/symbolize.cc
libtool: compile:  x86_64-pld-linux-g++ -DHAVE_CONFIG_H -I. -I./src -I./src -Wall -Wwrite-strings -Woverloaded-virtual -Wno-sign-compare -DNO_FRAME_POINTER -DNDEBUG -O2 -fwrapv -pipe -Wformat -Werror=format-security -gdwarf-4 -fno-debug-types-section -fvar-tracking-assignments -g2 -Wp,-D_FORTIFY_SOURCE=2 -fstack-protector-strong --param=ssp-buffer-size=4 -fPIC -march=x86-64 -gdwarf-4 -fno-debug-types-section -fvar-tracking-assignments -g2 -MT src/libglog_la-symbolize.lo -MD -MP -MF src/.deps/libglog_la-symbolize.Tpo -c src/symbolize.cc  -fPIC -DPIC -o src/.libs/libglog_la-symbolize.o
libtool: compile:  x86_64-pld-linux-g++ -DHAVE_CONFIG_H -I. -I./src -I./src -Wall -Wwrite-strings -Woverloaded-virtual -Wno-sign-compare -DNO_FRAME_POINTER -DNDEBUG -O2 -fwrapv -pipe -Wformat -Werror=format-security -gdwarf-4 -fno-debug-types-section -fvar-tracking-assignments -g2 -Wp,-D_FORTIFY_SOURCE=2 -fstack-protector-strong --param=ssp-buffer-size=4 -fPIC -march=x86-64 -gdwarf-4 -fno-debug-types-section -fvar-tracking-assignments -g2 -MT src/libglog_la-symbolize.lo -MD -MP -MF src/.deps/libglog_la-symbolize.Tpo -c src/symbolize.cc -o src/libglog_la-symbolize.o >/dev/null 2>&1
mv -f src/.deps/libglog_la-symbolize.Tpo src/.deps/libglog_la-symbolize.Plo
x86_64-pld-linux-g++ -DHAVE_CONFIG_H -I. -I./src  -I./src  -pthread -I/usr/include -pthread -I/usr/include -I/usr/include -pthread   -Wall -Wwrite-strings -Woverloaded-virtual -Wno-sign-compare  -DNO_FRAME_POINTER  -O2 -fwrapv -pipe -Wformat -Werror=format-security -gdwarf-4 -fno-debug-types-section -fvar-tracking-assignments -g2 -Wp,-D_FORTIFY_SOURCE=2 -fstack-protector-strong --param=ssp-buffer-size=4 -fPIC -march=x86-64 -gdwarf-4 -fno-debug-types-section -fvar-tracking-assignments -g2  -MT src/stacktrace_unittest-stacktrace_unittest.o -MD -MP -MF src/.deps/stacktrace_unittest-stacktrace_unittest.Tpo -c -o src/stacktrace_unittest-stacktrace_unittest.o `test -f 'src/stacktrace_unittest.cc' || echo './'`src/stacktrace_unittest.cc
mv -f src/.deps/stacktrace_unittest-stacktrace_unittest.Tpo src/.deps/stacktrace_unittest-stacktrace_unittest.Po
x86_64-pld-linux-g++ -DHAVE_CONFIG_H -I. -I./src  -I./src  -pthread -I/usr/include -pthread -I/usr/include -I/usr/include -pthread   -Wall -Wwrite-strings -Woverloaded-virtual -Wno-sign-compare  -DNO_FRAME_POINTER  -O2 -fwrapv -pipe -Wformat -Werror=format-security -gdwarf-4 -fno-debug-types-section -fvar-tracking-assignments -g2 -Wp,-D_FORTIFY_SOURCE=2 -fstack-protector-strong --param=ssp-buffer-size=4 -fPIC -march=x86-64 -gdwarf-4 -fno-debug-types-section -fvar-tracking-assignments -g2  -MT src/demangle_unittest-demangle_unittest.o -MD -MP -MF src/.deps/demangle_unittest-demangle_unittest.Tpo -c -o src/demangle_unittest-demangle_unittest.o `test -f 'src/demangle_unittest.cc' || echo './'`src/demangle_unittest.cc
In file included from src/demangle_unittest.cc:41:0:
src/googletest.h:579:33: warning: dynamic exception specifications are deprecated in C++11 [-Wdeprecated]
 void* operator new(size_t size) throw(std::bad_alloc) {
                                 ^~~~~
src/googletest.h:586:35: warning: dynamic exception specifications are deprecated in C++11 [-Wdeprecated]
 void* operator new[](size_t size) throw(std::bad_alloc) {
                                   ^~~~~
mv -f src/.deps/demangle_unittest-demangle_unittest.Tpo src/.deps/demangle_unittest-demangle_unittest.Po
x86_64-pld-linux-g++ -DHAVE_CONFIG_H -I. -I./src  -I./src  -pthread -I/usr/include -pthread -I/usr/include -I/usr/include -pthread   -Wall -Wwrite-strings -Woverloaded-virtual -Wno-sign-compare  -DNO_FRAME_POINTER  -O2 -fwrapv -pipe -Wformat -Werror=format-security -gdwarf-4 -fno-debug-types-section -fvar-tracking-assignments -g2 -Wp,-D_FORTIFY_SOURCE=2 -fstack-protector-strong --param=ssp-buffer-size=4 -fPIC -march=x86-64 -gdwarf-4 -fno-debug-types-section -fvar-tracking-assignments -g2  -MT src/symbolize_unittest-symbolize_unittest.o -MD -MP -MF src/.deps/symbolize_unittest-symbolize_unittest.Tpo -c -o src/symbolize_unittest-symbolize_unittest.o `test -f 'src/symbolize_unittest.cc' || echo './'`src/symbolize_unittest.cc
In file included from src/symbolize_unittest.cc:41:0:
src/googletest.h:579:33: warning: dynamic exception specifications are deprecated in C++11 [-Wdeprecated]
 void* operator new(size_t size) throw(std::bad_alloc) {
                                 ^~~~~
src/googletest.h:586:35: warning: dynamic exception specifications are deprecated in C++11 [-Wdeprecated]
 void* operator new[](size_t size) throw(std::bad_alloc) {
                                   ^~~~~
mv -f src/.deps/symbolize_unittest-symbolize_unittest.Tpo src/.deps/symbolize_unittest-symbolize_unittest.Po
/bin/sh ./libtool  --tag=CXX   --mode=compile x86_64-pld-linux-g++ -DHAVE_CONFIG_H -I. -I./src  -I./src     -Wall -Wwrite-strings -Woverloaded-virtual -Wno-sign-compare  -DNO_FRAME_POINTER  -DNDEBUG -O2 -fwrapv -pipe -Wformat -Werror=format-security -gdwarf-4 -fno-debug-types-section -fvar-tracking-assignments -g2 -Wp,-D_FORTIFY_SOURCE=2 -fstack-protector-strong --param=ssp-buffer-size=4 -fPIC -march=x86-64 -gdwarf-4 -fno-debug-types-section -fvar-tracking-assignments -g2  -MT src/libglog_la-logging.lo -MD -MP -MF src/.deps/libglog_la-logging.Tpo -c -o src/libglog_la-logging.lo `test -f 'src/logging.cc' || echo './'`src/logging.cc
libtool: compile:  x86_64-pld-linux-g++ -DHAVE_CONFIG_H -I. -I./src -I./src -Wall -Wwrite-strings -Woverloaded-virtual -Wno-sign-compare -DNO_FRAME_POINTER -DNDEBUG -O2 -fwrapv -pipe -Wformat -Werror=format-security -gdwarf-4 -fno-debug-types-section -fvar-tracking-assignments -g2 -Wp,-D_FORTIFY_SOURCE=2 -fstack-protector-strong --param=ssp-buffer-size=4 -fPIC -march=x86-64 -gdwarf-4 -fno-debug-types-section -fvar-tracking-assignments -g2 -MT src/libglog_la-logging.lo -MD -MP -MF src/.deps/libglog_la-logging.Tpo -c src/logging.cc  -fPIC -DPIC -o src/.libs/libglog_la-logging.o
libtool: compile:  x86_64-pld-linux-g++ -DHAVE_CONFIG_H -I. -I./src -I./src -Wall -Wwrite-strings -Woverloaded-virtual -Wno-sign-compare -DNO_FRAME_POINTER -DNDEBUG -O2 -fwrapv -pipe -Wformat -Werror=format-security -gdwarf-4 -fno-debug-types-section -fvar-tracking-assignments -g2 -Wp,-D_FORTIFY_SOURCE=2 -fstack-protector-strong --param=ssp-buffer-size=4 -fPIC -march=x86-64 -gdwarf-4 -fno-debug-types-section -fvar-tracking-assignments -g2 -MT src/libglog_la-logging.lo -MD -MP -MF src/.deps/libglog_la-logging.Tpo -c src/logging.cc -o src/libglog_la-logging.o >/dev/null 2>&1
mv -f src/.deps/libglog_la-logging.Tpo src/.deps/libglog_la-logging.Plo
x86_64-pld-linux-g++ -DHAVE_CONFIG_H -I. -I./src  -I./src  -pthread -I/usr/include -pthread -I/usr/include -I/usr/include -pthread   -Wall -Wwrite-strings -Woverloaded-virtual -Wno-sign-compare  -DNO_FRAME_POINTER  -O2 -fwrapv -pipe -Wformat -Werror=format-security -gdwarf-4 -fno-debug-types-section -fvar-tracking-assignments -g2 -Wp,-D_FORTIFY_SOURCE=2 -fstack-protector-strong --param=ssp-buffer-size=4 -fPIC -march=x86-64 -gdwarf-4 -fno-debug-types-section -fvar-tracking-assignments -g2  -MT src/utilities_unittest-utilities_unittest.o -MD -MP -MF src/.deps/utilities_unittest-utilities_unittest.Tpo -c -o src/utilities_unittest-utilities_unittest.o `test -f 'src/utilities_unittest.cc' || echo './'`src/utilities_unittest.cc
In file included from src/utilities_unittest.cc:32:0:
src/googletest.h:579:33: warning: dynamic exception specifications are deprecated in C++11 [-Wdeprecated]
 void* operator new(size_t size) throw(std::bad_alloc) {
                                 ^~~~~
src/googletest.h:586:35: warning: dynamic exception specifications are deprecated in C++11 [-Wdeprecated]
 void* operator new[](size_t size) throw(std::bad_alloc) {
                                   ^~~~~
mv -f src/.deps/utilities_unittest-utilities_unittest.Tpo src/.deps/utilities_unittest-utilities_unittest.Po
x86_64-pld-linux-g++ -DHAVE_CONFIG_H -I. -I./src  -I./src  -pthread -I/usr/include -pthread -I/usr/include -I/usr/include -pthread   -Wall -Wwrite-strings -Woverloaded-virtual -Wno-sign-compare  -DNO_FRAME_POINTER  -O2 -fwrapv -pipe -Wformat -Werror=format-security -gdwarf-4 -fno-debug-types-section -fvar-tracking-assignments -g2 -Wp,-D_FORTIFY_SOURCE=2 -fstack-protector-strong --param=ssp-buffer-size=4 -fPIC -march=x86-64 -gdwarf-4 -fno-debug-types-section -fvar-tracking-assignments -g2  -MT src/logging_striptest0-logging_striptest_main.o -MD -MP -MF src/.deps/logging_striptest0-logging_striptest_main.Tpo -c -o src/logging_striptest0-logging_striptest_main.o `test -f 'src/logging_striptest_main.cc' || echo './'`src/logging_striptest_main.cc
mv -f src/.deps/logging_striptest0-logging_striptest_main.Tpo src/.deps/logging_striptest0-logging_striptest_main.Po
x86_64-pld-linux-g++ -DHAVE_CONFIG_H -I. -I./src  -I./src  -pthread -I/usr/include -pthread -I/usr/include -I/usr/include -pthread   -Wall -Wwrite-strings -Woverloaded-virtual -Wno-sign-compare  -DNO_FRAME_POINTER  -O2 -fwrapv -pipe -Wformat -Werror=format-security -gdwarf-4 -fno-debug-types-section -fvar-tracking-assignments -g2 -Wp,-D_FORTIFY_SOURCE=2 -fstack-protector-strong --param=ssp-buffer-size=4 -fPIC -march=x86-64 -gdwarf-4 -fno-debug-types-section -fvar-tracking-assignments -g2  -MT src/logging_striptest2-logging_striptest2.o -MD -MP -MF src/.deps/logging_striptest2-logging_striptest2.Tpo -c -o src/logging_striptest2-logging_striptest2.o `test -f 'src/logging_striptest2.cc' || echo './'`src/logging_striptest2.cc
mv -f src/.deps/logging_striptest2-logging_striptest2.Tpo src/.deps/logging_striptest2-logging_striptest2.Po
x86_64-pld-linux-g++ -DHAVE_CONFIG_H -I. -I./src  -I./src  -pthread -I/usr/include -pthread -I/usr/include -I/usr/include -pthread   -Wall -Wwrite-strings -Woverloaded-virtual -Wno-sign-compare  -DNO_FRAME_POINTER  -O2 -fwrapv -pipe -Wformat -Werror=format-security -gdwarf-4 -fno-debug-types-section -fvar-tracking-assignments -g2 -Wp,-D_FORTIFY_SOURCE=2 -fstack-protector-strong --param=ssp-buffer-size=4 -fPIC -march=x86-64 -gdwarf-4 -fno-debug-types-section -fvar-tracking-assignments -g2  -MT src/logging_striptest10-logging_striptest10.o -MD -MP -MF src/.deps/logging_striptest10-logging_striptest10.Tpo -c -o src/logging_striptest10-logging_striptest10.o `test -f 'src/logging_striptest10.cc' || echo './'`src/logging_striptest10.cc
mv -f src/.deps/logging_striptest10-logging_striptest10.Tpo src/.deps/logging_striptest10-logging_striptest10.Po
x86_64-pld-linux-g++ -DHAVE_CONFIG_H -I. -I./src  -I./src  -pthread -I/usr/include -pthread -I/usr/include -I/usr/include -pthread   -Wall -Wwrite-strings -Woverloaded-virtual -Wno-sign-compare  -DNO_FRAME_POINTER  -O2 -fwrapv -pipe -Wformat -Werror=format-security -gdwarf-4 -fno-debug-types-section -fvar-tracking-assignments -g2 -Wp,-D_FORTIFY_SOURCE=2 -fstack-protector-strong --param=ssp-buffer-size=4 -fPIC -march=x86-64 -gdwarf-4 -fno-debug-types-section -fvar-tracking-assignments -g2  -MT src/signalhandler_unittest-signalhandler_unittest.o -MD -MP -MF src/.deps/signalhandler_unittest-signalhandler_unittest.Tpo -c -o src/signalhandler_unittest-signalhandler_unittest.o `test -f 'src/signalhandler_unittest.cc' || echo './'`src/signalhandler_unittest.cc
mv -f src/.deps/signalhandler_unittest-signalhandler_unittest.Tpo src/.deps/signalhandler_unittest-signalhandler_unittest.Po
/bin/sh ./libtool  --tag=CXX   --mode=link x86_64-pld-linux-g++    -Wall -Wwrite-strings -Woverloaded-virtual -Wno-sign-compare  -DNO_FRAME_POINTER  -DNDEBUG -O2 -fwrapv -pipe -Wformat -Werror=format-security -gdwarf-4 -fno-debug-types-section -fvar-tracking-assignments -g2 -Wp,-D_FORTIFY_SOURCE=2 -fstack-protector-strong --param=ssp-buffer-size=4 -fPIC -march=x86-64 -gdwarf-4 -fno-debug-types-section -fvar-tracking-assignments -g2    -Wl,--as-needed -Wl,--no-copy-dt-needed-entries -Wl,-z,relro -Wl,-z,combreloc  -o libglog.la -rpath /usr/lib64  src/libglog_la-logging.lo src/libglog_la-raw_logging.lo src/libglog_la-vlog_is_on.lo src/libglog_la-utilities.lo src/libglog_la-demangle.lo src/libglog_la-symbolize.lo src/libglog_la-signalhandler.lo   -lgflags -lunwind -lpthread 
libtool: link: x86_64-pld-linux-g++  -fPIC -DPIC -shared -nostdlib  -O2 -gdwarf-4 -g2 -fstack-protector-strong -march=x86-64 -gdwarf-4 -g2 -Wl,--as-needed -Wl,--no-copy-dt-needed-entries -Wl,-z -Wl,relro -Wl,-z -Wl,combreloc   -pthread /usr/lib64/gcc/x86_64-pld-linux/7.3.0/../../../../lib64/crti.o /usr/lib64/gcc/x86_64-pld-linux/7.3.0/crtbeginS.o  src/.libs/libglog_la-logging.o src/.libs/libglog_la-raw_logging.o src/.libs/libglog_la-vlog_is_on.o src/.libs/libglog_la-utilities.o src/.libs/libglog_la-demangle.o src/.libs/libglog_la-symbolize.o src/.libs/libglog_la-signalhandler.o   -lgflags /usr/lib64/libunwind.so -L/usr/lib64 /usr/lib64/liblzma.so -lpthread -L/usr/lib64/gcc/x86_64-pld-linux/7.3.0 -L/usr/lib64/gcc/x86_64-pld-linux/7.3.0/../../../../lib64 -L/lib/../lib64 -L/usr/lib/../lib64 -L/usr/lib64/gcc/x86_64-pld-linux/7.3.0/../../.. /usr/lib64/libstdc++.so -lm -lc -lgcc_s /usr/lib64/gcc/x86_64-pld-linux/7.3.0/crtendS.o /usr/lib64/gcc/x86_64-pld-linux/7.3.0/../../../../lib64/crtn.o -Wl,-soname -Wl,libglog.so.0 -o .libs/libglog.so.0.0.0
libtool: link: (cd ".libs" && rm -f "libglog.so.0" && ln -s "libglog.so.0.0.0" "libglog.so.0")
libtool: link: (cd ".libs" && rm -f "libglog.so" && ln -s "libglog.so.0.0.0" "libglog.so")
libtool: link: ar cru .libs/libglog.a  src/libglog_la-logging.o src/libglog_la-raw_logging.o src/libglog_la-vlog_is_on.o src/libglog_la-utilities.o src/libglog_la-demangle.o src/libglog_la-symbolize.o src/libglog_la-signalhandler.o
libtool: link: ranlib .libs/libglog.a
libtool: link: ( cd ".libs" && rm -f "libglog.la" && ln -s "../libglog.la" "libglog.la" )
x86_64-pld-linux-g++ -DHAVE_CONFIG_H -I. -I./src  -I./src  -pthread -I/usr/include -pthread -I/usr/include -I/usr/include -pthread   -Wall -Wwrite-strings -Woverloaded-virtual -Wno-sign-compare  -DNO_FRAME_POINTER  -O2 -fwrapv -pipe -Wformat -Werror=format-security -gdwarf-4 -fno-debug-types-section -fvar-tracking-assignments -g2 -Wp,-D_FORTIFY_SOURCE=2 -fstack-protector-strong --param=ssp-buffer-size=4 -fPIC -march=x86-64 -gdwarf-4 -fno-debug-types-section -fvar-tracking-assignments -g2  -MT src/stl_logging_unittest-stl_logging_unittest.o -MD -MP -MF src/.deps/stl_logging_unittest-stl_logging_unittest.Tpo -c -o src/stl_logging_unittest-stl_logging_unittest.o `test -f 'src/stl_logging_unittest.cc' || echo './'`src/stl_logging_unittest.cc
In file included from /usr/include/c++/7.3.0/ext/hash_set:60:0,
                 from src/glog/stl_logging.h:73,
                 from src/stl_logging_unittest.cc:62:
/usr/include/c++/7.3.0/backward/backward_warning.h:32:2: warning: #warning This file includes at least one deprecated or antiquated header which may be removed without further notice at a future date. Please use a non-deprecated interface with equivalent functionality instead. For a listing of replacement headers and interfaces, consult the file backward_warning.h. To disable this warning use -Wno-deprecated. [-Wcpp]
 #warning \
  ^~~~~~~
In file included from src/stl_logging_unittest.cc:63:0:
src/googletest.h:579:33: warning: dynamic exception specifications are deprecated in C++11 [-Wdeprecated]
 void* operator new(size_t size) throw(std::bad_alloc) {
                                 ^~~~~
src/googletest.h:586:35: warning: dynamic exception specifications are deprecated in C++11 [-Wdeprecated]
 void* operator new[](size_t size) throw(std::bad_alloc) {
                                   ^~~~~
mv -f src/.deps/stl_logging_unittest-stl_logging_unittest.Tpo src/.deps/stl_logging_unittest-stl_logging_unittest.Po
/bin/sh ./libtool  --tag=CXX   --mode=link x86_64-pld-linux-g++ -pthread -I/usr/include -pthread -I/usr/include -I/usr/include -pthread   -Wall -Wwrite-strings -Woverloaded-virtual -Wno-sign-compare  -DNO_FRAME_POINTER  -O2 -fwrapv -pipe -Wformat -Werror=format-security -gdwarf-4 -fno-debug-types-section -fvar-tracking-assignments -g2 -Wp,-D_FORTIFY_SOURCE=2 -fstack-protector-strong --param=ssp-buffer-size=4 -fPIC -march=x86-64 -gdwarf-4 -fno-debug-types-section -fvar-tracking-assignments -g2  -pthread -Wl,--as-needed -Wl,--no-copy-dt-needed-entries -Wl,-z,relro -Wl,-z,combreloc  -o stacktrace_unittest  src/stacktrace_unittest-stacktrace_unittest.o  libglog.la  -lgflags -lunwind -lpthread 
libtool: link: x86_64-pld-linux-g++ -pthread -I/usr/include -pthread -I/usr/include -I/usr/include -pthread -Wall -Wwrite-strings -Woverloaded-virtual -Wno-sign-compare -DNO_FRAME_POINTER -O2 -fwrapv -pipe -Wformat -Werror=format-security -gdwarf-4 -fno-debug-types-section -fvar-tracking-assignments -g2 -Wp,-D_FORTIFY_SOURCE=2 -fstack-protector-strong --param=ssp-buffer-size=4 -fPIC -march=x86-64 -gdwarf-4 -fno-debug-types-section -fvar-tracking-assignments -g2 -pthread -Wl,--as-needed -Wl,--no-copy-dt-needed-entries -Wl,-z -Wl,relro -Wl,-z -Wl,combreloc -o .libs/stacktrace_unittest src/stacktrace_unittest-stacktrace_unittest.o  ./.libs/libglog.so /usr/lib64/libstdc++.so -lm -lgflags /usr/lib64/libunwind.so -lc -lgcc_s /usr/lib64/liblzma.so -lpthread -pthread
/bin/sh ./libtool  --tag=CXX   --mode=link x86_64-pld-linux-g++ -pthread -I/usr/include -pthread -I/usr/include -I/usr/include -pthread   -Wall -Wwrite-strings -Woverloaded-virtual -Wno-sign-compare  -DNO_FRAME_POINTER  -O2 -fwrapv -pipe -Wformat -Werror=format-security -gdwarf-4 -fno-debug-types-section -fvar-tracking-assignments -g2 -Wp,-D_FORTIFY_SOURCE=2 -fstack-protector-strong --param=ssp-buffer-size=4 -fPIC -march=x86-64 -gdwarf-4 -fno-debug-types-section -fvar-tracking-assignments -g2  -pthread -Wl,--as-needed -Wl,--no-copy-dt-needed-entries -Wl,-z,relro -Wl,-z,combreloc  -o demangle_unittest  src/demangle_unittest-demangle_unittest.o  libglog.la  -lgflags -lunwind -L/usr/lib64 -lgtest -pthread -L/usr/lib64 -L/usr/lib64 -lgmock -lgtest -pthread -lgflags -lpthread 
libtool: link: x86_64-pld-linux-g++ -pthread -I/usr/include -pthread -I/usr/include -I/usr/include -pthread -Wall -Wwrite-strings -Woverloaded-virtual -Wno-sign-compare -DNO_FRAME_POINTER -O2 -fwrapv -pipe -Wformat -Werror=format-security -gdwarf-4 -fno-debug-types-section -fvar-tracking-assignments -g2 -Wp,-D_FORTIFY_SOURCE=2 -fstack-protector-strong --param=ssp-buffer-size=4 -fPIC -march=x86-64 -gdwarf-4 -fno-debug-types-section -fvar-tracking-assignments -g2 -pthread -Wl,--as-needed -Wl,--no-copy-dt-needed-entries -Wl,-z -Wl,relro -Wl,-z -Wl,combreloc -o .libs/demangle_unittest src/demangle_unittest-demangle_unittest.o -pthread -pthread  ./.libs/libglog.so /usr/lib64/libunwind.so -lc -lgcc_s /usr/lib64/liblzma.so -L/usr/lib64 -lgmock /usr/lib64/libgtest.so /usr/lib64/libstdc++.so -lm -lgflags -lpthread -pthread
/usr/bin/ld: cannot find -lgmock
collect2: error: ld returned 1 exit status
make: *** [Makefile:1066: demangle_unittest] Error 1
make: *** Waiting for unfinished jobs....
x86_64-pld-linux-g++ -DHAVE_CONFIG_H -I. -I./src  -I./src  -pthread -I/usr/include -pthread -I/usr/include -I/usr/include -pthread   -Wall -Wwrite-strings -Woverloaded-virtual -Wno-sign-compare  -DNO_FRAME_POINTER  -O2 -fwrapv -pipe -Wformat -Werror=format-security -gdwarf-4 -fno-debug-types-section -fvar-tracking-assignments -g2 -Wp,-D_FORTIFY_SOURCE=2 -fstack-protector-strong --param=ssp-buffer-size=4 -fPIC -march=x86-64 -gdwarf-4 -fno-debug-types-section -fvar-tracking-assignments -g2  -MT src/logging_unittest-logging_unittest.o -MD -MP -MF src/.deps/logging_unittest-logging_unittest.Tpo -c -o src/logging_unittest-logging_unittest.o `test -f 'src/logging_unittest.cc' || echo './'`src/logging_unittest.cc
In file included from src/logging_unittest.cc:58:0:
src/googletest.h:579:33: warning: dynamic exception specifications are deprecated in C++11 [-Wdeprecated]
 void* operator new(size_t size) throw(std::bad_alloc) {
                                 ^~~~~
src/googletest.h:586:35: warning: dynamic exception specifications are deprecated in C++11 [-Wdeprecated]
 void* operator new[](size_t size) throw(std::bad_alloc) {
                                   ^~~~~
In file included from src/utilities.h:82:0,
                 from src/logging_unittest.cc:33:
src/logging_unittest.cc: In function 'void TestLogging(bool)':
src/glog/logging.h:943:30: warning: typedef 'INVALID_REQUESTED_LOG_SEVERITY' locally defined but not used [-Wunused-local-typedefs]
                              INVALID_REQUESTED_LOG_SEVERITY);           \
                              ^
src/glog/logging.h:938:73: note: in definition of macro 'GOOGLE_GLOG_COMPILE_ASSERT'
   typedef google::glog_internal_namespace_::CompileAssert<(bool(expr))> msg[bool(expr) ? 1 : -1]
                                                                         ^~~
src/logging_unittest.cc:256:5: note: in expansion of macro 'LOG_EVERY_N'
     LOG_EVERY_N(ERROR, 4) << "Log every 4, iteration " << COUNTER << endl;
     ^~~~~~~~~~~
src/logging_unittest.cc: In function 'void TestDCHECK()':
src/logging_unittest.cc:569:3: warning: 'template<class> class std::auto_ptr' is deprecated [-Wdeprecated-declarations]
   auto_ptr<int64> sptr(new int64);
   ^~~~~~~~
In file included from /usr/include/c++/7.3.0/bits/locale_conv.h:41:0,
                 from /usr/include/c++/7.3.0/locale:43,
                 from /usr/include/c++/7.3.0/iomanip:43,
                 from src/logging_unittest.cc:44:
/usr/include/c++/7.3.0/bits/unique_ptr.h:51:28: note: declared here
   template<typename> class auto_ptr;
                            ^~~~~~~~
mv -f src/.deps/logging_unittest-logging_unittest.Tpo src/.deps/logging_unittest-logging_unittest.Po
/bin/sh ./libtool  --tag=CXX   --mode=link x86_64-pld-linux-g++ -pthread -I/usr/include -pthread -I/usr/include -I/usr/include -pthread   -Wall -Wwrite-strings -Woverloaded-virtual -Wno-sign-compare  -DNO_FRAME_POINTER  -O2 -fwrapv -pipe -Wformat -Werror=format-security -gdwarf-4 -fno-debug-types-section -fvar-tracking-assignments -g2 -Wp,-D_FORTIFY_SOURCE=2 -fstack-protector-strong --param=ssp-buffer-size=4 -fPIC -march=x86-64 -gdwarf-4 -fno-debug-types-section -fvar-tracking-assignments -g2  -pthread -Wl,--as-needed -Wl,--no-copy-dt-needed-entries -Wl,-z,relro -Wl,-z,combreloc  -o stl_logging_unittest  src/stl_logging_unittest-stl_logging_unittest.o  libglog.la  -lgflags -lunwind -L/usr/lib64 -lgtest -pthread -L/usr/lib64 -L/usr/lib64 -lgmock -lgtest -pthread -lgflags -lpthread 
libtool: link: x86_64-pld-linux-g++ -pthread -I/usr/include -pthread -I/usr/include -I/usr/include -pthread -Wall -Wwrite-strings -Woverloaded-virtual -Wno-sign-compare -DNO_FRAME_POINTER -O2 -fwrapv -pipe -Wformat -Werror=format-security -gdwarf-4 -fno-debug-types-section -fvar-tracking-assignments -g2 -Wp,-D_FORTIFY_SOURCE=2 -fstack-protector-strong --param=ssp-buffer-size=4 -fPIC -march=x86-64 -gdwarf-4 -fno-debug-types-section -fvar-tracking-assignments -g2 -pthread -Wl,--as-needed -Wl,--no-copy-dt-needed-entries -Wl,-z -Wl,relro -Wl,-z -Wl,combreloc -o .libs/stl_logging_unittest src/stl_logging_unittest-stl_logging_unittest.o -pthread -pthread  ./.libs/libglog.so /usr/lib64/libunwind.so -lc -lgcc_s /usr/lib64/liblzma.so -L/usr/lib64 -lgmock /usr/lib64/libgtest.so /usr/lib64/libstdc++.so -lm -lgflags -lpthread -pthread
/usr/bin/ld: cannot find -lgmock
collect2: error: ld returned 1 exit status
make: *** [Makefile:1114: stl_logging_unittest] Error 1
/bin/sh ./libtool  --tag=CXX   --mode=link x86_64-pld-linux-g++ -pthread -I/usr/include -pthread -I/usr/include -I/usr/include -pthread   -Wall -Wwrite-strings -Woverloaded-virtual -Wno-sign-compare  -DNO_FRAME_POINTER  -O2 -fwrapv -pipe -Wformat -Werror=format-security -gdwarf-4 -fno-debug-types-section -fvar-tracking-assignments -g2 -Wp,-D_FORTIFY_SOURCE=2 -fstack-protector-strong --param=ssp-buffer-size=4 -fPIC -march=x86-64 -gdwarf-4 -fno-debug-types-section -fvar-tracking-assignments -g2  -pthread -Wl,--as-needed -Wl,--no-copy-dt-needed-entries -Wl,-z,relro -Wl,-z,combreloc  -o symbolize_unittest  src/symbolize_unittest-symbolize_unittest.o  libglog.la  -lgflags -lunwind -L/usr/lib64 -lgtest -pthread -L/usr/lib64 -L/usr/lib64 -lgmock -lgtest -pthread -lgflags -lpthread 
libtool: link: x86_64-pld-linux-g++ -pthread -I/usr/include -pthread -I/usr/include -I/usr/include -pthread -Wall -Wwrite-strings -Woverloaded-virtual -Wno-sign-compare -DNO_FRAME_POINTER -O2 -fwrapv -pipe -Wformat -Werror=format-security -gdwarf-4 -fno-debug-types-section -fvar-tracking-assignments -g2 -Wp,-D_FORTIFY_SOURCE=2 -fstack-protector-strong --param=ssp-buffer-size=4 -fPIC -march=x86-64 -gdwarf-4 -fno-debug-types-section -fvar-tracking-assignments -g2 -pthread -Wl,--as-needed -Wl,--no-copy-dt-needed-entries -Wl,-z -Wl,relro -Wl,-z -Wl,combreloc -o .libs/symbolize_unittest src/symbolize_unittest-symbolize_unittest.o -pthread -pthread  ./.libs/libglog.so /usr/lib64/libunwind.so -lc -lgcc_s /usr/lib64/liblzma.so -L/usr/lib64 -lgmock /usr/lib64/libgtest.so /usr/lib64/libstdc++.so -lm -lgflags -lpthread -pthread
/usr/bin/ld: cannot find -lgmock
collect2: error: ld returned 1 exit status
make: *** [Makefile:1120: symbolize_unittest] Error 1
x86_64-pld-linux-g++ -DHAVE_CONFIG_H -I. -I./src  -I./src  -pthread -I/usr/include -pthread -I/usr/include -I/usr/include -pthread   -Wall -Wwrite-strings -Woverloaded-virtual -Wno-sign-compare  -DNO_FRAME_POINTER  -O2 -fwrapv -pipe -Wformat -Werror=format-security -gdwarf-4 -fno-debug-types-section -fvar-tracking-assignments -g2 -Wp,-D_FORTIFY_SOURCE=2 -fstack-protector-strong --param=ssp-buffer-size=4 -fPIC -march=x86-64 -gdwarf-4 -fno-debug-types-section -fvar-tracking-assignments -g2  -MT src/mock_log_test-mock-log_test.o -MD -MP -MF src/.deps/mock_log_test-mock-log_test.Tpo -c -o src/mock_log_test-mock-log_test.o `test -f 'src/mock-log_test.cc' || echo './'`src/mock-log_test.cc
mv -f src/.deps/mock_log_test-mock-log_test.Tpo src/.deps/mock_log_test-mock-log_test.Po
error: Bad exit status from /tmp/B.UCvtAk/BUILD/tmp/rpm-tmp.60532 (%build)


RPM build errors:
    Bad exit status from /tmp/B.UCvtAk/BUILD/tmp/rpm-tmp.60532 (%build)
ended at: Tue Feb 13 21:30:52 2018, done in 0:00:24.032003
error: No files produced.
mesg: ttyname failed: Inappropriate ioctl for device
+ chmod -R u+rwX /tmp/B.UCvtAk/BUILD
+ rm -rf /tmp/B.UCvtAk/tmp /tmp/B.UCvtAk/BUILD
mesg: ttyname failed: Inappropriate ioctl for device
+ rm -rf /tmp/B.UCvtAk
Begin-PLD-Builder-Info
Build-Time: user:46.89s sys:5.03s real:26.57s (faults io:0 non-io:2072115)

End-PLD-Builder-Info
[Back to list of logs] [View rpm -qa of builder]