FailedOk

th/SRPMS[OK]
th/x32[OK]
th/i686[OK]
th/x86_64[OK]

ac/SRPMS[OK]
ac/i386[OK]
ac/i586[OK]
ac/i686[OK]
ac/alpha[OK]
ac/amd64[OK]
ac/athlon[OK]
ac/ppc[OK]
ac/sparc[OK]
ac/sparc64[OK]

Advanced Search
main()
Powered by PLD Linux
(c) 2002-2018 PLD Team
$Revision: 1.37 $
Powered by KDE.
Your IP: 54.196.42.8

glog de1d2c4d-f719-4f28-97e2-63260911629b

Status:Failed
Source URL:ftp://buildlogs.pld-linux.org/th/x86_64/FAIL/glog,de1d2c4d-f719-4f28-97e2-63260911629b.bz2
text/plain URL:View!
rpm -qa of builder:View!
Date:2018/02/13 21:23:32
Runtime:0:00:23.591317

Toc:

  • prep
  • Executing(%prep): /bin/sh -e /tmp/B.0frP7b/BUILD/tmp/rpm-tmp.23771
  • build
  • Executing(%build): /bin/sh -e /tmp/B.0frP7b/BUILD/tmp/rpm-tmp.23771
  • error 1
  • collect2: error: ld returned 1 exit status
  • error 2
  • collect2: error: ld returned 1 exit status
  • error 3
  • error: Bad exit status from /tmp/B.0frP7b/BUILD/tmp/rpm-tmp.23771 (%build)
  • error 4
  • RPM build errors:
  • error 5
  • error: No files produced.

Content:

request from: baggins
checking if we should skip the build
started at: Tue Feb 13 21:23:07 2018
fetching https://srcbuilder.pld-linux.org/th//srpms/de1d2c4d-f719-4f28-97e2-63260911629b/glog-0.3.5-2.src.rpm
fetched 547653 bytes, 1087.5 K/s
installing srpm: glog-0.3.5-2.src.rpm
mesg: ttyname failed: Inappropriate ioctl for device
+ install -d /tmp/B.0frP7b/BUILD /tmp/B.0frP7b/RPMS
+ LC_ALL=en_US.UTF-8
+ rpm -qp --changelog glog-0.3.5-2.src.rpm
* Tue Feb 13 2018 PLD Linux Team <feedback@pld-linux.org>
- For complete changelog see: http://git.pld-linux.org/?p=packages/glog.git;a=log;h=master
* Tue Feb 13 2018 Jan Rękorajski <baggins@pld-linux.org> b68b02a
- rel 2, disabled tests * Sat May 27 2017 Jakub Bogusz <qboosh@pld-linux.org> ac097bb
- updated to 0.3.5 + rpm -Uhv --nodeps --define '_topdir /tmp/B.0frP7b' --define '_specdir %{_topdir}' --define '_sourcedir %{_specdir}' --define '_rpmdir %{_topdir}/RPMS' --define '_builddir %{_topdir}/BUILD' glog-0.3.5-2.src.rpm Preparing... ################################################## glog ################################################## + rm -f glog-0.3.5-2.src.rpm mesg: ttyname failed: Inappropriate ioctl for device + install -m 700 -d /tmp/B.0frP7b/BUILD/tmp mesg: ttyname failed: Inappropriate ioctl for device + TMPDIR=/tmp/B.0frP7b/BUILD/tmp + exec nice -n 0 rpmbuild -bp --short-circuit --nodeps --define '_topdir /tmp/B.0frP7b' --define '_specdir %{_topdir}' --define '_sourcedir %{_specdir}' --define '_rpmdir %{_topdir}/RPMS' --define '_builddir %{_topdir}/BUILD' --target x86_64-pld-linux --define 'prep exit 0' /tmp/B.0frP7b/glog.spec Building target platforms: x86_64-pld-linux checking BuildConflict-ing packages no BuildConflicts found checking BR rpm: Building target platforms: x86_64-pld-linux no BR needed building RPM using: set -ex; : build-id: de1d2c4d-f719-4f28-97e2-63260911629b; TMPDIR=/tmp/B.0frP7b/BUILD/tmp exec nice -n 0 rpmbuild -bb --define '_smp_mflags -j5' --define '_make_opts -Otarget' --define '_pld_builder 1' --define '_topdir /tmp/B.0frP7b' --define '_specdir %{_topdir}' --define '_sourcedir %{_specdir}' --define '_rpmdir %{_topdir}/RPMS' --define '_builddir %{_topdir}/BUILD' --target x86_64-pld-linux /tmp/B.0frP7b/glog.spec mesg: ttyname failed: Inappropriate ioctl for device + : build-id: de1d2c4d-f719-4f28-97e2-63260911629b + TMPDIR=/tmp/B.0frP7b/BUILD/tmp + exec nice -n 0 rpmbuild -bb --define '_smp_mflags -j5' --define '_make_opts -Otarget' --define '_pld_builder 1' --define '_topdir /tmp/B.0frP7b' --define '_specdir %{_topdir}' --define '_sourcedir %{_specdir}' --define '_rpmdir %{_topdir}/RPMS' --define '_builddir %{_topdir}/BUILD' --target x86_64-pld-linux /tmp/B.0frP7b/glog.spec Building target platforms: x86_64-pld-linux Executing(%prep): /bin/sh -e /tmp/B.0frP7b/BUILD/tmp/rpm-tmp.23771 + umask 022 + cd /tmp/B.0frP7b/BUILD + cd /tmp/B.0frP7b/BUILD + rm -rf glog-0.3.5 + /usr/bin/gzip -dc /tmp/B.0frP7b/glog-0.3.5.tar.gz + /bin/tar -xf - + STATUS=0 + '[' 0 -ne 0 ']' + cd glog-0.3.5 + /bin/id -u + '[' 1000 '=' 0 ']' + /bin/id -u + '[' 1000 '=' 0 ']' + /bin/chmod -Rf a+rX,u+w,g-w,o-w . + echo 'Patch #0 (glog-gflags.patch):' Patch #0 (glog-gflags.patch): + '[' -f /tmp/B.0frP7b/glog-gflags.patch ']' + /bin/cat /tmp/B.0frP7b/glog-gflags.patch + /usr/bin/patch -s -p1 + echo 'Patch #1 (avoid-inline-asm.patch):' Patch #1 (avoid-inline-asm.patch): + '[' -f /tmp/B.0frP7b/avoid-inline-asm.patch ']' + /bin/cat /tmp/B.0frP7b/avoid-inline-asm.patch + /usr/bin/patch -s -p1 + echo 'Patch #2 (gcc5.patch):' Patch #2 (gcc5.patch): + '[' -f /tmp/B.0frP7b/gcc5.patch ']' + /bin/cat /tmp/B.0frP7b/gcc5.patch + /usr/bin/patch -s -p1 + exit 0 Executing(%build): /bin/sh -e /tmp/B.0frP7b/BUILD/tmp/rpm-tmp.23771 TMP=/home/users/builder/tmp HOME=/home/users/builder PATH=/home/users/builder/GNUstep/Tools:/usr/local/bin:/usr/bin:/bin:/home/users/builder/bin TMPDIR=/tmp/B.0frP7b/BUILD/tmp + umask 022 + cd /tmp/B.0frP7b/BUILD + cd glog-0.3.5 + libtoolize --copy --force --install libtoolize: putting auxiliary files in '.'. libtoolize: copying file './config.guess' libtoolize: copying file './config.sub' libtoolize: copying file './install-sh' libtoolize: copying file './ltmain.sh' libtoolize: putting macros in AC_CONFIG_MACRO_DIRS, 'm4'. libtoolize: copying file 'm4/libtool.m4' libtoolize: copying file 'm4/ltoptions.m4' libtoolize: copying file 'm4/ltsugar.m4' libtoolize: copying file 'm4/ltversion.m4' libtoolize: copying file 'm4/lt~obsolete.m4' + aclocal -I m4 + autoconf + autoheader + automake -a -c -f --foreign configure.ac:19: installing './compile' configure.ac:13: installing './missing' Makefile.am: installing './depcomp' parallel-tests: installing './test-driver' + ./configure 'LDFLAGS=-Wl,--as-needed -Wl,--no-copy-dt-needed-entries -Wl,-z,relro -Wl,-z,combreloc ' 'CFLAGS=-O2 -fwrapv -pipe -Wformat -Werror=format-security -gdwarf-4 -fno-debug-types-section -fvar-tracking-assignments -g2 -Wp,-D_FORTIFY_SOURCE=2 -fstack-protector-strong --param=ssp-buffer-size=4 -fPIC -march=x86-64 -gdwarf-4 -fno-debug-types-section -fvar-tracking-assignments -g2 ' 'CXXFLAGS=-O2 -fwrapv -pipe -Wformat -Werror=format-security -gdwarf-4 -fno-debug-types-section -fvar-tracking-assignments -g2 -Wp,-D_FORTIFY_SOURCE=2 -fstack-protector-strong --param=ssp-buffer-size=4 -fPIC -march=x86-64 -gdwarf-4 -fno-debug-types-section -fvar-tracking-assignments -g2 ' 'FFLAGS=-O2 -fwrapv -pipe -Wformat -Werror=format-security -gdwarf-4 -fno-debug-types-section -fvar-tracking-assignments -g2 -Wp,-D_FORTIFY_SOURCE=2 -fstack-protector-strong --param=ssp-buffer-size=4 -fPIC -march=x86-64 -gdwarf-4 -fno-debug-types-section -fvar-tracking-assignments -g2 ' 'FCFLAGS=-O2 -fwrapv -pipe -Wformat -Werror=format-security -gdwarf-4 -fno-debug-types-section -fvar-tracking-assignments -g2 -Wp,-D_FORTIFY_SOURCE=2 -fstack-protector-strong --param=ssp-buffer-size=4 -fPIC -march=x86-64 -gdwarf-4 -fno-debug-types-section -fvar-tracking-assignments -g2 ' 'CPPFLAGS=' 'CC=x86_64-pld-linux-gcc' 'CXX=x86_64-pld-linux-g++' '--host=x86_64-pld-linux' '--build=x86_64-pld-linux' '--prefix=/usr' '--exec-prefix=/usr' '--bindir=/usr/bin' '--sbindir=/usr/sbin' '--sysconfdir=/etc' '--datadir=/usr/share' '--includedir=/usr/include' '--libdir=/usr/lib64' '--libexecdir=/usr/libexec' '--localstatedir=/var' '--sharedstatedir=/var/lib' '--mandir=/usr/share/man' '--infodir=/usr/share/info' '--x-libraries=/usr/lib64' checking for a BSD-compatible install... /usr/bin/install -c checking whether build environment is sane... yes checking for a thread-safe mkdir -p... /bin/mkdir -p checking for mawk... mawk checking whether make sets $(MAKE)... yes checking whether make supports nested variables... yes checking for x86_64-pld-linux-gcc... x86_64-pld-linux-gcc checking whether the C compiler works... yes checking for C compiler default output file name... a.out checking for suffix of executables... checking whether we are cross compiling... no checking for suffix of object files... o checking whether we are using the GNU C compiler... yes checking whether x86_64-pld-linux-gcc accepts -g... yes checking for x86_64-pld-linux-gcc option to accept ISO C89... none needed checking whether x86_64-pld-linux-gcc understands -c and -o together... yes checking for style of include used by make... GNU checking dependency style of x86_64-pld-linux-gcc... gcc3 checking how to run the C preprocessor... x86_64-pld-linux-gcc -E checking whether we are using the GNU C++ compiler... yes checking whether x86_64-pld-linux-g++ accepts -g... yes checking dependency style of x86_64-pld-linux-g++... gcc3 checking build system type... x86_64-pld-linux-gnu checking host system type... x86_64-pld-linux-gnu checking how to print strings... print -r checking for a sed that does not truncate output... /bin/sed checking for grep that handles long lines and -e... /bin/grep checking for egrep... /bin/grep -E checking for fgrep... /bin/grep -F checking for ld used by x86_64-pld-linux-gcc... /usr/bin/ld checking if the linker (/usr/bin/ld) is GNU ld... yes checking for BSD- or MS-compatible name lister (nm)... /usr/bin/nm -B checking the name lister (/usr/bin/nm -B) interface... BSD nm checking whether ln -s works... yes checking the maximum length of command line arguments... 1572864 checking how to convert x86_64-pld-linux-gnu file names to x86_64-pld-linux-gnu format... func_convert_file_noop checking how to convert x86_64-pld-linux-gnu file names to toolchain format... func_convert_file_noop checking for /usr/bin/ld option to reload object files... -r checking for x86_64-pld-linux-objdump... no checking for objdump... objdump checking how to recognize dependent libraries... pass_all checking for x86_64-pld-linux-dlltool... no checking for dlltool... no checking how to associate runtime and link libraries... print -r -- checking for x86_64-pld-linux-ar... no checking for ar... ar checking for archiver @FILE support... @ checking for x86_64-pld-linux-strip... no checking for strip... strip checking for x86_64-pld-linux-ranlib... no checking for ranlib... ranlib checking command to parse /usr/bin/nm -B output from x86_64-pld-linux-gcc object... ok checking for sysroot... no checking for a working dd... /bin/dd checking how to truncate binary pipes... /bin/dd bs=4096 count=1 checking for x86_64-pld-linux-mt... no checking for mt... no checking if : is a manifest tool... no checking for ANSI C header files... no checking for sys/types.h... yes checking for sys/stat.h... yes checking for stdlib.h... yes checking for string.h... yes checking for memory.h... yes checking for strings.h... yes checking for inttypes.h... yes checking for stdint.h... yes checking for unistd.h... yes checking for dlfcn.h... yes checking for objdir... .libs checking if x86_64-pld-linux-gcc supports -fno-rtti -fno-exceptions... no checking for x86_64-pld-linux-gcc option to produce PIC... -fPIC -DPIC checking if x86_64-pld-linux-gcc PIC flag -fPIC -DPIC works... yes checking if x86_64-pld-linux-gcc static flag -static works... yes checking if x86_64-pld-linux-gcc supports -c -o file.o... yes checking if x86_64-pld-linux-gcc supports -c -o file.o... (cached) yes checking whether the x86_64-pld-linux-gcc linker (/usr/bin/ld -m elf_x86_64) supports shared libraries... yes checking whether -lc should be explicitly linked in... no checking dynamic linker characteristics... GNU/Linux ld.so checking how to hardcode library paths into programs... immediate checking whether stripping libraries is possible... yes checking if libtool supports shared libraries... yes checking whether to build shared libraries... yes checking whether to build static libraries... yes checking how to run the C++ preprocessor... x86_64-pld-linux-g++ -E checking for ld used by x86_64-pld-linux-g++... /usr/bin/ld -m elf_x86_64 checking if the linker (/usr/bin/ld -m elf_x86_64) is GNU ld... yes checking whether the x86_64-pld-linux-g++ linker (/usr/bin/ld -m elf_x86_64) supports shared libraries... yes checking for x86_64-pld-linux-g++ option to produce PIC... -fPIC -DPIC checking if x86_64-pld-linux-g++ PIC flag -fPIC -DPIC works... yes checking if x86_64-pld-linux-g++ static flag -static works... yes checking if x86_64-pld-linux-g++ supports -c -o file.o... yes checking if x86_64-pld-linux-g++ supports -c -o file.o... (cached) yes checking whether the x86_64-pld-linux-g++ linker (/usr/bin/ld -m elf_x86_64) supports shared libraries... yes checking dynamic linker characteristics... (cached) GNU/Linux ld.so checking how to hardcode library paths into programs... immediate checking for ANSI C header files... (cached) no checking for stdint.h... (cached) yes checking for sys/types.h... (cached) yes checking for inttypes.h... (cached) yes checking for unistd.h... (cached) yes checking syscall.h usability... yes checking syscall.h presence... yes checking for syscall.h... yes checking sys/syscall.h usability... yes checking sys/syscall.h presence... yes checking for sys/syscall.h... yes checking execinfo.h usability... yes checking execinfo.h presence... yes checking for execinfo.h... yes checking libunwind.h usability... yes checking libunwind.h presence... yes checking for libunwind.h... yes checking ucontext.h usability... yes checking ucontext.h presence... yes checking for ucontext.h... yes checking sys/utsname.h usability... yes checking sys/utsname.h presence... yes checking for sys/utsname.h... yes checking pwd.h usability... yes checking pwd.h presence... yes checking for pwd.h... yes checking syslog.h usability... yes checking syslog.h presence... yes checking for syslog.h... yes checking sys/time.h usability... yes checking sys/time.h presence... yes checking for sys/time.h... yes checking glob.h usability... yes checking glob.h presence... yes checking for glob.h... yes checking unwind.h usability... yes checking unwind.h presence... yes checking for unwind.h... yes checking windows.h usability... no checking windows.h presence... no checking for windows.h... no checking size of void *... 8 checking for uint16_t... yes checking for u_int16_t... yes checking for __uint16... no checking for sigaltstack... yes checking for sigaction... yes checking for dladdr... no checking for fcntl... yes checking for pread... yes checking for pwrite... yes checking for __attribute__... yes checking for __builtin_expect... yes checking for __sync_val_compare_and_swap... yes checking for the pthreads library -lpthreads... no checking whether pthreads work without any flags... no checking whether pthreads work with -Kthread... no checking whether pthreads work with -kthread... no checking for the pthreads library -llthread... no checking whether pthreads work with -pthread... yes checking for joinable pthread attribute... PTHREAD_CREATE_JOINABLE checking if more special flags are required for pthreads... no checking whether to check for GCC pthread/shared inconsistencies... yes checking whether -pthread is sufficient with -shared... yes checking for pthread_self in -lpthread... yes checking for main in -lgflags... yes checking for gtest-config... yes checking for main in -lgtest... yes checking for gmock-config... yes checking for backtrace in -lunwind... yes checking support for pthread_rwlock_* functions... yes checking whether the compiler implements namespaces... yes checking what namespace STL code is in... std checking whether compiler supports using ::operator<<... 1 checking for ucontext.h... (cached) yes checking sys/ucontext.h usability... yes checking sys/ucontext.h presence... yes checking for sys/ucontext.h... yes checking how to access the program counter from a struct ucontext... uc_mcontext.gregs[REG_RIP] checking that generated files are newer than configure... done configure: creating ./config.status config.status: creating Makefile config.status: creating src/glog/logging.h config.status: creating src/glog/raw_logging.h config.status: creating src/glog/vlog_is_on.h config.status: creating src/glog/stl_logging.h config.status: creating libglog.pc config.status: creating src/config.h config.status: executing depfiles commands config.status: executing libtool commands + /usr/bin/make -Otarget -j5 /bin/sh ./libtool --tag=CXX --mode=compile x86_64-pld-linux-g++ -DHAVE_CONFIG_H -I. -I./src -I./src -Wall -Wwrite-strings -Woverloaded-virtual -Wno-sign-compare -DNO_FRAME_POINTER -DNDEBUG -O2 -fwrapv -pipe -Wformat -Werror=format-security -gdwarf-4 -fno-debug-types-section -fvar-tracking-assignments -g2 -Wp,-D_FORTIFY_SOURCE=2 -fstack-protector-strong --param=ssp-buffer-size=4 -fPIC -march=x86-64 -gdwarf-4 -fno-debug-types-section -fvar-tracking-assignments -g2 -MT src/libglog_la-raw_logging.lo -MD -MP -MF src/.deps/libglog_la-raw_logging.Tpo -c -o src/libglog_la-raw_logging.lo `test -f 'src/raw_logging.cc' || echo './'`src/raw_logging.cc libtool: compile: x86_64-pld-linux-g++ -DHAVE_CONFIG_H -I. -I./src -I./src -Wall -Wwrite-strings -Woverloaded-virtual -Wno-sign-compare -DNO_FRAME_POINTER -DNDEBUG -O2 -fwrapv -pipe -Wformat -Werror=format-security -gdwarf-4 -fno-debug-types-section -fvar-tracking-assignments -g2 -Wp,-D_FORTIFY_SOURCE=2 -fstack-protector-strong --param=ssp-buffer-size=4 -fPIC -march=x86-64 -gdwarf-4 -fno-debug-types-section -fvar-tracking-assignments -g2 -MT src/libglog_la-raw_logging.lo -MD -MP -MF src/.deps/libglog_la-raw_logging.Tpo -c src/raw_logging.cc -fPIC -DPIC -o src/.libs/libglog_la-raw_logging.o libtool: compile: x86_64-pld-linux-g++ -DHAVE_CONFIG_H -I. -I./src -I./src -Wall -Wwrite-strings -Woverloaded-virtual -Wno-sign-compare -DNO_FRAME_POINTER -DNDEBUG -O2 -fwrapv -pipe -Wformat -Werror=format-security -gdwarf-4 -fno-debug-types-section -fvar-tracking-assignments -g2 -Wp,-D_FORTIFY_SOURCE=2 -fstack-protector-strong --param=ssp-buffer-size=4 -fPIC -march=x86-64 -gdwarf-4 -fno-debug-types-section -fvar-tracking-assignments -g2 -MT src/libglog_la-raw_logging.lo -MD -MP -MF src/.deps/libglog_la-raw_logging.Tpo -c src/raw_logging.cc -o src/libglog_la-raw_logging.o >/dev/null 2>&1 mv -f src/.deps/libglog_la-raw_logging.Tpo src/.deps/libglog_la-raw_logging.Plo /bin/sh ./libtool --tag=CXX --mode=compile x86_64-pld-linux-g++ -DHAVE_CONFIG_H -I. -I./src -I./src -Wall -Wwrite-strings -Woverloaded-virtual -Wno-sign-compare -DNO_FRAME_POINTER -DNDEBUG -O2 -fwrapv -pipe -Wformat -Werror=format-security -gdwarf-4 -fno-debug-types-section -fvar-tracking-assignments -g2 -Wp,-D_FORTIFY_SOURCE=2 -fstack-protector-strong --param=ssp-buffer-size=4 -fPIC -march=x86-64 -gdwarf-4 -fno-debug-types-section -fvar-tracking-assignments -g2 -MT src/libglog_la-utilities.lo -MD -MP -MF src/.deps/libglog_la-utilities.Tpo -c -o src/libglog_la-utilities.lo `test -f 'src/utilities.cc' || echo './'`src/utilities.cc libtool: compile: x86_64-pld-linux-g++ -DHAVE_CONFIG_H -I. -I./src -I./src -Wall -Wwrite-strings -Woverloaded-virtual -Wno-sign-compare -DNO_FRAME_POINTER -DNDEBUG -O2 -fwrapv -pipe -Wformat -Werror=format-security -gdwarf-4 -fno-debug-types-section -fvar-tracking-assignments -g2 -Wp,-D_FORTIFY_SOURCE=2 -fstack-protector-strong --param=ssp-buffer-size=4 -fPIC -march=x86-64 -gdwarf-4 -fno-debug-types-section -fvar-tracking-assignments -g2 -MT src/libglog_la-utilities.lo -MD -MP -MF src/.deps/libglog_la-utilities.Tpo -c src/utilities.cc -fPIC -DPIC -o src/.libs/libglog_la-utilities.o libtool: compile: x86_64-pld-linux-g++ -DHAVE_CONFIG_H -I. -I./src -I./src -Wall -Wwrite-strings -Woverloaded-virtual -Wno-sign-compare -DNO_FRAME_POINTER -DNDEBUG -O2 -fwrapv -pipe -Wformat -Werror=format-security -gdwarf-4 -fno-debug-types-section -fvar-tracking-assignments -g2 -Wp,-D_FORTIFY_SOURCE=2 -fstack-protector-strong --param=ssp-buffer-size=4 -fPIC -march=x86-64 -gdwarf-4 -fno-debug-types-section -fvar-tracking-assignments -g2 -MT src/libglog_la-utilities.lo -MD -MP -MF src/.deps/libglog_la-utilities.Tpo -c src/utilities.cc -o src/libglog_la-utilities.o >/dev/null 2>&1 mv -f src/.deps/libglog_la-utilities.Tpo src/.deps/libglog_la-utilities.Plo /bin/sh ./libtool --tag=CXX --mode=compile x86_64-pld-linux-g++ -DHAVE_CONFIG_H -I. -I./src -I./src -Wall -Wwrite-strings -Woverloaded-virtual -Wno-sign-compare -DNO_FRAME_POINTER -DNDEBUG -O2 -fwrapv -pipe -Wformat -Werror=format-security -gdwarf-4 -fno-debug-types-section -fvar-tracking-assignments -g2 -Wp,-D_FORTIFY_SOURCE=2 -fstack-protector-strong --param=ssp-buffer-size=4 -fPIC -march=x86-64 -gdwarf-4 -fno-debug-types-section -fvar-tracking-assignments -g2 -MT src/libglog_la-vlog_is_on.lo -MD -MP -MF src/.deps/libglog_la-vlog_is_on.Tpo -c -o src/libglog_la-vlog_is_on.lo `test -f 'src/vlog_is_on.cc' || echo './'`src/vlog_is_on.cc libtool: compile: x86_64-pld-linux-g++ -DHAVE_CONFIG_H -I. -I./src -I./src -Wall -Wwrite-strings -Woverloaded-virtual -Wno-sign-compare -DNO_FRAME_POINTER -DNDEBUG -O2 -fwrapv -pipe -Wformat -Werror=format-security -gdwarf-4 -fno-debug-types-section -fvar-tracking-assignments -g2 -Wp,-D_FORTIFY_SOURCE=2 -fstack-protector-strong --param=ssp-buffer-size=4 -fPIC -march=x86-64 -gdwarf-4 -fno-debug-types-section -fvar-tracking-assignments -g2 -MT src/libglog_la-vlog_is_on.lo -MD -MP -MF src/.deps/libglog_la-vlog_is_on.Tpo -c src/vlog_is_on.cc -fPIC -DPIC -o src/.libs/libglog_la-vlog_is_on.o libtool: compile: x86_64-pld-linux-g++ -DHAVE_CONFIG_H -I. -I./src -I./src -Wall -Wwrite-strings -Woverloaded-virtual -Wno-sign-compare -DNO_FRAME_POINTER -DNDEBUG -O2 -fwrapv -pipe -Wformat -Werror=format-security -gdwarf-4 -fno-debug-types-section -fvar-tracking-assignments -g2 -Wp,-D_FORTIFY_SOURCE=2 -fstack-protector-strong --param=ssp-buffer-size=4 -fPIC -march=x86-64 -gdwarf-4 -fno-debug-types-section -fvar-tracking-assignments -g2 -MT src/libglog_la-vlog_is_on.lo -MD -MP -MF src/.deps/libglog_la-vlog_is_on.Tpo -c src/vlog_is_on.cc -o src/libglog_la-vlog_is_on.o >/dev/null 2>&1 mv -f src/.deps/libglog_la-vlog_is_on.Tpo src/.deps/libglog_la-vlog_is_on.Plo /bin/sh ./libtool --tag=CXX --mode=compile x86_64-pld-linux-g++ -DHAVE_CONFIG_H -I. -I./src -I./src -Wall -Wwrite-strings -Woverloaded-virtual -Wno-sign-compare -DNO_FRAME_POINTER -DNDEBUG -O2 -fwrapv -pipe -Wformat -Werror=format-security -gdwarf-4 -fno-debug-types-section -fvar-tracking-assignments -g2 -Wp,-D_FORTIFY_SOURCE=2 -fstack-protector-strong --param=ssp-buffer-size=4 -fPIC -march=x86-64 -gdwarf-4 -fno-debug-types-section -fvar-tracking-assignments -g2 -MT src/libglog_la-demangle.lo -MD -MP -MF src/.deps/libglog_la-demangle.Tpo -c -o src/libglog_la-demangle.lo `test -f 'src/demangle.cc' || echo './'`src/demangle.cc libtool: compile: x86_64-pld-linux-g++ -DHAVE_CONFIG_H -I. -I./src -I./src -Wall -Wwrite-strings -Woverloaded-virtual -Wno-sign-compare -DNO_FRAME_POINTER -DNDEBUG -O2 -fwrapv -pipe -Wformat -Werror=format-security -gdwarf-4 -fno-debug-types-section -fvar-tracking-assignments -g2 -Wp,-D_FORTIFY_SOURCE=2 -fstack-protector-strong --param=ssp-buffer-size=4 -fPIC -march=x86-64 -gdwarf-4 -fno-debug-types-section -fvar-tracking-assignments -g2 -MT src/libglog_la-demangle.lo -MD -MP -MF src/.deps/libglog_la-demangle.Tpo -c src/demangle.cc -fPIC -DPIC -o src/.libs/libglog_la-demangle.o libtool: compile: x86_64-pld-linux-g++ -DHAVE_CONFIG_H -I. -I./src -I./src -Wall -Wwrite-strings -Woverloaded-virtual -Wno-sign-compare -DNO_FRAME_POINTER -DNDEBUG -O2 -fwrapv -pipe -Wformat -Werror=format-security -gdwarf-4 -fno-debug-types-section -fvar-tracking-assignments -g2 -Wp,-D_FORTIFY_SOURCE=2 -fstack-protector-strong --param=ssp-buffer-size=4 -fPIC -march=x86-64 -gdwarf-4 -fno-debug-types-section -fvar-tracking-assignments -g2 -MT src/libglog_la-demangle.lo -MD -MP -MF src/.deps/libglog_la-demangle.Tpo -c src/demangle.cc -o src/libglog_la-demangle.o >/dev/null 2>&1 mv -f src/.deps/libglog_la-demangle.Tpo src/.deps/libglog_la-demangle.Plo /bin/sh ./libtool --tag=CXX --mode=compile x86_64-pld-linux-g++ -DHAVE_CONFIG_H -I. -I./src -I./src -Wall -Wwrite-strings -Woverloaded-virtual -Wno-sign-compare -DNO_FRAME_POINTER -DNDEBUG -O2 -fwrapv -pipe -Wformat -Werror=format-security -gdwarf-4 -fno-debug-types-section -fvar-tracking-assignments -g2 -Wp,-D_FORTIFY_SOURCE=2 -fstack-protector-strong --param=ssp-buffer-size=4 -fPIC -march=x86-64 -gdwarf-4 -fno-debug-types-section -fvar-tracking-assignments -g2 -MT src/libglog_la-symbolize.lo -MD -MP -MF src/.deps/libglog_la-symbolize.Tpo -c -o src/libglog_la-symbolize.lo `test -f 'src/symbolize.cc' || echo './'`src/symbolize.cc libtool: compile: x86_64-pld-linux-g++ -DHAVE_CONFIG_H -I. -I./src -I./src -Wall -Wwrite-strings -Woverloaded-virtual -Wno-sign-compare -DNO_FRAME_POINTER -DNDEBUG -O2 -fwrapv -pipe -Wformat -Werror=format-security -gdwarf-4 -fno-debug-types-section -fvar-tracking-assignments -g2 -Wp,-D_FORTIFY_SOURCE=2 -fstack-protector-strong --param=ssp-buffer-size=4 -fPIC -march=x86-64 -gdwarf-4 -fno-debug-types-section -fvar-tracking-assignments -g2 -MT src/libglog_la-symbolize.lo -MD -MP -MF src/.deps/libglog_la-symbolize.Tpo -c src/symbolize.cc -fPIC -DPIC -o src/.libs/libglog_la-symbolize.o libtool: compile: x86_64-pld-linux-g++ -DHAVE_CONFIG_H -I. -I./src -I./src -Wall -Wwrite-strings -Woverloaded-virtual -Wno-sign-compare -DNO_FRAME_POINTER -DNDEBUG -O2 -fwrapv -pipe -Wformat -Werror=format-security -gdwarf-4 -fno-debug-types-section -fvar-tracking-assignments -g2 -Wp,-D_FORTIFY_SOURCE=2 -fstack-protector-strong --param=ssp-buffer-size=4 -fPIC -march=x86-64 -gdwarf-4 -fno-debug-types-section -fvar-tracking-assignments -g2 -MT src/libglog_la-symbolize.lo -MD -MP -MF src/.deps/libglog_la-symbolize.Tpo -c src/symbolize.cc -o src/libglog_la-symbolize.o >/dev/null 2>&1 mv -f src/.deps/libglog_la-symbolize.Tpo src/.deps/libglog_la-symbolize.Plo /bin/sh ./libtool --tag=CXX --mode=compile x86_64-pld-linux-g++ -DHAVE_CONFIG_H -I. -I./src -I./src -Wall -Wwrite-strings -Woverloaded-virtual -Wno-sign-compare -DNO_FRAME_POINTER -DNDEBUG -O2 -fwrapv -pipe -Wformat -Werror=format-security -gdwarf-4 -fno-debug-types-section -fvar-tracking-assignments -g2 -Wp,-D_FORTIFY_SOURCE=2 -fstack-protector-strong --param=ssp-buffer-size=4 -fPIC -march=x86-64 -gdwarf-4 -fno-debug-types-section -fvar-tracking-assignments -g2 -MT src/libglog_la-signalhandler.lo -MD -MP -MF src/.deps/libglog_la-signalhandler.Tpo -c -o src/libglog_la-signalhandler.lo `test -f 'src/signalhandler.cc' || echo './'`src/signalhandler.cc libtool: compile: x86_64-pld-linux-g++ -DHAVE_CONFIG_H -I. -I./src -I./src -Wall -Wwrite-strings -Woverloaded-virtual -Wno-sign-compare -DNO_FRAME_POINTER -DNDEBUG -O2 -fwrapv -pipe -Wformat -Werror=format-security -gdwarf-4 -fno-debug-types-section -fvar-tracking-assignments -g2 -Wp,-D_FORTIFY_SOURCE=2 -fstack-protector-strong --param=ssp-buffer-size=4 -fPIC -march=x86-64 -gdwarf-4 -fno-debug-types-section -fvar-tracking-assignments -g2 -MT src/libglog_la-signalhandler.lo -MD -MP -MF src/.deps/libglog_la-signalhandler.Tpo -c src/signalhandler.cc -fPIC -DPIC -o src/.libs/libglog_la-signalhandler.o libtool: compile: x86_64-pld-linux-g++ -DHAVE_CONFIG_H -I. -I./src -I./src -Wall -Wwrite-strings -Woverloaded-virtual -Wno-sign-compare -DNO_FRAME_POINTER -DNDEBUG -O2 -fwrapv -pipe -Wformat -Werror=format-security -gdwarf-4 -fno-debug-types-section -fvar-tracking-assignments -g2 -Wp,-D_FORTIFY_SOURCE=2 -fstack-protector-strong --param=ssp-buffer-size=4 -fPIC -march=x86-64 -gdwarf-4 -fno-debug-types-section -fvar-tracking-assignments -g2 -MT src/libglog_la-signalhandler.lo -MD -MP -MF src/.deps/libglog_la-signalhandler.Tpo -c src/signalhandler.cc -o src/libglog_la-signalhandler.o >/dev/null 2>&1 mv -f src/.deps/libglog_la-signalhandler.Tpo src/.deps/libglog_la-signalhandler.Plo x86_64-pld-linux-g++ -DHAVE_CONFIG_H -I. -I./src -I./src -pthread -I/usr/include -pthread -I/usr/include -I/usr/include -pthread -Wall -Wwrite-strings -Woverloaded-virtual -Wno-sign-compare -DNO_FRAME_POINTER -O2 -fwrapv -pipe -Wformat -Werror=format-security -gdwarf-4 -fno-debug-types-section -fvar-tracking-assignments -g2 -Wp,-D_FORTIFY_SOURCE=2 -fstack-protector-strong --param=ssp-buffer-size=4 -fPIC -march=x86-64 -gdwarf-4 -fno-debug-types-section -fvar-tracking-assignments -g2 -MT src/stacktrace_unittest-stacktrace_unittest.o -MD -MP -MF src/.deps/stacktrace_unittest-stacktrace_unittest.Tpo -c -o src/stacktrace_unittest-stacktrace_unittest.o `test -f 'src/stacktrace_unittest.cc' || echo './'`src/stacktrace_unittest.cc mv -f src/.deps/stacktrace_unittest-stacktrace_unittest.Tpo src/.deps/stacktrace_unittest-stacktrace_unittest.Po x86_64-pld-linux-g++ -DHAVE_CONFIG_H -I. -I./src -I./src -pthread -I/usr/include -pthread -I/usr/include -I/usr/include -pthread -Wall -Wwrite-strings -Woverloaded-virtual -Wno-sign-compare -DNO_FRAME_POINTER -O2 -fwrapv -pipe -Wformat -Werror=format-security -gdwarf-4 -fno-debug-types-section -fvar-tracking-assignments -g2 -Wp,-D_FORTIFY_SOURCE=2 -fstack-protector-strong --param=ssp-buffer-size=4 -fPIC -march=x86-64 -gdwarf-4 -fno-debug-types-section -fvar-tracking-assignments -g2 -MT src/demangle_unittest-demangle_unittest.o -MD -MP -MF src/.deps/demangle_unittest-demangle_unittest.Tpo -c -o src/demangle_unittest-demangle_unittest.o `test -f 'src/demangle_unittest.cc' || echo './'`src/demangle_unittest.cc In file included from src/demangle_unittest.cc:41:0: src/googletest.h:579:33: warning: dynamic exception specifications are deprecated in C++11 [-Wdeprecated] void* operator new(size_t size) throw(std::bad_alloc) { ^~~~~ src/googletest.h:586:35: warning: dynamic exception specifications are deprecated in C++11 [-Wdeprecated] void* operator new[](size_t size) throw(std::bad_alloc) { ^~~~~ mv -f src/.deps/demangle_unittest-demangle_unittest.Tpo src/.deps/demangle_unittest-demangle_unittest.Po x86_64-pld-linux-g++ -DHAVE_CONFIG_H -I. -I./src -I./src -pthread -I/usr/include -pthread -I/usr/include -I/usr/include -pthread -Wall -Wwrite-strings -Woverloaded-virtual -Wno-sign-compare -DNO_FRAME_POINTER -O2 -fwrapv -pipe -Wformat -Werror=format-security -gdwarf-4 -fno-debug-types-section -fvar-tracking-assignments -g2 -Wp,-D_FORTIFY_SOURCE=2 -fstack-protector-strong --param=ssp-buffer-size=4 -fPIC -march=x86-64 -gdwarf-4 -fno-debug-types-section -fvar-tracking-assignments -g2 -MT src/symbolize_unittest-symbolize_unittest.o -MD -MP -MF src/.deps/symbolize_unittest-symbolize_unittest.Tpo -c -o src/symbolize_unittest-symbolize_unittest.o `test -f 'src/symbolize_unittest.cc' || echo './'`src/symbolize_unittest.cc In file included from src/symbolize_unittest.cc:41:0: src/googletest.h:579:33: warning: dynamic exception specifications are deprecated in C++11 [-Wdeprecated] void* operator new(size_t size) throw(std::bad_alloc) { ^~~~~ src/googletest.h:586:35: warning: dynamic exception specifications are deprecated in C++11 [-Wdeprecated] void* operator new[](size_t size) throw(std::bad_alloc) { ^~~~~ mv -f src/.deps/symbolize_unittest-symbolize_unittest.Tpo src/.deps/symbolize_unittest-symbolize_unittest.Po /bin/sh ./libtool --tag=CXX --mode=compile x86_64-pld-linux-g++ -DHAVE_CONFIG_H -I. -I./src -I./src -Wall -Wwrite-strings -Woverloaded-virtual -Wno-sign-compare -DNO_FRAME_POINTER -DNDEBUG -O2 -fwrapv -pipe -Wformat -Werror=format-security -gdwarf-4 -fno-debug-types-section -fvar-tracking-assignments -g2 -Wp,-D_FORTIFY_SOURCE=2 -fstack-protector-strong --param=ssp-buffer-size=4 -fPIC -march=x86-64 -gdwarf-4 -fno-debug-types-section -fvar-tracking-assignments -g2 -MT src/libglog_la-logging.lo -MD -MP -MF src/.deps/libglog_la-logging.Tpo -c -o src/libglog_la-logging.lo `test -f 'src/logging.cc' || echo './'`src/logging.cc libtool: compile: x86_64-pld-linux-g++ -DHAVE_CONFIG_H -I. -I./src -I./src -Wall -Wwrite-strings -Woverloaded-virtual -Wno-sign-compare -DNO_FRAME_POINTER -DNDEBUG -O2 -fwrapv -pipe -Wformat -Werror=format-security -gdwarf-4 -fno-debug-types-section -fvar-tracking-assignments -g2 -Wp,-D_FORTIFY_SOURCE=2 -fstack-protector-strong --param=ssp-buffer-size=4 -fPIC -march=x86-64 -gdwarf-4 -fno-debug-types-section -fvar-tracking-assignments -g2 -MT src/libglog_la-logging.lo -MD -MP -MF src/.deps/libglog_la-logging.Tpo -c src/logging.cc -fPIC -DPIC -o src/.libs/libglog_la-logging.o libtool: compile: x86_64-pld-linux-g++ -DHAVE_CONFIG_H -I. -I./src -I./src -Wall -Wwrite-strings -Woverloaded-virtual -Wno-sign-compare -DNO_FRAME_POINTER -DNDEBUG -O2 -fwrapv -pipe -Wformat -Werror=format-security -gdwarf-4 -fno-debug-types-section -fvar-tracking-assignments -g2 -Wp,-D_FORTIFY_SOURCE=2 -fstack-protector-strong --param=ssp-buffer-size=4 -fPIC -march=x86-64 -gdwarf-4 -fno-debug-types-section -fvar-tracking-assignments -g2 -MT src/libglog_la-logging.lo -MD -MP -MF src/.deps/libglog_la-logging.Tpo -c src/logging.cc -o src/libglog_la-logging.o >/dev/null 2>&1 mv -f src/.deps/libglog_la-logging.Tpo src/.deps/libglog_la-logging.Plo x86_64-pld-linux-g++ -DHAVE_CONFIG_H -I. -I./src -I./src -pthread -I/usr/include -pthread -I/usr/include -I/usr/include -pthread -Wall -Wwrite-strings -Woverloaded-virtual -Wno-sign-compare -DNO_FRAME_POINTER -O2 -fwrapv -pipe -Wformat -Werror=format-security -gdwarf-4 -fno-debug-types-section -fvar-tracking-assignments -g2 -Wp,-D_FORTIFY_SOURCE=2 -fstack-protector-strong --param=ssp-buffer-size=4 -fPIC -march=x86-64 -gdwarf-4 -fno-debug-types-section -fvar-tracking-assignments -g2 -MT src/utilities_unittest-utilities_unittest.o -MD -MP -MF src/.deps/utilities_unittest-utilities_unittest.Tpo -c -o src/utilities_unittest-utilities_unittest.o `test -f 'src/utilities_unittest.cc' || echo './'`src/utilities_unittest.cc In file included from src/utilities_unittest.cc:32:0: src/googletest.h:579:33: warning: dynamic exception specifications are deprecated in C++11 [-Wdeprecated] void* operator new(size_t size) throw(std::bad_alloc) { ^~~~~ src/googletest.h:586:35: warning: dynamic exception specifications are deprecated in C++11 [-Wdeprecated] void* operator new[](size_t size) throw(std::bad_alloc) { ^~~~~ mv -f src/.deps/utilities_unittest-utilities_unittest.Tpo src/.deps/utilities_unittest-utilities_unittest.Po x86_64-pld-linux-g++ -DHAVE_CONFIG_H -I. -I./src -I./src -pthread -I/usr/include -pthread -I/usr/include -I/usr/include -pthread -Wall -Wwrite-strings -Woverloaded-virtual -Wno-sign-compare -DNO_FRAME_POINTER -O2 -fwrapv -pipe -Wformat -Werror=format-security -gdwarf-4 -fno-debug-types-section -fvar-tracking-assignments -g2 -Wp,-D_FORTIFY_SOURCE=2 -fstack-protector-strong --param=ssp-buffer-size=4 -fPIC -march=x86-64 -gdwarf-4 -fno-debug-types-section -fvar-tracking-assignments -g2 -MT src/logging_striptest0-logging_striptest_main.o -MD -MP -MF src/.deps/logging_striptest0-logging_striptest_main.Tpo -c -o src/logging_striptest0-logging_striptest_main.o `test -f 'src/logging_striptest_main.cc' || echo './'`src/logging_striptest_main.cc mv -f src/.deps/logging_striptest0-logging_striptest_main.Tpo src/.deps/logging_striptest0-logging_striptest_main.Po x86_64-pld-linux-g++ -DHAVE_CONFIG_H -I. -I./src -I./src -pthread -I/usr/include -pthread -I/usr/include -I/usr/include -pthread -Wall -Wwrite-strings -Woverloaded-virtual -Wno-sign-compare -DNO_FRAME_POINTER -O2 -fwrapv -pipe -Wformat -Werror=format-security -gdwarf-4 -fno-debug-types-section -fvar-tracking-assignments -g2 -Wp,-D_FORTIFY_SOURCE=2 -fstack-protector-strong --param=ssp-buffer-size=4 -fPIC -march=x86-64 -gdwarf-4 -fno-debug-types-section -fvar-tracking-assignments -g2 -MT src/logging_striptest2-logging_striptest2.o -MD -MP -MF src/.deps/logging_striptest2-logging_striptest2.Tpo -c -o src/logging_striptest2-logging_striptest2.o `test -f 'src/logging_striptest2.cc' || echo './'`src/logging_striptest2.cc mv -f src/.deps/logging_striptest2-logging_striptest2.Tpo src/.deps/logging_striptest2-logging_striptest2.Po x86_64-pld-linux-g++ -DHAVE_CONFIG_H -I. -I./src -I./src -pthread -I/usr/include -pthread -I/usr/include -I/usr/include -pthread -Wall -Wwrite-strings -Woverloaded-virtual -Wno-sign-compare -DNO_FRAME_POINTER -O2 -fwrapv -pipe -Wformat -Werror=format-security -gdwarf-4 -fno-debug-types-section -fvar-tracking-assignments -g2 -Wp,-D_FORTIFY_SOURCE=2 -fstack-protector-strong --param=ssp-buffer-size=4 -fPIC -march=x86-64 -gdwarf-4 -fno-debug-types-section -fvar-tracking-assignments -g2 -MT src/logging_striptest10-logging_striptest10.o -MD -MP -MF src/.deps/logging_striptest10-logging_striptest10.Tpo -c -o src/logging_striptest10-logging_striptest10.o `test -f 'src/logging_striptest10.cc' || echo './'`src/logging_striptest10.cc mv -f src/.deps/logging_striptest10-logging_striptest10.Tpo src/.deps/logging_striptest10-logging_striptest10.Po x86_64-pld-linux-g++ -DHAVE_CONFIG_H -I. -I./src -I./src -pthread -I/usr/include -pthread -I/usr/include -I/usr/include -pthread -Wall -Wwrite-strings -Woverloaded-virtual -Wno-sign-compare -DNO_FRAME_POINTER -O2 -fwrapv -pipe -Wformat -Werror=format-security -gdwarf-4 -fno-debug-types-section -fvar-tracking-assignments -g2 -Wp,-D_FORTIFY_SOURCE=2 -fstack-protector-strong --param=ssp-buffer-size=4 -fPIC -march=x86-64 -gdwarf-4 -fno-debug-types-section -fvar-tracking-assignments -g2 -MT src/signalhandler_unittest-signalhandler_unittest.o -MD -MP -MF src/.deps/signalhandler_unittest-signalhandler_unittest.Tpo -c -o src/signalhandler_unittest-signalhandler_unittest.o `test -f 'src/signalhandler_unittest.cc' || echo './'`src/signalhandler_unittest.cc mv -f src/.deps/signalhandler_unittest-signalhandler_unittest.Tpo src/.deps/signalhandler_unittest-signalhandler_unittest.Po x86_64-pld-linux-g++ -DHAVE_CONFIG_H -I. -I./src -I./src -pthread -I/usr/include -pthread -I/usr/include -I/usr/include -pthread -Wall -Wwrite-strings -Woverloaded-virtual -Wno-sign-compare -DNO_FRAME_POINTER -O2 -fwrapv -pipe -Wformat -Werror=format-security -gdwarf-4 -fno-debug-types-section -fvar-tracking-assignments -g2 -Wp,-D_FORTIFY_SOURCE=2 -fstack-protector-strong --param=ssp-buffer-size=4 -fPIC -march=x86-64 -gdwarf-4 -fno-debug-types-section -fvar-tracking-assignments -g2 -MT src/stl_logging_unittest-stl_logging_unittest.o -MD -MP -MF src/.deps/stl_logging_unittest-stl_logging_unittest.Tpo -c -o src/stl_logging_unittest-stl_logging_unittest.o `test -f 'src/stl_logging_unittest.cc' || echo './'`src/stl_logging_unittest.cc In file included from /usr/include/c++/7.3.0/ext/hash_set:60:0, from src/glog/stl_logging.h:73, from src/stl_logging_unittest.cc:62: /usr/include/c++/7.3.0/backward/backward_warning.h:32:2: warning: #warning This file includes at least one deprecated or antiquated header which may be removed without further notice at a future date. Please use a non-deprecated interface with equivalent functionality instead. For a listing of replacement headers and interfaces, consult the file backward_warning.h. To disable this warning use -Wno-deprecated. [-Wcpp] #warning \ ^~~~~~~ In file included from src/stl_logging_unittest.cc:63:0: src/googletest.h:579:33: warning: dynamic exception specifications are deprecated in C++11 [-Wdeprecated] void* operator new(size_t size) throw(std::bad_alloc) { ^~~~~ src/googletest.h:586:35: warning: dynamic exception specifications are deprecated in C++11 [-Wdeprecated] void* operator new[](size_t size) throw(std::bad_alloc) { ^~~~~ mv -f src/.deps/stl_logging_unittest-stl_logging_unittest.Tpo src/.deps/stl_logging_unittest-stl_logging_unittest.Po /bin/sh ./libtool --tag=CXX --mode=link x86_64-pld-linux-g++ -Wall -Wwrite-strings -Woverloaded-virtual -Wno-sign-compare -DNO_FRAME_POINTER -DNDEBUG -O2 -fwrapv -pipe -Wformat -Werror=format-security -gdwarf-4 -fno-debug-types-section -fvar-tracking-assignments -g2 -Wp,-D_FORTIFY_SOURCE=2 -fstack-protector-strong --param=ssp-buffer-size=4 -fPIC -march=x86-64 -gdwarf-4 -fno-debug-types-section -fvar-tracking-assignments -g2 -Wl,--as-needed -Wl,--no-copy-dt-needed-entries -Wl,-z,relro -Wl,-z,combreloc -o libglog.la -rpath /usr/lib64 src/libglog_la-logging.lo src/libglog_la-raw_logging.lo src/libglog_la-vlog_is_on.lo src/libglog_la-utilities.lo src/libglog_la-demangle.lo src/libglog_la-symbolize.lo src/libglog_la-signalhandler.lo -lgflags -lunwind -lpthread libtool: link: x86_64-pld-linux-g++ -fPIC -DPIC -shared -nostdlib -O2 -gdwarf-4 -g2 -fstack-protector-strong -march=x86-64 -gdwarf-4 -g2 -Wl,--as-needed -Wl,--no-copy-dt-needed-entries -Wl,-z -Wl,relro -Wl,-z -Wl,combreloc -pthread /usr/lib64/gcc/x86_64-pld-linux/7.3.0/../../../../lib64/crti.o /usr/lib64/gcc/x86_64-pld-linux/7.3.0/crtbeginS.o src/.libs/libglog_la-logging.o src/.libs/libglog_la-raw_logging.o src/.libs/libglog_la-vlog_is_on.o src/.libs/libglog_la-utilities.o src/.libs/libglog_la-demangle.o src/.libs/libglog_la-symbolize.o src/.libs/libglog_la-signalhandler.o -lgflags /usr/lib64/libunwind.so -L/usr/lib64 /usr/lib64/liblzma.so -lpthread -L/usr/lib64/gcc/x86_64-pld-linux/7.3.0 -L/usr/lib64/gcc/x86_64-pld-linux/7.3.0/../../../../lib64 -L/lib/../lib64 -L/usr/lib/../lib64 -L/usr/lib64/gcc/x86_64-pld-linux/7.3.0/../../.. /usr/lib64/libstdc++.so -lm -lc -lgcc_s /usr/lib64/gcc/x86_64-pld-linux/7.3.0/crtendS.o /usr/lib64/gcc/x86_64-pld-linux/7.3.0/../../../../lib64/crtn.o -Wl,-soname -Wl,libglog.so.0 -o .libs/libglog.so.0.0.0 libtool: link: (cd ".libs" && rm -f "libglog.so.0" && ln -s "libglog.so.0.0.0" "libglog.so.0") libtool: link: (cd ".libs" && rm -f "libglog.so" && ln -s "libglog.so.0.0.0" "libglog.so") libtool: link: ar cru .libs/libglog.a src/libglog_la-logging.o src/libglog_la-raw_logging.o src/libglog_la-vlog_is_on.o src/libglog_la-utilities.o src/libglog_la-demangle.o src/libglog_la-symbolize.o src/libglog_la-signalhandler.o libtool: link: ranlib .libs/libglog.a libtool: link: ( cd ".libs" && rm -f "libglog.la" && ln -s "../libglog.la" "libglog.la" ) /bin/sh ./libtool --tag=CXX --mode=link x86_64-pld-linux-g++ -pthread -I/usr/include -pthread -I/usr/include -I/usr/include -pthread -Wall -Wwrite-strings -Woverloaded-virtual -Wno-sign-compare -DNO_FRAME_POINTER -O2 -fwrapv -pipe -Wformat -Werror=format-security -gdwarf-4 -fno-debug-types-section -fvar-tracking-assignments -g2 -Wp,-D_FORTIFY_SOURCE=2 -fstack-protector-strong --param=ssp-buffer-size=4 -fPIC -march=x86-64 -gdwarf-4 -fno-debug-types-section -fvar-tracking-assignments -g2 -pthread -Wl,--as-needed -Wl,--no-copy-dt-needed-entries -Wl,-z,relro -Wl,-z,combreloc -o demangle_unittest src/demangle_unittest-demangle_unittest.o libglog.la -lgflags -lunwind -L/usr/lib64 -lgtest -pthread -L/usr/lib64 -L/usr/lib64 -lgmock -lgtest -pthread -lgflags -lpthread libtool: link: x86_64-pld-linux-g++ -pthread -I/usr/include -pthread -I/usr/include -I/usr/include -pthread -Wall -Wwrite-strings -Woverloaded-virtual -Wno-sign-compare -DNO_FRAME_POINTER -O2 -fwrapv -pipe -Wformat -Werror=format-security -gdwarf-4 -fno-debug-types-section -fvar-tracking-assignments -g2 -Wp,-D_FORTIFY_SOURCE=2 -fstack-protector-strong --param=ssp-buffer-size=4 -fPIC -march=x86-64 -gdwarf-4 -fno-debug-types-section -fvar-tracking-assignments -g2 -pthread -Wl,--as-needed -Wl,--no-copy-dt-needed-entries -Wl,-z -Wl,relro -Wl,-z -Wl,combreloc -o .libs/demangle_unittest src/demangle_unittest-demangle_unittest.o -pthread -pthread ./.libs/libglog.so /usr/lib64/libunwind.so -lc -lgcc_s /usr/lib64/liblzma.so -L/usr/lib64 -lgmock /usr/lib64/libgtest.so /usr/lib64/libstdc++.so -lm -lgflags -lpthread -pthread /usr/bin/ld: cannot find -lgmock collect2: error: ld returned 1 exit status make: *** [Makefile:1066: demangle_unittest] Error 1 make: *** Waiting for unfinished jobs.... x86_64-pld-linux-g++ -DHAVE_CONFIG_H -I. -I./src -I./src -pthread -I/usr/include -pthread -I/usr/include -I/usr/include -pthread -Wall -Wwrite-strings -Woverloaded-virtual -Wno-sign-compare -DNO_FRAME_POINTER -O2 -fwrapv -pipe -Wformat -Werror=format-security -gdwarf-4 -fno-debug-types-section -fvar-tracking-assignments -g2 -Wp,-D_FORTIFY_SOURCE=2 -fstack-protector-strong --param=ssp-buffer-size=4 -fPIC -march=x86-64 -gdwarf-4 -fno-debug-types-section -fvar-tracking-assignments -g2 -MT src/logging_unittest-logging_unittest.o -MD -MP -MF src/.deps/logging_unittest-logging_unittest.Tpo -c -o src/logging_unittest-logging_unittest.o `test -f 'src/logging_unittest.cc' || echo './'`src/logging_unittest.cc In file included from src/logging_unittest.cc:58:0: src/googletest.h:579:33: warning: dynamic exception specifications are deprecated in C++11 [-Wdeprecated] void* operator new(size_t size) throw(std::bad_alloc) { ^~~~~ src/googletest.h:586:35: warning: dynamic exception specifications are deprecated in C++11 [-Wdeprecated] void* operator new[](size_t size) throw(std::bad_alloc) { ^~~~~ In file included from src/utilities.h:82:0, from src/logging_unittest.cc:33: src/logging_unittest.cc: In function 'void TestLogging(bool)': src/glog/logging.h:943:30: warning: typedef 'INVALID_REQUESTED_LOG_SEVERITY' locally defined but not used [-Wunused-local-typedefs] INVALID_REQUESTED_LOG_SEVERITY); \ ^ src/glog/logging.h:938:73: note: in definition of macro 'GOOGLE_GLOG_COMPILE_ASSERT' typedef google::glog_internal_namespace_::CompileAssert<(bool(expr))> msg[bool(expr) ? 1 : -1] ^~~ src/logging_unittest.cc:256:5: note: in expansion of macro 'LOG_EVERY_N' LOG_EVERY_N(ERROR, 4) << "Log every 4, iteration " << COUNTER << endl; ^~~~~~~~~~~ src/logging_unittest.cc: In function 'void TestDCHECK()': src/logging_unittest.cc:569:3: warning: 'template<class> class std::auto_ptr' is deprecated [-Wdeprecated-declarations] auto_ptr<int64> sptr(new int64); ^~~~~~~~ In file included from /usr/include/c++/7.3.0/bits/locale_conv.h:41:0, from /usr/include/c++/7.3.0/locale:43, from /usr/include/c++/7.3.0/iomanip:43, from src/logging_unittest.cc:44: /usr/include/c++/7.3.0/bits/unique_ptr.h:51:28: note: declared here template<typename> class auto_ptr; ^~~~~~~~ mv -f src/.deps/logging_unittest-logging_unittest.Tpo src/.deps/logging_unittest-logging_unittest.Po /bin/sh ./libtool --tag=CXX --mode=link x86_64-pld-linux-g++ -pthread -I/usr/include -pthread -I/usr/include -I/usr/include -pthread -Wall -Wwrite-strings -Woverloaded-virtual -Wno-sign-compare -DNO_FRAME_POINTER -O2 -fwrapv -pipe -Wformat -Werror=format-security -gdwarf-4 -fno-debug-types-section -fvar-tracking-assignments -g2 -Wp,-D_FORTIFY_SOURCE=2 -fstack-protector-strong --param=ssp-buffer-size=4 -fPIC -march=x86-64 -gdwarf-4 -fno-debug-types-section -fvar-tracking-assignments -g2 -pthread -Wl,--as-needed -Wl,--no-copy-dt-needed-entries -Wl,-z,relro -Wl,-z,combreloc -o stacktrace_unittest src/stacktrace_unittest-stacktrace_unittest.o libglog.la -lgflags -lunwind -lpthread libtool: link: x86_64-pld-linux-g++ -pthread -I/usr/include -pthread -I/usr/include -I/usr/include -pthread -Wall -Wwrite-strings -Woverloaded-virtual -Wno-sign-compare -DNO_FRAME_POINTER -O2 -fwrapv -pipe -Wformat -Werror=format-security -gdwarf-4 -fno-debug-types-section -fvar-tracking-assignments -g2 -Wp,-D_FORTIFY_SOURCE=2 -fstack-protector-strong --param=ssp-buffer-size=4 -fPIC -march=x86-64 -gdwarf-4 -fno-debug-types-section -fvar-tracking-assignments -g2 -pthread -Wl,--as-needed -Wl,--no-copy-dt-needed-entries -Wl,-z -Wl,relro -Wl,-z -Wl,combreloc -o .libs/stacktrace_unittest src/stacktrace_unittest-stacktrace_unittest.o ./.libs/libglog.so /usr/lib64/libstdc++.so -lm -lgflags /usr/lib64/libunwind.so -lc -lgcc_s /usr/lib64/liblzma.so -lpthread -pthread /bin/sh ./libtool --tag=CXX --mode=link x86_64-pld-linux-g++ -pthread -I/usr/include -pthread -I/usr/include -I/usr/include -pthread -Wall -Wwrite-strings -Woverloaded-virtual -Wno-sign-compare -DNO_FRAME_POINTER -O2 -fwrapv -pipe -Wformat -Werror=format-security -gdwarf-4 -fno-debug-types-section -fvar-tracking-assignments -g2 -Wp,-D_FORTIFY_SOURCE=2 -fstack-protector-strong --param=ssp-buffer-size=4 -fPIC -march=x86-64 -gdwarf-4 -fno-debug-types-section -fvar-tracking-assignments -g2 -pthread -Wl,--as-needed -Wl,--no-copy-dt-needed-entries -Wl,-z,relro -Wl,-z,combreloc -o symbolize_unittest src/symbolize_unittest-symbolize_unittest.o libglog.la -lgflags -lunwind -L/usr/lib64 -lgtest -pthread -L/usr/lib64 -L/usr/lib64 -lgmock -lgtest -pthread -lgflags -lpthread libtool: link: x86_64-pld-linux-g++ -pthread -I/usr/include -pthread -I/usr/include -I/usr/include -pthread -Wall -Wwrite-strings -Woverloaded-virtual -Wno-sign-compare -DNO_FRAME_POINTER -O2 -fwrapv -pipe -Wformat -Werror=format-security -gdwarf-4 -fno-debug-types-section -fvar-tracking-assignments -g2 -Wp,-D_FORTIFY_SOURCE=2 -fstack-protector-strong --param=ssp-buffer-size=4 -fPIC -march=x86-64 -gdwarf-4 -fno-debug-types-section -fvar-tracking-assignments -g2 -pthread -Wl,--as-needed -Wl,--no-copy-dt-needed-entries -Wl,-z -Wl,relro -Wl,-z -Wl,combreloc -o .libs/symbolize_unittest src/symbolize_unittest-symbolize_unittest.o -pthread -pthread ./.libs/libglog.so /usr/lib64/libunwind.so -lc -lgcc_s /usr/lib64/liblzma.so -L/usr/lib64 -lgmock /usr/lib64/libgtest.so /usr/lib64/libstdc++.so -lm -lgflags -lpthread -pthread /usr/bin/ld: cannot find -lgmock collect2: error: ld returned 1 exit status make: *** [Makefile:1120: symbolize_unittest] Error 1 x86_64-pld-linux-g++ -DHAVE_CONFIG_H -I. -I./src -I./src -pthread -I/usr/include -pthread -I/usr/include -I/usr/include -pthread -Wall -Wwrite-strings -Woverloaded-virtual -Wno-sign-compare -DNO_FRAME_POINTER -O2 -fwrapv -pipe -Wformat -Werror=format-security -gdwarf-4 -fno-debug-types-section -fvar-tracking-assignments -g2 -Wp,-D_FORTIFY_SOURCE=2 -fstack-protector-strong --param=ssp-buffer-size=4 -fPIC -march=x86-64 -gdwarf-4 -fno-debug-types-section -fvar-tracking-assignments -g2 -MT src/mock_log_test-mock-log_test.o -MD -MP -MF src/.deps/mock_log_test-mock-log_test.Tpo -c -o src/mock_log_test-mock-log_test.o `test -f 'src/mock-log_test.cc' || echo './'`src/mock-log_test.cc mv -f src/.deps/mock_log_test-mock-log_test.Tpo src/.deps/mock_log_test-mock-log_test.Po error: Bad exit status from /tmp/B.0frP7b/BUILD/tmp/rpm-tmp.23771 (%build) RPM build errors: Bad exit status from /tmp/B.0frP7b/BUILD/tmp/rpm-tmp.23771 (%build) ended at: Tue Feb 13 21:23:32 2018, done in 0:00:23.591317 error: No files produced. mesg: ttyname failed: Inappropriate ioctl for device + chmod -R u+rwX /tmp/B.0frP7b/BUILD + rm -rf /tmp/B.0frP7b/tmp /tmp/B.0frP7b/BUILD mesg: ttyname failed: Inappropriate ioctl for device + rm -rf /tmp/B.0frP7b Begin-PLD-Builder-Info Build-Time: user:46.10s sys:4.93s real:25.95s (faults io:0 non-io:1985564) End-PLD-Builder-Info
[Back to list of logs] [View rpm -qa of builder]