FailedOk

th/SRPMS[OK]
th/x32[OK]
th/i686[OK]
th/x86_64[OK]

ac/SRPMS[OK]
ac/i386[OK]
ac/i586[OK]
ac/i686[OK]
ac/alpha[OK]
ac/amd64[OK]
ac/athlon[OK]
ac/ppc[OK]
ac/sparc[OK]
ac/sparc64[OK]

Advanced Search
main()
Powered by PLD Linux
(c) 2002-2018 PLD Team
$Revision: 1.37 $
Powered by VAX.
Your IP: 54.80.58.121

isdn4k-utils 96bc6632-91d7-466b-b083-e3065712fd7a

Status:Failed
Source URL:ftp://buildlogs.pld-linux.org/th/x86_64/FAIL/isdn4k-utils,96bc6632-91d7-466b-b083-e3065712fd7a.bz2
text/plain URL:View!
full text:View!
rpm -qa of builder:View!
Date:2018/03/07 11:03:49
Runtime:0:01:10.535033

Toc:

  • error 1
  • make[1]: *** [Makefile:179: dest.cdb] Error 2
  • error 2
  • error: Bad exit status from /tmp/B.qBRNb_/BUILD/tmp/rpm-tmp.8887 (%build)
  • error 3
  • RPM build errors:
  • error 4
  • error: No files produced.

Content:

x86_64-pld-linux-gcc -DSTANDALONE -DDESTTEST  -Wall -g ../dest.c ../cdb/i4l_cdb.a  -o dest
../dest.c: In function 'initDest':
../dest.c:171:12: warning: pointer targets in assignment differ in signedness [-Wpointer-sign]
   key.dptr = vinfo;
            ^
../dest.c: In function 'getDest':
../dest.c:264:12: warning: pointer targets in assignment differ in signedness [-Wpointer-sign]
   key.dptr = number;
            ^
../dest.c:279:18: warning: pointer targets in passing argument 1 of 'isKey' differ in signedness [-Wpointer-sign]
       if (!isKey(value.dptr + 1)) {
                  ^~~~~
../dest.c:203:13: note: expected 'const char *' but argument is of type 'unsigned char *'
 static bool isKey(const char *p)
             ^~~~~
../dest.c:280:16: warning: pointer targets in passing argument 1 of 'strdup' differ in signedness [-Wpointer-sign]
  city = strdup(value.dptr + 1);
                ^~~~~
In file included from ../dest.c:37:0:
/usr/include/string.h:166:14: note: expected 'const char *' but argument is of type 'unsigned char *'
 extern char *strdup (const char *__s)
              ^~~~~~
../dest.c:286:20: warning: pointer targets in passing argument 2 of 'append' differ in signedness [-Wpointer-sign]
  append(num->keys, value.dptr + 1);
                    ^~~~~
../dest.c:192:13: note: expected 'char *' but argument is of type 'unsigned char *'
 static void append(char *dest, char *what)
             ^~~~~~
../dest.c:287:21: warning: pointer targets in passing argument 2 of 'Strncpy' differ in signedness [-Wpointer-sign]
         Strncpy(tld,value.dptr+1,TN_MAX_TLD_LEN);
                     ^~~~~
../dest.c:64:9: note: expected 'const char *' but argument is of type 'unsigned char *'
 char   *Strncpy(char *dest, const char *src, int len);
         ^~~~~~~
../dest.c:308:7: warning: pointer targets in assignment differ in signedness [-Wpointer-sign]
     s = value.dptr;
       ^
../dest.c:386:16: warning: pointer targets in assignment differ in signedness [-Wpointer-sign]
       key.dptr = p + 1;
                ^
../dest.c: In function 'main':
../dest.c:464:32: warning: format '%d' expects argument of type 'int', but argument 2 has type 'size_t {aka long unsigned int}' [-Wformat=]
       printf("   .vbn       (%2d of %2d): %s\n",
                              ~~^
                              %2ld
              strlen(num.vbn), TN_MAX_VBN_LEN-1, num.vbn);
              ~~~~~~~~~~~~~~~    
../dest.c:466:32: warning: format '%d' expects argument of type 'int', but argument 2 has type 'size_t {aka long unsigned int}' [-Wformat=]
       printf("   .provider  (%2d of %2d): %s\n",
                              ~~^
                              %2ld
              strlen(num.provider), TN_MAX_PROVIDER_LEN-1, num.provider);
              ~~~~~~~~~~~~~~~~~~~~
../dest.c:469:32: warning: format '%d' expects argument of type 'int', but argument 2 has type 'size_t {aka long unsigned int}' [-Wformat=]
       printf("   .scountry  (%2d of %2d): %s\n",
                              ~~^
                              %2ld
              strlen(num.scountry), TN_MAX_SCOUNTRY_LEN-1, num.scountry);
              ~~~~~~~~~~~~~~~~~~~~
../dest.c:471:32: warning: format '%d' expects argument of type 'int', but argument 2 has type 'size_t {aka long unsigned int}' [-Wformat=]
       printf("   .country   (%2d of %2d): %s\n",
                              ~~^
                              %2ld
              strlen(num.country), TN_MAX_COUNTRY_LEN-1, num.country);
              ~~~~~~~~~~~~~~~~~~~
../dest.c:473:32: warning: format '%d' expects argument of type 'int', but argument 2 has type 'size_t {aka long unsigned int}' [-Wformat=]
       printf("   .keys      (%2d of %2d): %s\n",
                              ~~^
                              %2ld
              strlen(num.keys), TN_MAX_SCOUNTRY_LEN-1, num.keys);
              ~~~~~~~~~~~~~~~~   
../dest.c:475:32: warning: format '%d' expects argument of type 'int', but argument 2 has type 'size_t {aka long unsigned int}' [-Wformat=]
       printf("   .tld       (%2d of %2d): %s\n",
                              ~~^
                              %2ld
              strlen(num.tld), TN_MAX_TLD_LEN-1, num.tld);
              ~~~~~~~~~~~~~~~    
../dest.c:478:32: warning: format '%d' expects argument of type 'int', but argument 2 has type 'size_t {aka long unsigned int}' [-Wformat=]
       printf("   .area      (%2d of %2d): %s\n",
                              ~~^
                              %2ld
              strlen(num.area), TN_MAX_AREA_LEN-1, num.area);
              ~~~~~~~~~~~~~~~~   
../dest.c:481:32: warning: format '%d' expects argument of type 'int', but argument 2 has type 'size_t {aka long unsigned int}' [-Wformat=]
       printf("   .sarea     (%2d of %2d): %s\n",
                              ~~^
                              %2ld
              strlen(num.sarea), TN_MAX_SAREA_LEN-1, num.sarea);
              ~~~~~~~~~~~~~~~~~  
../dest.c:483:32: warning: format '%d' expects argument of type 'int', but argument 2 has type 'size_t {aka long unsigned int}' [-Wformat=]
       printf("   .msn       (%2d of %2d): %s\n\n",
                              ~~^
                              %2ld
              strlen(num.msn), TN_MAX_MSN_LEN-1, num.msn);
              ~~~~~~~~~~~~~~~    
Building destination database dest.cdb ...
./makedest -v 
Can't locate wld.pm in @INC (you may need to install the wld module) (@INC contains: /usr/local/lib/perl5/5.26.0/x86_64-pld-linux-thread-multi /usr/local/share/perl5 /usr/lib64/perl5/vendor_perl/5.26.0/x86_64-pld-linux-thread-multi /usr/share/perl5/vendor_perl /usr/lib64/perl5/5.26.1/x86_64-pld-linux-thread-multi /usr/share/perl5/5.26.1) at ./makedest line 33.
BEGIN failed--compilation aborted at ./makedest line 33.
make[1]: *** [Makefile:179: dest.cdb] Error 2
make[1]: Leaving directory '/tmp/B.qBRNb_/BUILD/isdn4k-utils/isdnlog/tools/dest'
make: *** [Makefile:121: subtargets] Error 2
error: Bad exit status from /tmp/B.qBRNb_/BUILD/tmp/rpm-tmp.8887 (%build)


RPM build errors:
    Bad exit status from /tmp/B.qBRNb_/BUILD/tmp/rpm-tmp.8887 (%build)
ended at: Wed Mar  7 11:03:49 2018, done in 0:01:10.535033
error: No files produced.
mesg: ttyname failed: Inappropriate ioctl for device
+ chmod -R u+rwX /tmp/B.qBRNb_/BUILD
+ rm -rf /tmp/B.qBRNb_/tmp /tmp/B.qBRNb_/BUILD
mesg: ttyname failed: Inappropriate ioctl for device
+ rm -rf /tmp/B.qBRNb_
Begin-PLD-Builder-Info
Build-Time: user:26.93s sys:7.48s real:75.46s (faults io:0 non-io:4028982)

End-PLD-Builder-Info
[Back to list of logs] [View rpm -qa of builder]