FailedOk

th/SRPMS[OK]
th/x32[OK]
th/i686[OK]
th/x86_64[OK]

ac/SRPMS[OK]
ac/i386[OK]
ac/i586[OK]
ac/i686[OK]
ac/alpha[OK]
ac/amd64[OK]
ac/athlon[OK]
ac/ppc[OK]
ac/sparc[OK]
ac/sparc64[OK]

Advanced Search
main()
Powered by PLD Linux
(c) 2002-2019 PLD Team
$Revision: 1.37 $
Powered by ed.
Your IP: 18.208.211.150

kernel 316b7449-9fd5-4811-8340-00d5bdab96b2

Status:Failed
Source URL:ftp://buildlogs.pld-linux.org/th/x86_64/FAIL/kernel,316b7449-9fd5-4811-8340-00d5bdab96b2.bz2
text/plain URL:View!
full text:View!
rpm -qa of builder:View!
Date:2018/12/27 01:40:17
Runtime:0:05:24.826356

Toc:

  • error 1
  • error: No files produced.
  • error 2
  • make[4]: *** [/tmp/B.RTyz6j/BUILD/kernel-4.19.12/linux-4.19/scripts/Makefile.build:309: drivers/ata/pata_piccolo.o] Error 2
  • error 3
  • /tmp/B.RTyz6j/BUILD/kernel-4.19.12/linux-4.19/include/linux/device.h:29:10: fatal error: asm/device.h: No such file or directory
  • error 4
  • compilation terminated.
  • error 5
  • make[4]: *** [/tmp/B.RTyz6j/BUILD/kernel-4.19.12/linux-4.19/scripts/Makefile.build:309: drivers/ata/pata_triflex.o] Error 1
  • error 6
  • /tmp/B.RTyz6j/BUILD/kernel-4.19.12/linux-4.19/arch/x86/include/asm/uaccess.h:13:10: fatal error: asm/extable.h: No such file or directory
  • error 7
  • compilation terminated.
  • error 8
  • make[5]: *** [/tmp/B.RTyz6j/BUILD/kernel-4.19.12/linux-4.19/scripts/Makefile.build:304: sound/firewire/fireworks/fireworks_pcm.o] Error 1
  • error 9
  • /tmp/B.RTyz6j/BUILD/kernel-4.19.12/linux-4.19/include/linux/interrupt.h:19:10: fatal error: asm/irq.h: No such file or directory
  • error 10
  • compilation terminated.
  • error 11
  • make[4]: *** [/tmp/B.RTyz6j/BUILD/kernel-4.19.12/linux-4.19/scripts/Makefile.build:304: fs/dlm/recover.o] Error 1
  • error 12
  • /tmp/B.RTyz6j/BUILD/kernel-4.19.12/linux-4.19/arch/x86/include/asm/processor.h:24:10: fatal error: asm/special_insns.h: No such file or directory
  • error 13
  • compilation terminated.
  • error 14
  • make[4]: *** [/tmp/B.RTyz6j/BUILD/kernel-4.19.12/linux-4.19/scripts/Makefile.build:309: drivers/ata/pata_via.o] Error 1
  • error 15
  • /tmp/B.RTyz6j/BUILD/kernel-4.19.12/linux-4.19/include/uapi/linux/types.h:5:10: fatal error: asm/types.h: No such file or directory
  • error 16
  • compilation terminated.
  • error 17
  • make[5]: *** [/tmp/B.RTyz6j/BUILD/kernel-4.19.12/linux-4.19/scripts/Makefile.build:304: sound/firewire/fireworks/fireworks_hwdep.o] Error 1
  • error 18
  • make[4]: *** [/tmp/B.RTyz6j/BUILD/kernel-4.19.12/linux-4.19/scripts/Makefile.build:544: sound/firewire/fireworks] Error 2
  • error 19
  • /tmp/B.RTyz6j/BUILD/kernel-4.19.12/linux-4.19/include/uapi/linux/types.h:5:10: fatal error: asm/types.h: No such file or directory
  • error 20
  • compilation terminated.
  • error 21
  • make[5]: *** [/tmp/B.RTyz6j/BUILD/kernel-4.19.12/linux-4.19/scripts/Makefile.build:303: drivers/block/drbd/drbd_nl.o] Error 1
  • error 22
  • /tmp/B.RTyz6j/BUILD/kernel-4.19.12/linux-4.19/include/linux/bug.h:5:10: fatal error: asm/bug.h: No such file or directory
  • error 23
  • compilation terminated.
  • error 24
  • make[4]: *** [/tmp/B.RTyz6j/BUILD/kernel-4.19.12/linux-4.19/scripts/Makefile.build:304: fs/dlm/recoverd.o] Error 1
  • error 25
  • make[3]: *** [/tmp/B.RTyz6j/BUILD/kernel-4.19.12/linux-4.19/scripts/Makefile.build:544: fs/dlm] Error 2
  • error 26
  • make[2]: *** [/tmp/B.RTyz6j/BUILD/kernel-4.19.12/linux-4.19/Makefile:1052: fs] Error 2
  • error 27
  • make[3]: *** [/tmp/B.RTyz6j/BUILD/kernel-4.19.12/linux-4.19/scripts/Makefile.build:544: sound/firewire] Error 2
  • error 28
  • /tmp/B.RTyz6j/BUILD/kernel-4.19.12/linux-4.19/drivers/block/drbd/drbd_interval.c:2:10: fatal error: asm/bug.h: No such file or directory
  • error 29
  • compilation terminated.
  • error 30
  • make[5]: *** [/tmp/B.RTyz6j/BUILD/kernel-4.19.12/linux-4.19/scripts/Makefile.build:303: drivers/block/drbd/drbd_interval.o] Error 1
  • error 31
  • /tmp/B.RTyz6j/BUILD/kernel-4.19.12/linux-4.19/include/linux/linkage.h:8:10: fatal error: asm/linkage.h: No such file or directory
  • error 32
  • compilation terminated.
  • error 33
  • make[3]: *** [/tmp/B.RTyz6j/BUILD/kernel-4.19.12/linux-4.19/scripts/Makefile.build:544: drivers/ata] Error 2
  • error 34
  • /tmp/B.RTyz6j/BUILD/kernel-4.19.12/linux-4.19/include/uapi/linux/types.h:5:10: fatal error: asm/types.h: No such file or directory
  • error 35
  • compilation terminated.
  • error 36
  • make[5]: *** [/tmp/B.RTyz6j/BUILD/kernel-4.19.12/linux-4.19/scripts/Makefile.build:303: drivers/block/drbd/drbd_state.o] Error 1
  • error 37
  • make[4]: *** [/tmp/B.RTyz6j/BUILD/kernel-4.19.12/linux-4.19/scripts/Makefile.build:544: drivers/block/drbd] Error 2
  • error 38
  • /tmp/B.RTyz6j/BUILD/kernel-4.19.12/linux-4.19/include/uapi/linux/types.h:5:10: fatal error: asm/types.h: No such file or directory
  • error 39
  • compilation terminated.
  • error 40
  • make[3]: *** [/tmp/B.RTyz6j/BUILD/kernel-4.19.12/linux-4.19/scripts/Makefile.build:303: kernel/compat.o] Error 1
  • error 41
  • /tmp/B.RTyz6j/BUILD/kernel-4.19.12/linux-4.19/include/uapi/linux/types.h:5:10: fatal error: asm/types.h: No such file or directory
  • error 42
  • compilation terminated.
  • error 43
  • make[4]: *** [/tmp/B.RTyz6j/BUILD/kernel-4.19.12/linux-4.19/scripts/Makefile.build:304: drivers/block/brd.o] Error 1
  • error 44
  • /tmp/B.RTyz6j/BUILD/kernel-4.19.12/linux-4.19/include/uapi/linux/types.h:5:10: fatal error: asm/types.h: No such file or directory
  • error 45
  • compilation terminated.
  • error 46
  • make[5]: *** [/tmp/B.RTyz6j/BUILD/kernel-4.19.12/linux-4.19/scripts/Makefile.build:303: sound/pci/ac97/ac97_codec.o] Error 1
  • error 47
  • /tmp/B.RTyz6j/BUILD/kernel-4.19.12/linux-4.19/include/uapi/linux/types.h:5:10: fatal error: asm/types.h: No such file or directory
  • error 48
  • compilation terminated.
  • error 49
  • make[5]: *** [/tmp/B.RTyz6j/BUILD/kernel-4.19.12/linux-4.19/scripts/Makefile.build:304: sound/pci/ali5451/ali5451.o] Error 1
  • error 50
  • /tmp/B.RTyz6j/BUILD/kernel-4.19.12/linux-4.19/include/uapi/linux/types.h:5:10: fatal error: asm/types.h: No such file or directory
  • error 51
  • compilation terminated.
  • error 52
  • make[3]: *** [/tmp/B.RTyz6j/BUILD/kernel-4.19.12/linux-4.19/scripts/Makefile.build:303: kernel/utsname.o] Error 1
  • error 53
  • make[4]: *** [/tmp/B.RTyz6j/BUILD/kernel-4.19.12/linux-4.19/scripts/Makefile.build:544: sound/pci/ali5451] Error 2
  • error 54
  • x86_64-pld-linux-gcc: error: /tmp/B.RTyz6j/BUILD/kernel-4.19.12/linux-4.19/drivers/block/paride/aten.c: No such file or directory
  • error 55
  • x86_64-pld-linux-gcc: fatal error: no input files
  • error 56
  • compilation terminated.
  • error 57
  • make[4]: *** [/tmp/B.RTyz6j/BUILD/kernel-4.19.12/linux-4.19/scripts/Makefile.build:309: drivers/block/paride/aten.o] Error 1
  • error 58
  • /tmp/B.RTyz6j/BUILD/kernel-4.19.12/linux-4.19/include/uapi/linux/types.h:5:10: fatal error: asm/types.h: No such file or directory
  • error 59
  • compilation terminated.
  • error 60
  • make[5]: *** [/tmp/B.RTyz6j/BUILD/kernel-4.19.12/linux-4.19/scripts/Makefile.build:304: drivers/block/zram/zcomp.o] Error 1
  • error 61
  • cc1: fatal error: /tmp/B.RTyz6j/BUILD/kernel-4.19.12/linux-4.19/drivers/block/zram/zram_drv.c: No such file or directory
  • error 62
  • compilation terminated.
  • error 63
  • make[5]: *** [/tmp/B.RTyz6j/BUILD/kernel-4.19.12/linux-4.19/scripts/Makefile.build:304: drivers/block/zram/zram_drv.o] Error 1
  • error 64
  • make[4]: *** [/tmp/B.RTyz6j/BUILD/kernel-4.19.12/linux-4.19/scripts/Makefile.build:544: drivers/block/zram] Error 2
  • error 65
  • make[3]: *** [/tmp/B.RTyz6j/BUILD/kernel-4.19.12/linux-4.19/scripts/Makefile.build:544: drivers/block] Error 2
  • error 66
  • cc1: fatal error: /tmp/B.RTyz6j/BUILD/kernel-4.19.12/linux-4.19/drivers/block/paride/paride.c: No such file or directory
  • error 67
  • compilation terminated.
  • error 68
  • make[4]: *** [/tmp/B.RTyz6j/BUILD/kernel-4.19.12/linux-4.19/scripts/Makefile.build:309: drivers/block/paride/paride.o] Error 1
  • error 69
  • make[3]: *** [/tmp/B.RTyz6j/BUILD/kernel-4.19.12/linux-4.19/scripts/Makefile.build:544: drivers/block/paride] Error 2
  • error 70
  • make[2]: *** [/tmp/B.RTyz6j/BUILD/kernel-4.19.12/linux-4.19/Makefile:1052: drivers] Error 2
  • error 71
  • /tmp/B.RTyz6j/BUILD/kernel-4.19.12/linux-4.19/include/uapi/linux/types.h:5:10: fatal error: asm/types.h: No such file or directory
  • error 72
  • compilation terminated.
  • error 73
  • make[3]: *** [/tmp/B.RTyz6j/BUILD/kernel-4.19.12/linux-4.19/scripts/Makefile.build:303: kernel/user_namespace.o] Error 1
  • error 74
  • make[2]: *** [/tmp/B.RTyz6j/BUILD/kernel-4.19.12/linux-4.19/Makefile:1052: kernel] Error 2
  • error 75
  • /tmp/B.RTyz6j/BUILD/kernel-4.19.12/linux-4.19/include/uapi/linux/types.h:5:10: fatal error: asm/types.h: No such file or directory
  • error 76
  • compilation terminated.
  • error 77
  • make[5]: *** [/tmp/B.RTyz6j/BUILD/kernel-4.19.12/linux-4.19/scripts/Makefile.build:303: sound/pci/ac97/ac97_pcm.o] Error 1
  • error 78
  • make[4]: *** [/tmp/B.RTyz6j/BUILD/kernel-4.19.12/linux-4.19/scripts/Makefile.build:544: sound/pci/ac97] Error 2
  • error 79
  • /tmp/B.RTyz6j/BUILD/kernel-4.19.12/linux-4.19/include/uapi/linux/types.h:5:10: fatal error: asm/types.h: No such file or directory
  • error 80
  • compilation terminated.
  • error 81
  • make[5]: *** [/tmp/B.RTyz6j/BUILD/kernel-4.19.12/linux-4.19/scripts/Makefile.build:304: sound/pcmcia/pdaudiocf/pdaudiocf_irq.o] Error 1
  • error 82
  • /tmp/B.RTyz6j/BUILD/kernel-4.19.12/linux-4.19/include/uapi/linux/types.h:5:10: fatal error: asm/types.h: No such file or directory
  • error 83
  • compilation terminated.
  • error 84
  • make[5]: *** [/tmp/B.RTyz6j/BUILD/kernel-4.19.12/linux-4.19/scripts/Makefile.build:304: sound/pcmcia/pdaudiocf/pdaudiocf.o] Error 1
  • error 85
  • /tmp/B.RTyz6j/BUILD/kernel-4.19.12/linux-4.19/include/uapi/linux/types.h:5:10: fatal error: asm/types.h: No such file or directory
  • error 86
  • compilation terminated.
  • error 87
  • make[5]: *** [/tmp/B.RTyz6j/BUILD/kernel-4.19.12/linux-4.19/scripts/Makefile.build:304: sound/pcmcia/pdaudiocf/pdaudiocf_pcm.o] Error 1
  • error 88
  • /tmp/B.RTyz6j/BUILD/kernel-4.19.12/linux-4.19/include/uapi/linux/types.h:5:10: fatal error: asm/types.h: No such file or directory
  • error 89
  • compilation terminated.
  • error 90
  • make[5]: *** [/tmp/B.RTyz6j/BUILD/kernel-4.19.12/linux-4.19/scripts/Makefile.build:304: sound/pcmcia/pdaudiocf/pdaudiocf_core.o] Error 1
  • error 91
  • make[4]: *** [/tmp/B.RTyz6j/BUILD/kernel-4.19.12/linux-4.19/scripts/Makefile.build:544: sound/pcmcia/pdaudiocf] Error 2
  • error 92
  • /tmp/B.RTyz6j/BUILD/kernel-4.19.12/linux-4.19/include/uapi/linux/types.h:5:10: fatal error: asm/types.h: No such file or directory
  • error 93
  • compilation terminated.
  • error 94
  • make[5]: *** [/tmp/B.RTyz6j/BUILD/kernel-4.19.12/linux-4.19/scripts/Makefile.build:304: sound/pcmcia/vx/vxpocket.o] Error 1
  • error 95
  • /tmp/B.RTyz6j/BUILD/kernel-4.19.12/linux-4.19/include/uapi/linux/types.h:5:10: fatal error: asm/types.h: No such file or directory
  • error 96
  • compilation terminated.
  • error 97
  • make[5]: *** [/tmp/B.RTyz6j/BUILD/kernel-4.19.12/linux-4.19/scripts/Makefile.build:304: sound/pcmcia/vx/vxp_mixer.o] Error 1
  • error 98
  • /tmp/B.RTyz6j/BUILD/kernel-4.19.12/linux-4.19/include/uapi/linux/types.h:5:10: fatal error: asm/types.h: No such file or directory
  • error 99
  • compilation terminated.
  • error 100
  • make[5]: *** [/tmp/B.RTyz6j/BUILD/kernel-4.19.12/linux-4.19/scripts/Makefile.build:304: sound/pcmcia/vx/vxp_ops.o] Error 1
  • error 101
  • make[4]: *** [/tmp/B.RTyz6j/BUILD/kernel-4.19.12/linux-4.19/scripts/Makefile.build:544: sound/pcmcia/vx] Error 2
  • error 102
  • make[3]: *** [/tmp/B.RTyz6j/BUILD/kernel-4.19.12/linux-4.19/scripts/Makefile.build:544: sound/pcmcia] Error 2
  • error 103
  • /tmp/B.RTyz6j/BUILD/kernel-4.19.12/linux-4.19/include/uapi/linux/types.h:5:10: fatal error: asm/types.h: No such file or directory
  • error 104
  • compilation terminated.
  • error 105
  • make[5]: *** [/tmp/B.RTyz6j/BUILD/kernel-4.19.12/linux-4.19/scripts/Makefile.build:304: sound/pci/asihpi/asihpi.o] Error 1
  • error 106
  • /tmp/B.RTyz6j/BUILD/kernel-4.19.12/linux-4.19/include/uapi/linux/types.h:5:10: fatal error: asm/types.h: No such file or directory
  • error 107
  • compilation terminated.
  • error 108
  • make[5]: *** [/tmp/B.RTyz6j/BUILD/kernel-4.19.12/linux-4.19/scripts/Makefile.build:304: sound/pci/asihpi/hpioctl.o] Error 1
  • error 109
  • /tmp/B.RTyz6j/BUILD/kernel-4.19.12/linux-4.19/include/uapi/linux/types.h:5:10: fatal error: asm/types.h: No such file or directory
  • error 110
  • compilation terminated.
  • error 111
  • make[5]: *** [/tmp/B.RTyz6j/BUILD/kernel-4.19.12/linux-4.19/scripts/Makefile.build:304: sound/pci/asihpi/hpicmn.o] Error 1
  • error 112
  • /tmp/B.RTyz6j/BUILD/kernel-4.19.12/linux-4.19/include/uapi/linux/types.h:5:10: fatal error: asm/types.h: No such file or directory
  • error 113
  • compilation terminated.
  • error 114
  • make[5]: *** [/tmp/B.RTyz6j/BUILD/kernel-4.19.12/linux-4.19/scripts/Makefile.build:304: sound/pci/asihpi/hpimsginit.o] Error 1
  • error 115
  • /tmp/B.RTyz6j/BUILD/kernel-4.19.12/linux-4.19/include/uapi/linux/types.h:5:10: fatal error: asm/types.h: No such file or directory
  • error 116
  • compilation terminated.
  • error 117
  • make[5]: *** [/tmp/B.RTyz6j/BUILD/kernel-4.19.12/linux-4.19/scripts/Makefile.build:304: sound/pci/asihpi/hpidebug.o] Error 1
  • error 118
  • /tmp/B.RTyz6j/BUILD/kernel-4.19.12/linux-4.19/include/uapi/linux/types.h:5:10: fatal error: asm/types.h: No such file or directory
  • error 119
  • compilation terminated.
  • error 120
  • make[5]: *** [/tmp/B.RTyz6j/BUILD/kernel-4.19.12/linux-4.19/scripts/Makefile.build:304: sound/pci/asihpi/hpidspcd.o] Error 1
  • error 121
  • /tmp/B.RTyz6j/BUILD/kernel-4.19.12/linux-4.19/include/uapi/linux/types.h:5:10: fatal error: asm/types.h: No such file or directory
  • error 122
  • compilation terminated.
  • error 123
  • make[5]: *** [/tmp/B.RTyz6j/BUILD/kernel-4.19.12/linux-4.19/scripts/Makefile.build:304: sound/pci/asihpi/hpifunc.o] Error 1
  • error 124
  • /tmp/B.RTyz6j/BUILD/kernel-4.19.12/linux-4.19/include/uapi/linux/types.h:5:10: fatal error: asm/types.h: No such file or directory
  • error 125
  • compilation terminated.
  • error 126
  • make[5]: *** [/tmp/B.RTyz6j/BUILD/kernel-4.19.12/linux-4.19/scripts/Makefile.build:304: sound/pci/asihpi/hpios.o] Error 1
  • error 127
  • make[4]: *** [/tmp/B.RTyz6j/BUILD/kernel-4.19.12/linux-4.19/scripts/Makefile.build:544: sound/pci/asihpi] Error 2
  • error 128
  • make[3]: *** [/tmp/B.RTyz6j/BUILD/kernel-4.19.12/linux-4.19/scripts/Makefile.build:544: sound/pci] Error 2
  • error 129
  • make[2]: *** [/tmp/B.RTyz6j/BUILD/kernel-4.19.12/linux-4.19/Makefile:1052: sound] Error 2
  • error 130
  • make[1]: *** [Makefile:146: sub-make] Error 2

Content:

  CC [M]  sound/firewire/bebob/bebob_midi.o
  CC [M]  drivers/ata/pata_hpt3x2n.o
  CC [M]  drivers/block/aoe/aoeblk.o
  CC [M]  sound/firewire/bebob/bebob_pcm.o
  CC [M]  drivers/ata/pata_hpt3x3.o
  CC [M]  drivers/block/aoe/aoechr.o
  CC [M]  sound/firewire/bebob/bebob_hwdep.o
  CC [M]  drivers/ata/pata_it8213.o
  CC [M]  sound/firewire/bebob/bebob_terratec.o
  CC [M]  sound/firewire/bebob/bebob_yamaha_terratec.o
  CC [M]  drivers/ata/pata_it821x.o
  CC [M]  drivers/block/aoe/aoecmd.o
  CC [M]  sound/firewire/bebob/bebob_focusrite.o
  CC [M]  drivers/ata/pata_jmicron.o
  CC [M]  drivers/block/drbd/drbd_receiver.o
  CC [M]  drivers/block/aoe/aoedev.o
  CC [M]  sound/firewire/bebob/bebob_maudio.o
  CC [M]  drivers/ata/pata_marvell.o
  CC [M]  drivers/block/aoe/aoemain.o
  CC [M]  sound/firewire/bebob/bebob.o
  LD [M]  sound/firewire/bebob/snd-bebob.o
  CC [M]  drivers/ata/pata_netcell.o
  CC [M]  drivers/block/aoe/aoenet.o
  LD [M]  drivers/block/aoe/aoe.o
  CC [M]  sound/firewire/fireface/ff.o
  CC [M]  sound/firewire/fireface/ff-transaction.o
  CC [M]  sound/firewire/fireface/ff-midi.o
  CC [M]  sound/firewire/fireface/ff-proc.o
  CC [M]  sound/firewire/fireface/amdtp-ff.o
  CC [M]  sound/firewire/fireface/ff-stream.o
  CC [M]  sound/firewire/fireface/ff-pcm.o
  CC [M]  sound/firewire/fireface/ff-hwdep.o
  CC [M]  sound/firewire/fireface/ff-protocol-ff400.o
  LD [M]  sound/firewire/fireface/snd-fireface.o
  CC [M]  sound/firewire/digi00x/amdtp-dot.o
  CC [M]  fs/dlm/dir.o
  CC [M]  sound/hda/hdac_controller.o
  CC [M]  sound/firewire/digi00x/digi00x-proc.o
  CC [M]  sound/firewire/digi00x/digi00x-stream.o
  CC [M]  sound/hda/hdac_stream.o
  CC [M]  sound/firewire/digi00x/digi00x-pcm.o
  CC [M]  sound/i2c/other/ak4117.o
  CC [M]  sound/hda/array.o
  CC [M]  sound/firewire/digi00x/digi00x-hwdep.o
  CC [M]  sound/i2c/other/ak4xxx-adda.o
  CC [M]  sound/firewire/digi00x/digi00x-transaction.o
  CC [M]  sound/hda/hdmi_chmap.o
  CC [M]  sound/firewire/digi00x/digi00x-midi.o
  CC [M]  sound/i2c/other/ak4114.o
  CC [M]  sound/hda/trace.o
  CC [M]  sound/firewire/digi00x/digi00x.o
  LD [M]  sound/firewire/digi00x/snd-firewire-digi00x.o
  CC [M]  sound/i2c/other/ak4113.o
  LD [M]  sound/i2c/other/snd-ak4xxx-adda.o
  CC [M]  sound/hda/hdac_component.o
  CC [M]  sound/firewire/fireworks/fireworks_transaction.o
  CC [M]  sound/i2c/other/pt2258.o
  LD [M]  sound/i2c/other/snd-ak4117.o
  LD [M]  sound/i2c/other/snd-ak4114.o
  LD [M]  sound/i2c/other/snd-ak4113.o
  LD [M]  sound/i2c/other/snd-pt2258.o
  CC [M]  sound/hda/hdac_i915.o
  LD [M]  sound/hda/snd-hda-core.o
  CC [M]  fs/dlm/lock.o
  CC [M]  drivers/auxdisplay/cfag12864bfb.o
  CC [M]  drivers/auxdisplay/hd44780.o
  CC [M]  sound/i2c/i2c.o
  CC [M]  sound/i2c/cs8427.o
  LD [M]  sound/i2c/snd-cs8427.o
  LD [M]  sound/i2c/snd-i2c.o
  CC [M]  fs/ecryptfs/crypto.o
  CC [M]  drivers/ata/pata_ninja32.o
  CC [M]  sound/firewire/fireworks/fireworks_command.o
  CC [M]  fs/dlm/lockspace.o
  CC [M]  drivers/auxdisplay/panel.o
  AR      drivers/auxdisplay/built-in.a
  CC [M]  drivers/block/drbd/drbd_req.o
  CC [M]  fs/ecryptfs/kthread.o
  CC [M]  drivers/ata/pata_ns87415.o
  CC [M]  sound/isa/sb/sb_common.o
  CC [M]  fs/dlm/main.o
  CC [M]  fs/ecryptfs/keystore.o
  CC [M]  fs/dlm/memory.o
  CC [M]  fs/dlm/member.o
  CC [M]  drivers/ata/pata_oldpiix.o
  CC [M]  sound/isa/sb/sb_mixer.o
  CC [M]  drivers/block/rsxx/config.o
  LD [M]  sound/isa/sb/snd-sb-common.o
  CC [M]  fs/ecryptfs/debug.o
  CC [M]  fs/dlm/midcomms.o
  CC [M]  drivers/block/drbd/drbd_actlog.o
  CC [M]  drivers/ata/pata_optidma.o
  CC [M]  drivers/block/rsxx/core.o
  CC [M]  drivers/block/xen-blkback/blkback.o
  CC [M]  fs/dlm/netlink.o
  CC [M]  fs/ecryptfs/messaging.o
  CC [M]  drivers/ata/pata_pdc2027x.o
Terminated
ended at: Thu Dec 27 01:40:12 2018, done in 0:05:24.826356
error: No files produced.
+ chmod -R u+rwX /tmp/B.RTyz6j/BUILD
  CC [M]  drivers/block/rsxx/cregs.o
  CC [M]  fs/ecryptfs/miscdev.o
  LD [M]  fs/ecryptfs/ecryptfs.o
  CC [M]  drivers/block/xen-blkback/xenbus.o
  LD [M]  drivers/block/xen-blkback/xen-blkback.o
  CC [M]  sound/firewire/fireworks/fireworks_stream.o
  CC [M]  drivers/block/rsxx/dev.o
  CC [M]  fs/dlm/lowcomms.o
  CC [M]  fs/dlm/plock.o
+ rm -rf /tmp/B.RTyz6j/tmp /tmp/B.RTyz6j/BUILD
  CC [M]  drivers/ata/pata_pdc202xx_old.o
  CC [M]  drivers/block/rsxx/dma.o
  CC [M]  drivers/ata/pata_radisys.o
  CC [M]  drivers/ata/pata_rdc.o
  LD [M]  drivers/block/rsxx/rsxx.o
  CC [M]  sound/firewire/fireworks/fireworks_proc.o
  CC [M]  fs/dlm/rcom.o
  CC [M]  sound/firewire/fireworks/fireworks_midi.o
  CC [M]  drivers/ata/pata_sch.o
  CC [M]  drivers/ata/pata_serverworks.o
  CC [M]  drivers/block/drbd/drbd_main.o
  CC [M]  drivers/block/drbd/drbd_strings.o
  CC [M]  drivers/ata/pata_piccolo.o
fixdep: error opening file: /tmp/B.RTyz6j/BUILD/kernel-4.19.12/linux-4.19/arch/x86/include/uapi/asm/types.h: No such file or directory
make[4]: *** [/tmp/B.RTyz6j/BUILD/kernel-4.19.12/linux-4.19/scripts/Makefile.build:309: drivers/ata/pata_piccolo.o] Error 2
make[4]: *** Waiting for unfinished jobs....
  CC [M]  drivers/ata/pata_triflex.o
In file included from /tmp/B.RTyz6j/BUILD/kernel-4.19.12/linux-4.19/include/linux/pci.h:31,
                 from /tmp/B.RTyz6j/BUILD/kernel-4.19.12/linux-4.19/drivers/ata/pata_triflex.c:38:
/tmp/B.RTyz6j/BUILD/kernel-4.19.12/linux-4.19/include/linux/device.h:29:10: fatal error: asm/device.h: No such file or directory
 #include <asm/device.h>
          ^~~~~~~~~~~~~~
compilation terminated.
make[4]: *** [/tmp/B.RTyz6j/BUILD/kernel-4.19.12/linux-4.19/scripts/Makefile.build:309: drivers/ata/pata_triflex.o] Error 1
  CC [M]  sound/firewire/fireworks/fireworks_pcm.o
In file included from /tmp/B.RTyz6j/BUILD/kernel-4.19.12/linux-4.19/include/linux/uaccess.h:14,
                 from /tmp/B.RTyz6j/BUILD/kernel-4.19.12/linux-4.19/include/linux/compat.h:19,
                 from /tmp/B.RTyz6j/BUILD/kernel-4.19.12/linux-4.19/sound/firewire/fireworks/./fireworks.h:12,
                 from /tmp/B.RTyz6j/BUILD/kernel-4.19.12/linux-4.19/sound/firewire/fireworks/fireworks_pcm.c:9:
/tmp/B.RTyz6j/BUILD/kernel-4.19.12/linux-4.19/arch/x86/include/asm/uaccess.h:13:10: fatal error: asm/extable.h: No such file or directory
 #include <asm/extable.h>
          ^~~~~~~~~~~~~~~
compilation terminated.
make[5]: *** [/tmp/B.RTyz6j/BUILD/kernel-4.19.12/linux-4.19/scripts/Makefile.build:304: sound/firewire/fireworks/fireworks_pcm.o] Error 1
make[5]: *** Waiting for unfinished jobs....
  CC [M]  fs/dlm/recover.o
In file included from /tmp/B.RTyz6j/BUILD/kernel-4.19.12/linux-4.19/include/linux/kernel_stat.h:9,
                 from /tmp/B.RTyz6j/BUILD/kernel-4.19.12/linux-4.19/include/linux/cgroup.h:26,
                 from /tmp/B.RTyz6j/BUILD/kernel-4.19.12/linux-4.19/include/linux/kthread.h:7,
                 from /tmp/B.RTyz6j/BUILD/kernel-4.19.12/linux-4.19/fs/dlm/dlm_internal.h:32,
                 from /tmp/B.RTyz6j/BUILD/kernel-4.19.12/linux-4.19/fs/dlm/recover.c:14:
/tmp/B.RTyz6j/BUILD/kernel-4.19.12/linux-4.19/include/linux/interrupt.h:19:10: fatal error: asm/irq.h: No such file or directory
 #include <asm/irq.h>
          ^~~~~~~~~~~
compilation terminated.
make[4]: *** [/tmp/B.RTyz6j/BUILD/kernel-4.19.12/linux-4.19/scripts/Makefile.build:304: fs/dlm/recover.o] Error 1
make[4]: *** Waiting for unfinished jobs....
  CC [M]  drivers/ata/pata_via.o
In file included from /tmp/B.RTyz6j/BUILD/kernel-4.19.12/linux-4.19/arch/x86/include/asm/cpufeature.h:5,
                 from /tmp/B.RTyz6j/BUILD/kernel-4.19.12/linux-4.19/arch/x86/include/asm/thread_info.h:53,
                 from /tmp/B.RTyz6j/BUILD/kernel-4.19.12/linux-4.19/include/linux/thread_info.h:38,
                 from /tmp/B.RTyz6j/BUILD/kernel-4.19.12/linux-4.19/arch/x86/include/asm/preempt.h:7,
                 from /tmp/B.RTyz6j/BUILD/kernel-4.19.12/linux-4.19/include/linux/preempt.h:81,
                 from /tmp/B.RTyz6j/BUILD/kernel-4.19.12/linux-4.19/include/linux/spinlock.h:51,
                 from /tmp/B.RTyz6j/BUILD/kernel-4.19.12/linux-4.19/include/linux/seqlock.h:36,
                 from /tmp/B.RTyz6j/BUILD/kernel-4.19.12/linux-4.19/include/linux/time.h:6,
                 from /tmp/B.RTyz6j/BUILD/kernel-4.19.12/linux-4.19/include/linux/stat.h:19,
                 from /tmp/B.RTyz6j/BUILD/kernel-4.19.12/linux-4.19/include/linux/module.h:10,
                 from /tmp/B.RTyz6j/BUILD/kernel-4.19.12/linux-4.19/drivers/ata/pata_via.c:56:
/tmp/B.RTyz6j/BUILD/kernel-4.19.12/linux-4.19/arch/x86/include/asm/processor.h:24:10: fatal error: asm/special_insns.h: No such file or directory
compilation terminated.
make[4]: *** [/tmp/B.RTyz6j/BUILD/kernel-4.19.12/linux-4.19/scripts/Makefile.build:309: drivers/ata/pata_via.o] Error 1
  CC [M]  sound/firewire/fireworks/fireworks_hwdep.o
In file included from /tmp/B.RTyz6j/BUILD/kernel-4.19.12/linux-4.19/include/linux/types.h:6,
                 from /tmp/B.RTyz6j/BUILD/kernel-4.19.12/linux-4.19/include/linux/compat.h:9,
                 from /tmp/B.RTyz6j/BUILD/kernel-4.19.12/linux-4.19/sound/firewire/fireworks/fireworks.h:12,
                 from /tmp/B.RTyz6j/BUILD/kernel-4.19.12/linux-4.19/sound/firewire/fireworks/fireworks_hwdep.c:20:
/tmp/B.RTyz6j/BUILD/kernel-4.19.12/linux-4.19/include/uapi/linux/types.h:5:10: fatal error: asm/types.h: No such file or directory
 #include <asm/types.h>
          ^~~~~~~~~~~~~
compilation terminated.
make[5]: *** [/tmp/B.RTyz6j/BUILD/kernel-4.19.12/linux-4.19/scripts/Makefile.build:304: sound/firewire/fireworks/fireworks_hwdep.o] Error 1
  CC [M]  drivers/ata/pata_sil680.o
make[4]: *** [/tmp/B.RTyz6j/BUILD/kernel-4.19.12/linux-4.19/scripts/Makefile.build:544: sound/firewire/fireworks] Error 2
  CC [M]  drivers/block/drbd/drbd_nl.o
In file included from /tmp/B.RTyz6j/BUILD/kernel-4.19.12/linux-4.19/include/linux/types.h:6,
                 from /tmp/B.RTyz6j/BUILD/kernel-4.19.12/linux-4.19/include/linux/list.h:5,
                 from /tmp/B.RTyz6j/BUILD/kernel-4.19.12/linux-4.19/include/linux/module.h:9,
                 from /tmp/B.RTyz6j/BUILD/kernel-4.19.12/linux-4.19/drivers/block/drbd/drbd_nl.c:28:
/tmp/B.RTyz6j/BUILD/kernel-4.19.12/linux-4.19/include/uapi/linux/types.h:5:10: fatal error: asm/types.h: No such file or directory
 #include <asm/types.h>
          ^~~~~~~~~~~~~
compilation terminated.
make[5]: *** [/tmp/B.RTyz6j/BUILD/kernel-4.19.12/linux-4.19/scripts/Makefile.build:303: drivers/block/drbd/drbd_nl.o] Error 1
make[5]: *** Waiting for unfinished jobs....
  CC [M]  fs/dlm/recoverd.o
In file included from /tmp/B.RTyz6j/BUILD/kernel-4.19.12/linux-4.19/include/linux/mmdebug.h:5,
                 from /tmp/B.RTyz6j/BUILD/kernel-4.19.12/linux-4.19/include/linux/gfp.h:5,
                 from /tmp/B.RTyz6j/BUILD/kernel-4.19.12/linux-4.19/include/linux/slab.h:15,
                 from /tmp/B.RTyz6j/BUILD/kernel-4.19.12/linux-4.19/fs/dlm/dlm_internal.h:21,
                 from /tmp/B.RTyz6j/BUILD/kernel-4.19.12/linux-4.19/fs/dlm/recoverd.c:14:
/tmp/B.RTyz6j/BUILD/kernel-4.19.12/linux-4.19/include/linux/bug.h:5:10: fatal error: asm/bug.h: No such file or directory
 #include <asm/bug.h>
          ^~~~~~~~~~~
compilation terminated.
make[4]: *** [/tmp/B.RTyz6j/BUILD/kernel-4.19.12/linux-4.19/scripts/Makefile.build:304: fs/dlm/recoverd.o] Error 1
make[3]: *** [/tmp/B.RTyz6j/BUILD/kernel-4.19.12/linux-4.19/scripts/Makefile.build:544: fs/dlm] Error 2
make[2]: *** [/tmp/B.RTyz6j/BUILD/kernel-4.19.12/linux-4.19/Makefile:1052: fs] Error 2
make[2]: *** Waiting for unfinished jobs....
make[3]: *** [/tmp/B.RTyz6j/BUILD/kernel-4.19.12/linux-4.19/scripts/Makefile.build:544: sound/firewire] Error 2
make[3]: *** Waiting for unfinished jobs....
  CC [M]  drivers/block/drbd/drbd_interval.o
/tmp/B.RTyz6j/BUILD/kernel-4.19.12/linux-4.19/drivers/block/drbd/drbd_interval.c:2:10: fatal error: asm/bug.h: No such file or directory
 #include <asm/bug.h>
          ^~~~~~~~~~~
compilation terminated.
make[5]: *** [/tmp/B.RTyz6j/BUILD/kernel-4.19.12/linux-4.19/scripts/Makefile.build:303: drivers/block/drbd/drbd_interval.o] Error 1
  CC      kernel/kexec_file.o
  CC [M]  drivers/ata/pata_sis.o
In file included from /tmp/B.RTyz6j/BUILD/kernel-4.19.12/linux-4.19/include/linux/kernel.h:7,
                 from /tmp/B.RTyz6j/BUILD/kernel-4.19.12/linux-4.19/drivers/ata/pata_sis.c:26:
/tmp/B.RTyz6j/BUILD/kernel-4.19.12/linux-4.19/include/linux/linkage.h:8:10: fatal error: asm/linkage.h: No such file or directory
 #include <asm/linkage.h>
          ^~~~~~~~~~~~~~~
compilation terminated.
make[3]: *** [/tmp/B.RTyz6j/BUILD/kernel-4.19.12/linux-4.19/scripts/Makefile.build:544: drivers/ata] Error 2
make[3]: *** Waiting for unfinished jobs....
  CC [M]  drivers/block/drbd/drbd_state.o
In file included from /tmp/B.RTyz6j/BUILD/kernel-4.19.12/linux-4.19/include/linux/types.h:6,
                 from /tmp/B.RTyz6j/BUILD/kernel-4.19.12/linux-4.19/include/linux/atomic.h:5,
                 from /tmp/B.RTyz6j/BUILD/kernel-4.19.12/linux-4.19/include/linux/crypto.h:20,
                 from /tmp/B.RTyz6j/BUILD/kernel-4.19.12/linux-4.19/include/crypto/hash.h:16,
                 from /tmp/B.RTyz6j/BUILD/kernel-4.19.12/linux-4.19/drivers/block/drbd/drbd_int.h:29,
                 from /tmp/B.RTyz6j/BUILD/kernel-4.19.12/linux-4.19/drivers/block/drbd/drbd_state.c:29:
/tmp/B.RTyz6j/BUILD/kernel-4.19.12/linux-4.19/include/uapi/linux/types.h:5:10: fatal error: asm/types.h: No such file or directory
 #include <asm/types.h>
          ^~~~~~~~~~~~~
compilation terminated.
make[5]: *** [/tmp/B.RTyz6j/BUILD/kernel-4.19.12/linux-4.19/scripts/Makefile.build:303: drivers/block/drbd/drbd_state.o] Error 1
make[4]: *** [/tmp/B.RTyz6j/BUILD/kernel-4.19.12/linux-4.19/scripts/Makefile.build:544: drivers/block/drbd] Error 2
make[4]: *** Waiting for unfinished jobs....
  CC      kernel/compat.o
In file included from /tmp/B.RTyz6j/BUILD/kernel-4.19.12/linux-4.19/include/linux/compiler.h:169,
                 from /tmp/B.RTyz6j/BUILD/kernel-4.19.12/linux-4.19/include/linux/export.h:45,
                 from /tmp/B.RTyz6j/BUILD/kernel-4.19.12/linux-4.19/include/linux/linkage.h:7,
                 from /tmp/B.RTyz6j/BUILD/kernel-4.19.12/linux-4.19/kernel/compat.c:14:
/tmp/B.RTyz6j/BUILD/kernel-4.19.12/linux-4.19/include/uapi/linux/types.h:5:10: fatal error: asm/types.h: No such file or directory
 #include <asm/types.h>
          ^~~~~~~~~~~~~
compilation terminated.
make[3]: *** [/tmp/B.RTyz6j/BUILD/kernel-4.19.12/linux-4.19/scripts/Makefile.build:303: kernel/compat.o] Error 1
make[3]: *** Waiting for unfinished jobs....
  CC      drivers/block/brd.o
In file included from /tmp/B.RTyz6j/BUILD/kernel-4.19.12/linux-4.19/include/linux/compiler.h:169,
                 from /tmp/B.RTyz6j/BUILD/kernel-4.19.12/linux-4.19/include/linux/init.h:5,
                 from /tmp/B.RTyz6j/BUILD/kernel-4.19.12/linux-4.19/drivers/block/brd.c:11:
/tmp/B.RTyz6j/BUILD/kernel-4.19.12/linux-4.19/include/uapi/linux/types.h:5:10: fatal error: asm/types.h: No such file or directory
 #include <asm/types.h>
          ^~~~~~~~~~~~~
compilation terminated.
make[4]: *** [/tmp/B.RTyz6j/BUILD/kernel-4.19.12/linux-4.19/scripts/Makefile.build:304: drivers/block/brd.o] Error 1
  CC [M]  sound/pci/ac97/ac97_codec.o
In file included from /tmp/B.RTyz6j/BUILD/kernel-4.19.12/linux-4.19/include/linux/compiler.h:169,
                 from /tmp/B.RTyz6j/BUILD/kernel-4.19.12/linux-4.19/include/linux/export.h:45,
                 from /tmp/B.RTyz6j/BUILD/kernel-4.19.12/linux-4.19/include/linux/linkage.h:7,
                 from /tmp/B.RTyz6j/BUILD/kernel-4.19.12/linux-4.19/include/linux/kernel.h:7,
                 from /tmp/B.RTyz6j/BUILD/kernel-4.19.12/linux-4.19/include/linux/delay.h:22,
                 from /tmp/B.RTyz6j/BUILD/kernel-4.19.12/linux-4.19/sound/pci/ac97/ac97_codec.c:25:
/tmp/B.RTyz6j/BUILD/kernel-4.19.12/linux-4.19/include/uapi/linux/types.h:5:10: fatal error: asm/types.h: No such file or directory
 #include <asm/types.h>
          ^~~~~~~~~~~~~
compilation terminated.
make[5]: *** [/tmp/B.RTyz6j/BUILD/kernel-4.19.12/linux-4.19/scripts/Makefile.build:303: sound/pci/ac97/ac97_codec.o] Error 1
make[5]: *** Waiting for unfinished jobs....
  CC [M]  sound/pci/ali5451/ali5451.o
In file included from /tmp/B.RTyz6j/BUILD/kernel-4.19.12/linux-4.19/include/linux/types.h:6,
                 from /tmp/B.RTyz6j/BUILD/kernel-4.19.12/linux-4.19/include/linux/io.h:21,
                 from /tmp/B.RTyz6j/BUILD/kernel-4.19.12/linux-4.19/sound/pci/ali5451/ali5451.c:28:
/tmp/B.RTyz6j/BUILD/kernel-4.19.12/linux-4.19/include/uapi/linux/types.h:5:10: fatal error: asm/types.h: No such file or directory
 #include <asm/types.h>
          ^~~~~~~~~~~~~
compilation terminated.
make[5]: *** [/tmp/B.RTyz6j/BUILD/kernel-4.19.12/linux-4.19/scripts/Makefile.build:304: sound/pci/ali5451/ali5451.o] Error 1
  CC      kernel/utsname.o
In file included from /tmp/B.RTyz6j/BUILD/kernel-4.19.12/linux-4.19/include/linux/compiler.h:169,
                 from /tmp/B.RTyz6j/BUILD/kernel-4.19.12/linux-4.19/include/linux/export.h:45,
                 from /tmp/B.RTyz6j/BUILD/kernel-4.19.12/linux-4.19/kernel/utsname.c:12:
/tmp/B.RTyz6j/BUILD/kernel-4.19.12/linux-4.19/include/uapi/linux/types.h:5:10: fatal error: asm/types.h: No such file or directory
 #include <asm/types.h>
          ^~~~~~~~~~~~~
compilation terminated.
make[3]: *** [/tmp/B.RTyz6j/BUILD/kernel-4.19.12/linux-4.19/scripts/Makefile.build:303: kernel/utsname.o] Error 1
make[4]: *** [/tmp/B.RTyz6j/BUILD/kernel-4.19.12/linux-4.19/scripts/Makefile.build:544: sound/pci/ali5451] Error 2
make[4]: *** Waiting for unfinished jobs....
  CC [M]  drivers/block/paride/aten.o
x86_64-pld-linux-gcc: error: /tmp/B.RTyz6j/BUILD/kernel-4.19.12/linux-4.19/drivers/block/paride/aten.c: No such file or directory
x86_64-pld-linux-gcc: fatal error: no input files
compilation terminated.
make[4]: *** [/tmp/B.RTyz6j/BUILD/kernel-4.19.12/linux-4.19/scripts/Makefile.build:309: drivers/block/paride/aten.o] Error 1
make[4]: *** Waiting for unfinished jobs....
  CC [M]  drivers/block/zram/zcomp.o
In file included from /tmp/B.RTyz6j/BUILD/kernel-4.19.12/linux-4.19/include/linux/compiler.h:169,
                 from /tmp/B.RTyz6j/BUILD/kernel-4.19.12/linux-4.19/include/linux/export.h:45,
                 from /tmp/B.RTyz6j/BUILD/kernel-4.19.12/linux-4.19/include/linux/linkage.h:7,
                 from /tmp/B.RTyz6j/BUILD/kernel-4.19.12/linux-4.19/include/linux/kernel.h:7,
                 from /tmp/B.RTyz6j/BUILD/kernel-4.19.12/linux-4.19/drivers/block/zram/zcomp.c:10:
/tmp/B.RTyz6j/BUILD/kernel-4.19.12/linux-4.19/include/uapi/linux/types.h:5:10: fatal error: asm/types.h: No such file or directory
 #include <asm/types.h>
          ^~~~~~~~~~~~~
compilation terminated.
make[5]: *** [/tmp/B.RTyz6j/BUILD/kernel-4.19.12/linux-4.19/scripts/Makefile.build:304: drivers/block/zram/zcomp.o] Error 1
make[5]: *** Waiting for unfinished jobs....
  CC [M]  drivers/block/zram/zram_drv.o
cc1: fatal error: /tmp/B.RTyz6j/BUILD/kernel-4.19.12/linux-4.19/drivers/block/zram/zram_drv.c: No such file or directory
compilation terminated.
make[5]: *** [/tmp/B.RTyz6j/BUILD/kernel-4.19.12/linux-4.19/scripts/Makefile.build:304: drivers/block/zram/zram_drv.o] Error 1
make[4]: *** [/tmp/B.RTyz6j/BUILD/kernel-4.19.12/linux-4.19/scripts/Makefile.build:544: drivers/block/zram] Error 2
make[3]: *** [/tmp/B.RTyz6j/BUILD/kernel-4.19.12/linux-4.19/scripts/Makefile.build:544: drivers/block] Error 2
  CC [M]  drivers/block/paride/paride.o
cc1: fatal error: /tmp/B.RTyz6j/BUILD/kernel-4.19.12/linux-4.19/drivers/block/paride/paride.c: No such file or directory
compilation terminated.
make[4]: *** [/tmp/B.RTyz6j/BUILD/kernel-4.19.12/linux-4.19/scripts/Makefile.build:309: drivers/block/paride/paride.o] Error 1
make[3]: *** [/tmp/B.RTyz6j/BUILD/kernel-4.19.12/linux-4.19/scripts/Makefile.build:544: drivers/block/paride] Error 2
make[2]: *** [/tmp/B.RTyz6j/BUILD/kernel-4.19.12/linux-4.19/Makefile:1052: drivers] Error 2
  CC      kernel/user_namespace.o
In file included from /tmp/B.RTyz6j/BUILD/kernel-4.19.12/linux-4.19/include/linux/compiler.h:169,
                 from /tmp/B.RTyz6j/BUILD/kernel-4.19.12/linux-4.19/include/linux/export.h:45,
                 from /tmp/B.RTyz6j/BUILD/kernel-4.19.12/linux-4.19/kernel/user_namespace.c:8:
/tmp/B.RTyz6j/BUILD/kernel-4.19.12/linux-4.19/include/uapi/linux/types.h:5:10: fatal error: asm/types.h: No such file or directory
 #include <asm/types.h>
          ^~~~~~~~~~~~~
compilation terminated.
make[3]: *** [/tmp/B.RTyz6j/BUILD/kernel-4.19.12/linux-4.19/scripts/Makefile.build:303: kernel/user_namespace.o] Error 1
make[2]: *** [/tmp/B.RTyz6j/BUILD/kernel-4.19.12/linux-4.19/Makefile:1052: kernel] Error 2
  CC [M]  sound/pci/ac97/ac97_pcm.o
In file included from /tmp/B.RTyz6j/BUILD/kernel-4.19.12/linux-4.19/include/linux/compiler.h:169,
                 from /tmp/B.RTyz6j/BUILD/kernel-4.19.12/linux-4.19/include/linux/export.h:45,
                 from /tmp/B.RTyz6j/BUILD/kernel-4.19.12/linux-4.19/include/linux/linkage.h:7,
                 from /tmp/B.RTyz6j/BUILD/kernel-4.19.12/linux-4.19/include/linux/kernel.h:7,
                 from /tmp/B.RTyz6j/BUILD/kernel-4.19.12/linux-4.19/include/linux/delay.h:22,
                 from /tmp/B.RTyz6j/BUILD/kernel-4.19.12/linux-4.19/sound/pci/ac97/ac97_pcm.c:26:
/tmp/B.RTyz6j/BUILD/kernel-4.19.12/linux-4.19/include/uapi/linux/types.h:5:10: fatal error: asm/types.h: No such file or directory
 #include <asm/types.h>
          ^~~~~~~~~~~~~
compilation terminated.
make[5]: *** [/tmp/B.RTyz6j/BUILD/kernel-4.19.12/linux-4.19/scripts/Makefile.build:303: sound/pci/ac97/ac97_pcm.o] Error 1
make[4]: *** [/tmp/B.RTyz6j/BUILD/kernel-4.19.12/linux-4.19/scripts/Makefile.build:544: sound/pci/ac97] Error 2
  CC [M]  sound/pcmcia/pdaudiocf/pdaudiocf_irq.o
In file included from /tmp/B.RTyz6j/BUILD/kernel-4.19.12/linux-4.19/include/linux/compiler.h:169,
                 from /tmp/B.RTyz6j/BUILD/kernel-4.19.12/linux-4.19/include/linux/ioport.h:13,
                 from /tmp/B.RTyz6j/BUILD/kernel-4.19.12/linux-4.19/include/linux/device.h:15,
                 from /tmp/B.RTyz6j/BUILD/kernel-4.19.12/linux-4.19/include/sound/core.h:25,
                 from /tmp/B.RTyz6j/BUILD/kernel-4.19.12/linux-4.19/sound/pcmcia/pdaudiocf/pdaudiocf_irq.c:21:
/tmp/B.RTyz6j/BUILD/kernel-4.19.12/linux-4.19/include/uapi/linux/types.h:5:10: fatal error: asm/types.h: No such file or directory
 #include <asm/types.h>
          ^~~~~~~~~~~~~
compilation terminated.
make[5]: *** [/tmp/B.RTyz6j/BUILD/kernel-4.19.12/linux-4.19/scripts/Makefile.build:304: sound/pcmcia/pdaudiocf/pdaudiocf_irq.o] Error 1
make[5]: *** Waiting for unfinished jobs....
  CC [M]  sound/pcmcia/pdaudiocf/pdaudiocf.o
In file included from /tmp/B.RTyz6j/BUILD/kernel-4.19.12/linux-4.19/include/linux/compiler.h:169,
                 from /tmp/B.RTyz6j/BUILD/kernel-4.19.12/linux-4.19/include/linux/ioport.h:13,
                 from /tmp/B.RTyz6j/BUILD/kernel-4.19.12/linux-4.19/include/linux/device.h:15,
                 from /tmp/B.RTyz6j/BUILD/kernel-4.19.12/linux-4.19/include/sound/core.h:25,
                 from /tmp/B.RTyz6j/BUILD/kernel-4.19.12/linux-4.19/sound/pcmcia/pdaudiocf/pdaudiocf.c:21:
/tmp/B.RTyz6j/BUILD/kernel-4.19.12/linux-4.19/include/uapi/linux/types.h:5:10: fatal error: asm/types.h: No such file or directory
 #include <asm/types.h>
          ^~~~~~~~~~~~~
compilation terminated.
make[5]: *** [/tmp/B.RTyz6j/BUILD/kernel-4.19.12/linux-4.19/scripts/Makefile.build:304: sound/pcmcia/pdaudiocf/pdaudiocf.o] Error 1
  CC [M]  sound/pcmcia/pdaudiocf/pdaudiocf_pcm.o
In file included from /tmp/B.RTyz6j/BUILD/kernel-4.19.12/linux-4.19/include/linux/compiler.h:169,
                 from /tmp/B.RTyz6j/BUILD/kernel-4.19.12/linux-4.19/include/linux/export.h:45,
                 from /tmp/B.RTyz6j/BUILD/kernel-4.19.12/linux-4.19/include/linux/linkage.h:7,
                 from /tmp/B.RTyz6j/BUILD/kernel-4.19.12/linux-4.19/include/linux/kernel.h:7,
                 from /tmp/B.RTyz6j/BUILD/kernel-4.19.12/linux-4.19/include/linux/delay.h:22,
                 from /tmp/B.RTyz6j/BUILD/kernel-4.19.12/linux-4.19/sound/pcmcia/pdaudiocf/pdaudiocf_pcm.c:23:
/tmp/B.RTyz6j/BUILD/kernel-4.19.12/linux-4.19/include/uapi/linux/types.h:5:10: fatal error: asm/types.h: No such file or directory
 #include <asm/types.h>
          ^~~~~~~~~~~~~
compilation terminated.
make[5]: *** [/tmp/B.RTyz6j/BUILD/kernel-4.19.12/linux-4.19/scripts/Makefile.build:304: sound/pcmcia/pdaudiocf/pdaudiocf_pcm.o] Error 1
  CC [M]  sound/pcmcia/pdaudiocf/pdaudiocf_core.o
In file included from /tmp/B.RTyz6j/BUILD/kernel-4.19.12/linux-4.19/include/linux/compiler.h:169,
                 from /tmp/B.RTyz6j/BUILD/kernel-4.19.12/linux-4.19/include/linux/export.h:45,
                 from /tmp/B.RTyz6j/BUILD/kernel-4.19.12/linux-4.19/include/linux/linkage.h:7,
                 from /tmp/B.RTyz6j/BUILD/kernel-4.19.12/linux-4.19/include/linux/kernel.h:7,
                 from /tmp/B.RTyz6j/BUILD/kernel-4.19.12/linux-4.19/include/linux/delay.h:22,
                 from /tmp/B.RTyz6j/BUILD/kernel-4.19.12/linux-4.19/sound/pcmcia/pdaudiocf/pdaudiocf_core.c:21:
/tmp/B.RTyz6j/BUILD/kernel-4.19.12/linux-4.19/include/uapi/linux/types.h:5:10: fatal error: asm/types.h: No such file or directory
 #include <asm/types.h>
          ^~~~~~~~~~~~~
compilation terminated.
make[5]: *** [/tmp/B.RTyz6j/BUILD/kernel-4.19.12/linux-4.19/scripts/Makefile.build:304: sound/pcmcia/pdaudiocf/pdaudiocf_core.o] Error 1
make[4]: *** [/tmp/B.RTyz6j/BUILD/kernel-4.19.12/linux-4.19/scripts/Makefile.build:544: sound/pcmcia/pdaudiocf] Error 2
make[4]: *** Waiting for unfinished jobs....
  CC [M]  sound/pcmcia/vx/vxpocket.o
In file included from /tmp/B.RTyz6j/BUILD/kernel-4.19.12/linux-4.19/include/linux/compiler.h:169,
                 from /tmp/B.RTyz6j/BUILD/kernel-4.19.12/linux-4.19/include/linux/init.h:5,
                 from /tmp/B.RTyz6j/BUILD/kernel-4.19.12/linux-4.19/sound/pcmcia/vx/vxpocket.c:22:
/tmp/B.RTyz6j/BUILD/kernel-4.19.12/linux-4.19/include/uapi/linux/types.h:5:10: fatal error: asm/types.h: No such file or directory
 #include <asm/types.h>
          ^~~~~~~~~~~~~
compilation terminated.
make[5]: *** [/tmp/B.RTyz6j/BUILD/kernel-4.19.12/linux-4.19/scripts/Makefile.build:304: sound/pcmcia/vx/vxpocket.o] Error 1
make[5]: *** Waiting for unfinished jobs....
  CC [M]  sound/pcmcia/vx/vxp_mixer.o
In file included from /tmp/B.RTyz6j/BUILD/kernel-4.19.12/linux-4.19/include/linux/compiler.h:169,
                 from /tmp/B.RTyz6j/BUILD/kernel-4.19.12/linux-4.19/include/linux/ioport.h:13,
                 from /tmp/B.RTyz6j/BUILD/kernel-4.19.12/linux-4.19/include/linux/device.h:15,
                 from /tmp/B.RTyz6j/BUILD/kernel-4.19.12/linux-4.19/include/sound/core.h:25,
                 from /tmp/B.RTyz6j/BUILD/kernel-4.19.12/linux-4.19/sound/pcmcia/vx/vxp_mixer.c:23:
/tmp/B.RTyz6j/BUILD/kernel-4.19.12/linux-4.19/include/uapi/linux/types.h:5:10: fatal error: asm/types.h: No such file or directory
 #include <asm/types.h>
          ^~~~~~~~~~~~~
compilation terminated.
make[5]: *** [/tmp/B.RTyz6j/BUILD/kernel-4.19.12/linux-4.19/scripts/Makefile.build:304: sound/pcmcia/vx/vxp_mixer.o] Error 1
  CC [M]  sound/pcmcia/vx/vxp_ops.o
In file included from /tmp/B.RTyz6j/BUILD/kernel-4.19.12/linux-4.19/include/linux/compiler.h:169,
                 from /tmp/B.RTyz6j/BUILD/kernel-4.19.12/linux-4.19/include/linux/export.h:45,
                 from /tmp/B.RTyz6j/BUILD/kernel-4.19.12/linux-4.19/include/linux/linkage.h:7,
                 from /tmp/B.RTyz6j/BUILD/kernel-4.19.12/linux-4.19/include/linux/kernel.h:7,
                 from /tmp/B.RTyz6j/BUILD/kernel-4.19.12/linux-4.19/include/linux/delay.h:22,
                 from /tmp/B.RTyz6j/BUILD/kernel-4.19.12/linux-4.19/sound/pcmcia/vx/vxp_ops.c:23:
/tmp/B.RTyz6j/BUILD/kernel-4.19.12/linux-4.19/include/uapi/linux/types.h:5:10: fatal error: asm/types.h: No such file or directory
 #include <asm/types.h>
          ^~~~~~~~~~~~~
compilation terminated.
make[5]: *** [/tmp/B.RTyz6j/BUILD/kernel-4.19.12/linux-4.19/scripts/Makefile.build:304: sound/pcmcia/vx/vxp_ops.o] Error 1
make[4]: *** [/tmp/B.RTyz6j/BUILD/kernel-4.19.12/linux-4.19/scripts/Makefile.build:544: sound/pcmcia/vx] Error 2
make[3]: *** [/tmp/B.RTyz6j/BUILD/kernel-4.19.12/linux-4.19/scripts/Makefile.build:544: sound/pcmcia] Error 2
  CC [M]  sound/pci/asihpi/asihpi.o
In file included from /tmp/B.RTyz6j/BUILD/kernel-4.19.12/linux-4.19/include/linux/types.h:6,
                 from /tmp/B.RTyz6j/BUILD/kernel-4.19.12/linux-4.19/sound/pci/asihpi/hpi.h:34,
                 from /tmp/B.RTyz6j/BUILD/kernel-4.19.12/linux-4.19/sound/pci/asihpi/hpi_internal.h:27,
                 from /tmp/B.RTyz6j/BUILD/kernel-4.19.12/linux-4.19/sound/pci/asihpi/asihpi.c:25:
/tmp/B.RTyz6j/BUILD/kernel-4.19.12/linux-4.19/include/uapi/linux/types.h:5:10: fatal error: asm/types.h: No such file or directory
 #include <asm/types.h>
          ^~~~~~~~~~~~~
compilation terminated.
make[5]: *** [/tmp/B.RTyz6j/BUILD/kernel-4.19.12/linux-4.19/scripts/Makefile.build:304: sound/pci/asihpi/asihpi.o] Error 1
make[5]: *** Waiting for unfinished jobs....
  CC [M]  sound/pci/asihpi/hpioctl.o
In file included from /tmp/B.RTyz6j/BUILD/kernel-4.19.12/linux-4.19/include/linux/types.h:6,
                 from /tmp/B.RTyz6j/BUILD/kernel-4.19.12/linux-4.19/sound/pci/asihpi/hpi.h:34,
                 from /tmp/B.RTyz6j/BUILD/kernel-4.19.12/linux-4.19/sound/pci/asihpi/hpi_internal.h:27,
                 from /tmp/B.RTyz6j/BUILD/kernel-4.19.12/linux-4.19/sound/pci/asihpi/hpioctl.c:19:
/tmp/B.RTyz6j/BUILD/kernel-4.19.12/linux-4.19/include/uapi/linux/types.h:5:10: fatal error: asm/types.h: No such file or directory
 #include <asm/types.h>
          ^~~~~~~~~~~~~
compilation terminated.
make[5]: *** [/tmp/B.RTyz6j/BUILD/kernel-4.19.12/linux-4.19/scripts/Makefile.build:304: sound/pci/asihpi/hpioctl.o] Error 1
  CC [M]  sound/pci/asihpi/hpicmn.o
In file included from /tmp/B.RTyz6j/BUILD/kernel-4.19.12/linux-4.19/include/linux/types.h:6,
                 from /tmp/B.RTyz6j/BUILD/kernel-4.19.12/linux-4.19/sound/pci/asihpi/hpi.h:34,
                 from /tmp/B.RTyz6j/BUILD/kernel-4.19.12/linux-4.19/sound/pci/asihpi/hpi_internal.h:27,
                 from /tmp/B.RTyz6j/BUILD/kernel-4.19.12/linux-4.19/sound/pci/asihpi/hpicmn.c:27:
/tmp/B.RTyz6j/BUILD/kernel-4.19.12/linux-4.19/include/uapi/linux/types.h:5:10: fatal error: asm/types.h: No such file or directory
 #include <asm/types.h>
          ^~~~~~~~~~~~~
compilation terminated.
make[5]: *** [/tmp/B.RTyz6j/BUILD/kernel-4.19.12/linux-4.19/scripts/Makefile.build:304: sound/pci/asihpi/hpicmn.o] Error 1
  CC [M]  sound/pci/asihpi/hpimsginit.o
In file included from /tmp/B.RTyz6j/BUILD/kernel-4.19.12/linux-4.19/include/linux/types.h:6,
                 from /tmp/B.RTyz6j/BUILD/kernel-4.19.12/linux-4.19/sound/pci/asihpi/hpi.h:34,
                 from /tmp/B.RTyz6j/BUILD/kernel-4.19.12/linux-4.19/sound/pci/asihpi/hpi_internal.h:27,
                 from /tmp/B.RTyz6j/BUILD/kernel-4.19.12/linux-4.19/sound/pci/asihpi/hpimsginit.c:24:
/tmp/B.RTyz6j/BUILD/kernel-4.19.12/linux-4.19/include/uapi/linux/types.h:5:10: fatal error: asm/types.h: No such file or directory
 #include <asm/types.h>
          ^~~~~~~~~~~~~
compilation terminated.
make[5]: *** [/tmp/B.RTyz6j/BUILD/kernel-4.19.12/linux-4.19/scripts/Makefile.build:304: sound/pci/asihpi/hpimsginit.o] Error 1
  CC [M]  sound/pci/asihpi/hpidebug.o
In file included from /tmp/B.RTyz6j/BUILD/kernel-4.19.12/linux-4.19/include/linux/types.h:6,
                 from /tmp/B.RTyz6j/BUILD/kernel-4.19.12/linux-4.19/sound/pci/asihpi/hpi.h:34,
                 from /tmp/B.RTyz6j/BUILD/kernel-4.19.12/linux-4.19/sound/pci/asihpi/hpi_internal.h:27,
                 from /tmp/B.RTyz6j/BUILD/kernel-4.19.12/linux-4.19/sound/pci/asihpi/hpidebug.c:23:
/tmp/B.RTyz6j/BUILD/kernel-4.19.12/linux-4.19/include/uapi/linux/types.h:5:10: fatal error: asm/types.h: No such file or directory
 #include <asm/types.h>
          ^~~~~~~~~~~~~
compilation terminated.
make[5]: *** [/tmp/B.RTyz6j/BUILD/kernel-4.19.12/linux-4.19/scripts/Makefile.build:304: sound/pci/asihpi/hpidebug.o] Error 1
  CC [M]  sound/pci/asihpi/hpidspcd.o
In file included from /tmp/B.RTyz6j/BUILD/kernel-4.19.12/linux-4.19/include/linux/types.h:6,
                 from /tmp/B.RTyz6j/BUILD/kernel-4.19.12/linux-4.19/sound/pci/asihpi/hpi.h:34,
                 from /tmp/B.RTyz6j/BUILD/kernel-4.19.12/linux-4.19/sound/pci/asihpi/hpi_internal.h:27,
                 from /tmp/B.RTyz6j/BUILD/kernel-4.19.12/linux-4.19/sound/pci/asihpi/hpidspcd.h:28,
                 from /tmp/B.RTyz6j/BUILD/kernel-4.19.12/linux-4.19/sound/pci/asihpi/hpidspcd.c:23:
/tmp/B.RTyz6j/BUILD/kernel-4.19.12/linux-4.19/include/uapi/linux/types.h:5:10: fatal error: asm/types.h: No such file or directory
 #include <asm/types.h>
          ^~~~~~~~~~~~~
compilation terminated.
make[5]: *** [/tmp/B.RTyz6j/BUILD/kernel-4.19.12/linux-4.19/scripts/Makefile.build:304: sound/pci/asihpi/hpidspcd.o] Error 1
  CC [M]  sound/pci/asihpi/hpifunc.o
In file included from /tmp/B.RTyz6j/BUILD/kernel-4.19.12/linux-4.19/include/linux/types.h:6,
                 from /tmp/B.RTyz6j/BUILD/kernel-4.19.12/linux-4.19/sound/pci/asihpi/hpi.h:34,
                 from /tmp/B.RTyz6j/BUILD/kernel-4.19.12/linux-4.19/sound/pci/asihpi/hpi_internal.h:27,
                 from /tmp/B.RTyz6j/BUILD/kernel-4.19.12/linux-4.19/sound/pci/asihpi/hpifunc.c:3:
/tmp/B.RTyz6j/BUILD/kernel-4.19.12/linux-4.19/include/uapi/linux/types.h:5:10: fatal error: asm/types.h: No such file or directory
 #include <asm/types.h>
          ^~~~~~~~~~~~~
compilation terminated.
make[5]: *** [/tmp/B.RTyz6j/BUILD/kernel-4.19.12/linux-4.19/scripts/Makefile.build:304: sound/pci/asihpi/hpifunc.o] Error 1
  CC [M]  sound/pci/asihpi/hpios.o
In file included from /tmp/B.RTyz6j/BUILD/kernel-4.19.12/linux-4.19/include/linux/types.h:6,
                 from /tmp/B.RTyz6j/BUILD/kernel-4.19.12/linux-4.19/sound/pci/asihpi/hpi.h:34,
                 from /tmp/B.RTyz6j/BUILD/kernel-4.19.12/linux-4.19/sound/pci/asihpi/hpi_internal.h:27,
                 from /tmp/B.RTyz6j/BUILD/kernel-4.19.12/linux-4.19/sound/pci/asihpi/hpios.c:24:
/tmp/B.RTyz6j/BUILD/kernel-4.19.12/linux-4.19/include/uapi/linux/types.h:5:10: fatal error: asm/types.h: No such file or directory
 #include <asm/types.h>
          ^~~~~~~~~~~~~
compilation terminated.
make[5]: *** [/tmp/B.RTyz6j/BUILD/kernel-4.19.12/linux-4.19/scripts/Makefile.build:304: sound/pci/asihpi/hpios.o] Error 1
make[4]: *** [/tmp/B.RTyz6j/BUILD/kernel-4.19.12/linux-4.19/scripts/Makefile.build:544: sound/pci/asihpi] Error 2
make[3]: *** [/tmp/B.RTyz6j/BUILD/kernel-4.19.12/linux-4.19/scripts/Makefile.build:544: sound/pci] Error 2
make[2]: *** [/tmp/B.RTyz6j/BUILD/kernel-4.19.12/linux-4.19/Makefile:1052: sound] Error 2
make[1]: *** [Makefile:146: sub-make] Error 2
make: *** [Makefile:9: all] Error 2
+ rm -rf /tmp/B.RTyz6j
Begin-PLD-Builder-Info
Build-Time: user:11.63s sys:9.43s real:350.98s (faults io:0 non-io:158300)

End-PLD-Builder-Info
[Back to list of logs] [View rpm -qa of builder]